{"text_format":"1","workbook":"xlsx","n_sheets":6,"sheets":["Participants","2023-04-12","Template","Settings","Language","Info"],"not_rendered":{"charts":0,"images":2,"macros":1,"external_links":0,"defined_names":0,"comments":0,"pivot_tables":0},"unopened":[],"bounds":{"document_bytes":16777216,"sheet_cells":100000,"rows_first":2000,"rows_last":500,"rows_between":2000,"halvings":0,"cell_chars":16384,"cell_head_chars":4096},"cells_cut":0,"cells_raw":0,"read":"whole","date_system":"1900"}

{"sheet":"Participants","index":0,"n_rows":102,"n_cols":5,"rows_kept":102,"cut":false,"hidden":false,"merged":[]}
[{"$f":"Language!$E$6","v":"Participants"},null,null,{"$f":"Language!$E$7","v":"Starting number"}]
[{"$f":"Language!$E$9","v":"No."},{"$f":"Language!$E$8","v":"ID"},{"$f":"Language!$E$10","v":"Name"},"2023-03-24","2023-04-12"]
["1.","USA","USA",2091.38,2091.4651970069663]
["2.","GER","Germany",2068.12,2058.4664312367008]
["3.","SWE","Sweden",2064.67,2064.67]
["4.","ENG","England",2055.8200000000002,2046.5242459673245]
["5.","FRA","France",2021.02,2021.02]
["6.","CAN","Canada",2001.56,2001.56]
["7.","ESP","Spain",1997.65,1997.65]
["8.","NED","Netherlands",1991.45,1985.5449380847715]
["9.","BRA","Brazil",1972.99,1989.8861632223318]
["10.","AUS","Australia",1917.91,1918.1591355944697]
["11.","JAP","Japan",1917.33,1917.33]
["12.","NOR","Norway",1905.58,1905.58]
["13.","CHN","China",1856.98,1856.98]
["14.","ISL","Iceland",1851.77,1851.77]
["15.","DEN","Denmark",1851.25,1851.25]
["16.","ITA","Italy",1845.93,1845.93]
["17.","KOR","South Korea",1840.68,1840.68]
["18.","AUT","Austria",1808.69,1808.69]
["19.","BEL","Belgium",1804.02,1804.02]
["20.","SUI","Switzerland",1772.27,1772.27]
["21.","POR","Portugal",1752.53,1752.53]
["22.","IRL","Ireland",1742.25,1742.1648029930338]
["23.","SCO","Scotland",1724.17,1737.4800025365216]
["24.","RUS","Russia",1717.06,1717.06]
["25.","NZL","New Zealand",1706.96,1706.96]
["26.","COL","Colombia",1703.61,1703.61]
["27.","CZE","Czechia",1693.91,1693.91]
["28.","ARG","Argentina",1682.45,1682.45]
["29.","FIN","Finland",1654.99,1654.99]
["30.","POL","Poland",1660.91,1663.4017256019517]
["31.","WAL","Wales",1659.76,1659.76]
["32.","UKR","Ukraine",1644.97,1644.97]
["33.","VIE","Vietnam",1643.66,1643.66]
["34.","MEX","Mexiko",1621.8,1621.8]
["35.","SRB","Aerbia",1620.35,1620.35]
["36.","CRC","Costa Rica",1601.47,1593.3773577559286]
["37.","TPE","Chinese Taipei",1573.65,1573.65]
["38.","ROU","Romania",1562.43,1562.43]
["39.","CHI","Chile",1553.22,1553.22]
["40.","SVN","Slovenia",1552.25,1552.25]
["41.","HUN","Hungary",1542.44,1542.44]
["42.","NGA","Nigeria",1540.96,1540.96]
["43.","JAM","Jamaica",1536.81,1536.81]
["44.","THA","Thailand",1527.39,1527.39]
["45.","NIR","Northern Ireland",1526.21,1526.21]
["46.","SVK","Slovalia",1522.13,1522.13]
["47.","MYA","Myanmar",1519.04,1519.04]
["48.","PAR","Paraguay",1503.44,1503.44]
["49.","PHI","Philippines",1496.23,1496.23]
["50.","UZB","Uzbekistan",1491.37,1491.37]
["51.","VEN","Venezuela",1486.32,1486.32]
["52.","PAN","Panama",1482.51,1482.51]
["53.","HAI","Haiti",1478.3,1478.3]
["54.","RSA","South Africa",1471.84,1471.84]
["55.","PNG","Papua New Guinea",1469.52,1469.52]
["56.","CMR","Cameroon",1445.75,1445.75]
["57.","BLR","Belarus",1443.08,1443.08]
["58.","CRO","Croatia",1417.78,1417.78]
["59.","GHA","Ghana",1416.77,1416.77]
["60.","GRE","Greece",1404.31,1404.31]
["61.","IND","India",1391.3,1391.3]
["62.","BIH","Bosnia Herzeg.",1384.15,1384.15]
["63.","TUR","Turkey",1383.24,1383.24]
["64.","CIV","Côte d'Ivoire",1379.39,1379.39]
["65.","ECU","Ecuador",1377.86,1377.86]
["66.","URU","Uruguay",1377.74,1377.74]
["67.","IRN","Iran",1369.02,1369.02]
["68.","JOR","Jordan",1368.74,1368.74]
["69.","ISR","Israel",1360.76,1360.76]
["70.","FIJ","Fiji",1345.58,1345.58]
["71."]
["72."]
["73."]
["74."]
["75."]
["76."]
["77."]
["78."]
["79."]
["80."]
["81."]
["82."]
["83."]
["84."]
["85."]
["86."]
["87."]
["88."]
["89."]
["90."]
["91."]
["92."]
["93."]
["94."]
["95."]
["96."]
["97."]
["98."]
["99."]
["100."]

{"sheet":"2023-04-12","index":1,"n_rows":103,"n_cols":32,"rows_kept":103,"cut":false,"hidden":false,"merged":[[0,8,2,8],[0,9,2,9],[2,6,2,7]]}
[null,{"$f":"Language!$E$11","v":"Ranking"},null,{"$f":"Language!$E$12","v":"Old Date:"},null,{"$f":"Language!$E$13","v":"New Date:"},null,null,{"$f":"Language!$E$20","v":"Weight"},{"$f":"Language!$E$32","v":"Home advant."}]
[null,{"$f":"Language!$E$14","v":"Matches"},null,"2023-03-24","\u009e","2023-04-12",null,null,null,null,null,null,{"$f":"Language!$E$15","v":"New Ranking"},null,null,null,null,"Ranking List unsorted",null,null,null,null,"Matches sorted"]
[null,{"$f":"Language!$E$16","v":"Date"},{"$f":"Language!$E$17","v":"ID 1"},null,{"$f":"Language!$E$18","v":"ID 2"},null,{"$f":"Language!$E$19","v":"Result"},null,null,null,null,null,{"$f":"Language!$E$23","v":"Rank"},null,null,null,null,"ID"]
[null,"2023-04-07","NED",{"$f":"IFERROR(VLOOKUP(C4,Participants!$B$3:$C$102,2,0),\"\")","v":"Netherlands"},"GER",{"$f":"IFERROR(VLOOKUP(E4,Participants!$B$3:$C$102,2,0),\"\")","v":"Germany"},0,1,30,null,null,null,{"$f":"IF(N5<>\"\",ROW()-3,\"\")","v":1},{"$f":"sortieren($S$4:$U$103,2,-1)","v":"USA"},2091.4651970069663,8.5197006966154731E-2,null,"USA","USA",2091.4651970069663,8.5197006966154731E-2,null,{"$f":"sortieren($B$4:$K$103)","v":"2023-04-06"},"POL","Poland","CRC","Costa Rica",2,1,15,"",""]
[null,"2023-04-08","USA",{"$f":"IFERROR(VLOOKUP(C5,Participants!$B$3:$C$102,2,0),\"\")","v":"USA"},"IRL",{"$f":"IFERROR(VLOOKUP(E5,Participants!$B$3:$C$102,2,0),\"\")","v":"Ireland"},2,0,15,null,null,null,{"$f":"IF(N5<>\"\",ROW()-3,\"\")","v":2},"Sweden",2064.67,0,null,"GER","Germany",2058.4664312367008,-9.653568763299063,null,"2023-04-07","SCO","Scotland","AUS","Australia",1,0,15,"",""]
[null,"2023-04-11","GER",{"$f":"IFERROR(VLOOKUP(C6,Participants!$B$3:$C$102,2,0),\"\")","v":"Germany"},"BRA",{"$f":"IFERROR(VLOOKUP(E6,Participants!$B$3:$C$102,2,0),\"\")","v":"Brazil"},0,2,30,null,null,null,{"$f":"IF(N6<>\"\",ROW()-3,\"\")","v":3},"Germany",2058.4664312367008,-9.653568763299063,null,"SWE","Sweden",2064.67,0,null,"2023-04-07","NED","Netherlands","GER","Germany",0,1,30,"",""]
[null,"2023-04-11","NED",{"$f":"IFERROR(VLOOKUP(C7,Participants!$B$3:$C$102,2,0),\"\")","v":"Netherlands"},"POL",{"$f":"IFERROR(VLOOKUP(E7,Participants!$B$3:$C$102,2,0),\"\")","v":"Poland"},4,1,15,null,null,null,4,"England",2046.5242459673245,-9.2957540326756316,null,"ENG","England",2046.5242459673245,-9.2957540326756316,null,"2023-04-08","USA","USA","IRL","Ireland",2,0,15,"",""]
[null,"2023-04-12","USA",{"$f":"IFERROR(VLOOKUP(C8,Participants!$B$3:$C$102,2,0),\"\")","v":"USA"},"IRL",{"$f":"IFERROR(VLOOKUP(E8,Participants!$B$3:$C$102,2,0),\"\")","v":"Ireland"},1,0,15,null,null,null,5,"France",2021.02,0,null,"FRA","France",2021.02,0,null,"2023-04-11","SCO","Scotland","CRC","Costa Rica",4,0,15,"",""]
[null,"2023-04-06","POL",{"$f":"IFERROR(VLOOKUP(C9,Participants!$B$3:$C$102,2,0),\"\")","v":"Poland"},"CRC",{"$f":"IFERROR(VLOOKUP(E9,Participants!$B$3:$C$102,2,0),\"\")","v":"Costa Rica"},2,1,15,null,null,null,6,"Canada",2001.56,0,null,"CAN","Canada",2001.56,0,null,"2023-04-11","ENG","England","AUS","Australia",0,2,15,"",""]
[null,"2023-04-11","SCO",{"$f":"IFERROR(VLOOKUP(C10,Participants!$B$3:$C$102,2,0),\"\")","v":"Scotland"},"CRC",{"$f":"IFERROR(VLOOKUP(E10,Participants!$B$3:$C$102,2,0),\"\")","v":"Costa Rica"},4,0,15,null,null,null,7,"Spain",1997.65,0,null,"ESP","Spain",1997.65,0,null,"2023-04-11","GER","Germany","BRA","Brazil",0,2,30,"",""]
[null,"2023-04-07","SCO",{"$f":"IFERROR(VLOOKUP(C11,Participants!$B$3:$C$102,2,0),\"\")","v":"Scotland"},"AUS",{"$f":"IFERROR(VLOOKUP(E11,Participants!$B$3:$C$102,2,0),\"\")","v":"Australia"},1,0,15,null,null,null,8,"Brazil",1989.8861632223318,16.896163222331779,null,"NED","Netherlands",1985.5449380847715,-5.9050619152285435,null,"2023-04-11","NED","Netherlands","POL","Poland",4,1,15,"",""]
[null,"2023-04-11","ENG",{"$f":"IFERROR(VLOOKUP(C12,Participants!$B$3:$C$102,2,0),\"\")","v":"England"},"AUS",{"$f":"IFERROR(VLOOKUP(E12,Participants!$B$3:$C$102,2,0),\"\")","v":"Australia"},0,2,15,null,null,null,9,"Netherlands",1985.5449380847715,-5.9050619152285435,null,"BRA","Brazil",1989.8861632223318,16.896163222331779,null,"2023-04-12","USA","USA","IRL","Ireland",1,0,15,"",""]
[null,null,null,{"$f":"IFERROR(VLOOKUP(C13,Participants!$B$3:$C$102,2,0),\"\")","v":""},null,{"$f":"IFERROR(VLOOKUP(E13,Participants!$B$3:$C$102,2,0),\"\")","v":""},null,null,null,null,null,null,10,"Australia",1918.1591355944697,0.24913559446963518,null,"AUS","Australia",1918.1591355944697,0.24913559446963518,null,"","","","","","","","","",""]
[null,null,null,{"$f":"IFERROR(VLOOKUP(C14,Participants!$B$3:$C$102,2,0),\"\")","v":""},null,{"$f":"IFERROR(VLOOKUP(E14,Participants!$B$3:$C$102,2,0),\"\")","v":""},null,null,null,null,null,null,11,"Japan",1917.33,0,null,"JAP","Japan",1917.33,0,null,"","","","","","","","","",""]
[null,null,null,{"$f":"IFERROR(VLOOKUP(C15,Participants!$B$3:$C$102,2,0),\"\")","v":""},null,{"$f":"IFERROR(VLOOKUP(E15,Participants!$B$3:$C$102,2,0),\"\")","v":""},null,null,null,null,null,null,12,"Norway",1905.58,0,null,"NOR","Norway",1905.58,0,null,"","","","","","","","","",""]
[null,null,null,{"$f":"IFERROR(VLOOKUP(C16,Participants!$B$3:$C$102,2,0),\"\")","v":""},null,{"$f":"IFERROR(VLOOKUP(E16,Participants!$B$3:$C$102,2,0),\"\")","v":""},null,null,null,null,null,null,13,"China",1856.98,0,null,"CHN","China",1856.98,0,null,"","","","","","","","","",""]
[null,null,null,{"$f":"IFERROR(VLOOKUP(C17,Participants!$B$3:$C$102,2,0),\"\")","v":""},null,{"$f":"IFERROR(VLOOKUP(E17,Participants!$B$3:$C$102,2,0),\"\")","v":""},null,null,null,null,null,null,14,"Iceland",1851.77,0,null,"ISL","Iceland",1851.77,0,null,"","","","","","","","","",""]
[null,null,null,{"$f":"IFERROR(VLOOKUP(C18,Participants!$B$3:$C$102,2,0),\"\")","v":""},null,{"$f":"IFERROR(VLOOKUP(E18,Participants!$B$3:$C$102,2,0),\"\")","v":""},null,null,null,null,null,null,15,"Denmark",1851.25,0,null,"DEN","Denmark",1851.25,0,null,"","","","","","","","","",""]
[null,null,null,{"$f":"IFERROR(VLOOKUP(C19,Participants!$B$3:$C$102,2,0),\"\")","v":""},null,{"$f":"IFERROR(VLOOKUP(E19,Participants!$B$3:$C$102,2,0),\"\")","v":""},null,null,null,null,null,null,16,"Italy",1845.93,0,null,"ITA","Italy",1845.93,0,null,"","","","","","","","","",""]
[null,null,null,{"$f":"IFERROR(VLOOKUP(C20,Participants!$B$3:$C$102,2,0),\"\")","v":""},null,{"$f":"IFERROR(VLOOKUP(E20,Participants!$B$3:$C$102,2,0),\"\")","v":""},null,null,null,null,null,null,17,"South Korea",1840.68,0,null,"KOR","South Korea",1840.68,0,null,"","","","","","","","","",""]
[null,null,null,{"$f":"IFERROR(VLOOKUP(C21,Participants!$B$3:$C$102,2,0),\"\")","v":""},null,{"$f":"IFERROR(VLOOKUP(E21,Participants!$B$3:$C$102,2,0),\"\")","v":""},null,null,null,null,null,null,18,"Austria",1808.69,0,null,"AUT","Austria",1808.69,0,null,"","","","","","","","","",""]
[null,null,null,{"$f":"IFERROR(VLOOKUP(C22,Participants!$B$3:$C$102,2,0),\"\")","v":""},null,{"$f":"IFERROR(VLOOKUP(E22,Participants!$B$3:$C$102,2,0),\"\")","v":""},null,null,null,null,null,null,19,"Belgium",1804.02,0,null,"BEL","Belgium",1804.02,0,null,"","","","","","","","","",""]
[null,null,null,{"$f":"IFERROR(VLOOKUP(C23,Participants!$B$3:$C$102,2,0),\"\")","v":""},null,{"$f":"IFERROR(VLOOKUP(E23,Participants!$B$3:$C$102,2,0),\"\")","v":""},null,null,null,null,null,null,20,"Switzerland",1772.27,0,null,"SUI","Switzerland",1772.27,0,null,"","","","","","","","","",""]
[null,null,null,{"$f":"IFERROR(VLOOKUP(C24,Participants!$B$3:$C$102,2,0),\"\")","v":""},null,{"$f":"IFERROR(VLOOKUP(E24,Participants!$B$3:$C$102,2,0),\"\")","v":""},null,null,null,null,null,null,21,"Portugal",1752.53,0,null,"POR","Portugal",1752.53,0,null,"","","","","","","","","",""]
[null,null,null,{"$f":"IFERROR(VLOOKUP(C25,Participants!$B$3:$C$102,2,0),\"\")","v":""},null,{"$f":"IFERROR(VLOOKUP(E25,Participants!$B$3:$C$102,2,0),\"\")","v":""},null,null,null,null,null,null,22,"Ireland",1742.1648029930338,-8.5197006966154731E-2,null,"IRL","Ireland",1742.1648029930338,-8.5197006966154731E-2,null,"","","","","","","","","",""]
[null,null,null,{"$f":"IFERROR(VLOOKUP(C26,Participants!$B$3:$C$102,2,0),\"\")","v":""},null,{"$f":"IFERROR(VLOOKUP(E26,Participants!$B$3:$C$102,2,0),\"\")","v":""},null,null,null,null,null,null,23,"Scotland",1737.4800025365216,13.310002536521552,null,"SCO","Scotland",1737.4800025365216,13.310002536521552,null,"","","","","","","","","",""]
[null,null,null,{"$f":"IFERROR(VLOOKUP(C27,Participants!$B$3:$C$102,2,0),\"\")","v":""},null,{"$f":"IFERROR(VLOOKUP(E27,Participants!$B$3:$C$102,2,0),\"\")","v":""},null,null,null,null,null,null,24,"Russia",1717.06,0,null,"RUS","Russia",1717.06,0,null,"","","","","","","","","",""]
[null,null,null,{"$f":"IFERROR(VLOOKUP(C28,Participants!$B$3:$C$102,2,0),\"\")","v":""},null,{"$f":"IFERROR(VLOOKUP(E28,Participants!$B$3:$C$102,2,0),\"\")","v":""},null,null,null,null,null,null,25,"New Zealand",1706.96,0,null,"NZL","New Zealand",1706.96,0,null,"","","","","","","","","",""]
[null,null,null,{"$f":"IFERROR(VLOOKUP(C29,Participants!$B$3:$C$102,2,0),\"\")","v":""},null,{"$f":"IFERROR(VLOOKUP(E29,Participants!$B$3:$C$102,2,0),\"\")","v":""},null,null,null,null,null,null,26,"Colombia",1703.61,0,null,"COL","Colombia",1703.61,0,null,"","","","","","","","","",""]
[null,null,null,{"$f":"IFERROR(VLOOKUP(C30,Participants!$B$3:$C$102,2,0),\"\")","v":""},null,{"$f":"IFERROR(VLOOKUP(E30,Participants!$B$3:$C$102,2,0),\"\")","v":""},null,null,null,null,null,null,27,"Czechia",1693.91,0,null,"CZE","Czechia",1693.91,0,null,"","","","","","","","","",""]
[null,null,null,{"$f":"IFERROR(VLOOKUP(C31,Participants!$B$3:$C$102,2,0),\"\")","v":""},null,{"$f":"IFERROR(VLOOKUP(E31,Participants!$B$3:$C$102,2,0),\"\")","v":""},null,null,null,null,null,null,28,"Argentina",1682.45,0,null,"ARG","Argentina",1682.45,0,null,"","","","","","","","","",""]
[null,null,null,{"$f":"IFERROR(VLOOKUP(C32,Participants!$B$3:$C$102,2,0),\"\")","v":""},null,{"$f":"IFERROR(VLOOKUP(E32,Participants!$B$3:$C$102,2,0),\"\")","v":""},null,null,null,null,null,null,29,"Poland",1663.4017256019517,2.4917256019516572,null,"FIN","Finland",1654.99,0,null,"","","","","","","","","",""]
[null,null,null,{"$f":"IFERROR(VLOOKUP(C33,Participants!$B$3:$C$102,2,0),\"\")","v":""},null,{"$f":"IFERROR(VLOOKUP(E33,Participants!$B$3:$C$102,2,0),\"\")","v":""},null,null,null,null,null,null,30,"Wales",1659.76,0,null,"POL","Poland",1663.4017256019517,2.4917256019516572,null,"","","","","","","","","",""]
[null,null,null,{"$f":"IFERROR(VLOOKUP(C34,Participants!$B$3:$C$102,2,0),\"\")","v":""},null,{"$f":"IFERROR(VLOOKUP(E34,Participants!$B$3:$C$102,2,0),\"\")","v":""},null,null,null,null,null,null,31,"Finland",1654.99,0,null,"WAL","Wales",1659.76,0,null,"","","","","","","","","",""]
[null,null,null,{"$f":"IFERROR(VLOOKUP(C35,Participants!$B$3:$C$102,2,0),\"\")","v":""},null,{"$f":"IFERROR(VLOOKUP(E35,Participants!$B$3:$C$102,2,0),\"\")","v":""},null,null,null,null,null,null,32,"Ukraine",1644.97,0,null,"UKR","Ukraine",1644.97,0,null,"","","","","","","","","",""]
[null,null,null,{"$f":"IFERROR(VLOOKUP(C36,Participants!$B$3:$C$102,2,0),\"\")","v":""},null,{"$f":"IFERROR(VLOOKUP(E36,Participants!$B$3:$C$102,2,0),\"\")","v":""},null,null,null,null,null,null,33,"Vietnam",1643.66,0,null,"VIE","Vietnam",1643.66,0,null,"","","","","","","","","",""]
[null,null,null,{"$f":"IFERROR(VLOOKUP(C37,Participants!$B$3:$C$102,2,0),\"\")","v":""},null,{"$f":"IFERROR(VLOOKUP(E37,Participants!$B$3:$C$102,2,0),\"\")","v":""},null,null,null,null,null,null,34,"Mexiko",1621.8,0,null,"MEX","Mexiko",1621.8,0,null,"","","","","","","","","",""]
[null,null,null,{"$f":"IFERROR(VLOOKUP(C38,Participants!$B$3:$C$102,2,0),\"\")","v":""},null,{"$f":"IFERROR(VLOOKUP(E38,Participants!$B$3:$C$102,2,0),\"\")","v":""},null,null,null,null,null,null,35,"Aerbia",1620.35,0,null,"SRB","Aerbia",1620.35,0,null,"","","","","","","","","",""]
[null,null,null,{"$f":"IFERROR(VLOOKUP(C39,Participants!$B$3:$C$102,2,0),\"\")","v":""},null,{"$f":"IFERROR(VLOOKUP(E39,Participants!$B$3:$C$102,2,0),\"\")","v":""},null,null,null,null,null,null,36,"Costa Rica",1593.3773577559286,-8.092642244071385,null,"CRC","Costa Rica",1593.3773577559286,-8.092642244071385,null,"","","","","","","","","",""]
[null,null,null,{"$f":"IFERROR(VLOOKUP(C40,Participants!$B$3:$C$102,2,0),\"\")","v":""},null,{"$f":"IFERROR(VLOOKUP(E40,Participants!$B$3:$C$102,2,0),\"\")","v":""},null,null,null,null,null,null,37,"Chinese Taipei",1573.65,0,null,"TPE","Chinese Taipei",1573.65,0,null,"","","","","","","","","",""]
[null,null,null,{"$f":"IFERROR(VLOOKUP(C41,Participants!$B$3:$C$102,2,0),\"\")","v":""},null,{"$f":"IFERROR(VLOOKUP(E41,Participants!$B$3:$C$102,2,0),\"\")","v":""},null,null,null,null,null,null,38,"Romania",1562.43,0,null,"ROU","Romania",1562.43,0,null,"","","","","","","","","",""]
[null,null,null,{"$f":"IFERROR(VLOOKUP(C42,Participants!$B$3:$C$102,2,0),\"\")","v":""},null,{"$f":"IFERROR(VLOOKUP(E42,Participants!$B$3:$C$102,2,0),\"\")","v":""},null,null,null,null,null,null,39,"Chile",1553.22,0,null,"CHI","Chile",1553.22,0,null,"","","","","","","","","",""]
[null,null,null,{"$f":"IFERROR(VLOOKUP(C43,Participants!$B$3:$C$102,2,0),\"\")","v":""},null,{"$f":"IFERROR(VLOOKUP(E43,Participants!$B$3:$C$102,2,0),\"\")","v":""},null,null,null,null,null,null,40,"Slovenia",1552.25,0,null,"SVN","Slovenia",1552.25,0,null,"","","","","","","","","",""]
[null,null,null,{"$f":"IFERROR(VLOOKUP(C44,Participants!$B$3:$C$102,2,0),\"\")","v":""},null,{"$f":"IFERROR(VLOOKUP(E44,Participants!$B$3:$C$102,2,0),\"\")","v":""},null,null,null,null,null,null,41,"Hungary",1542.44,0,null,"HUN","Hungary",1542.44,0,null,"","","","","","","","","",""]
[null,null,null,{"$f":"IFERROR(VLOOKUP(C45,Participants!$B$3:$C$102,2,0),\"\")","v":""},null,{"$f":"IFERROR(VLOOKUP(E45,Participants!$B$3:$C$102,2,0),\"\")","v":""},null,null,null,null,null,null,42,"Nigeria",1540.96,0,null,"NGA","Nigeria",1540.96,0,null,"","","","","","","","","",""]
[null,null,null,{"$f":"IFERROR(VLOOKUP(C46,Participants!$B$3:$C$102,2,0),\"\")","v":""},null,{"$f":"IFERROR(VLOOKUP(E46,Participants!$B$3:$C$102,2,0),\"\")","v":""},null,null,null,null,null,null,43,"Jamaica",1536.81,0,null,"JAM","Jamaica",1536.81,0,null,"","","","","","","","","",""]
[null,null,null,{"$f":"IFERROR(VLOOKUP(C47,Participants!$B$3:$C$102,2,0),\"\")","v":""},null,{"$f":"IFERROR(VLOOKUP(E47,Participants!$B$3:$C$102,2,0),\"\")","v":""},null,null,null,null,null,null,44,"Thailand",1527.39,0,null,"THA","Thailand",1527.39,0,null,"","","","","","","","","",""]
[null,null,null,{"$f":"IFERROR(VLOOKUP(C48,Participants!$B$3:$C$102,2,0),\"\")","v":""},null,{"$f":"IFERROR(VLOOKUP(E48,Participants!$B$3:$C$102,2,0),\"\")","v":""},null,null,null,null,null,null,45,"Northern Ireland",1526.21,0,null,"NIR","Northern Ireland",1526.21,0,null,"","","","","","","","","",""]
[null,null,null,{"$f":"IFERROR(VLOOKUP(C49,Participants!$B$3:$C$102,2,0),\"\")","v":""},null,{"$f":"IFERROR(VLOOKUP(E49,Participants!$B$3:$C$102,2,0),\"\")","v":""},null,null,null,null,null,null,46,"Slovalia",1522.13,0,null,"SVK","Slovalia",1522.13,0,null,"","","","","","","","","",""]
[null,null,null,{"$f":"IFERROR(VLOOKUP(C50,Participants!$B$3:$C$102,2,0),\"\")","v":""},null,{"$f":"IFERROR(VLOOKUP(E50,Participants!$B$3:$C$102,2,0),\"\")","v":""},null,null,null,null,null,null,47,"Myanmar",1519.04,0,null,"MYA","Myanmar",1519.04,0,null,"","","","","","","","","",""]
[null,null,null,{"$f":"IFERROR(VLOOKUP(C51,Participants!$B$3:$C$102,2,0),\"\")","v":""},null,{"$f":"IFERROR(VLOOKUP(E51,Participants!$B$3:$C$102,2,0),\"\")","v":""},null,null,null,null,null,null,48,"Paraguay",1503.44,0,null,"PAR","Paraguay",1503.44,0,null,"","","","","","","","","",""]
[null,null,null,{"$f":"IFERROR(VLOOKUP(C52,Participants!$B$3:$C$102,2,0),\"\")","v":""},null,{"$f":"IFERROR(VLOOKUP(E52,Participants!$B$3:$C$102,2,0),\"\")","v":""},null,null,null,null,null,null,49,"Philippines",1496.23,0,null,"PHI","Philippines",1496.23,0,null,"","","","","","","","","",""]
[null,null,null,{"$f":"IFERROR(VLOOKUP(C53,Participants!$B$3:$C$102,2,0),\"\")","v":""},null,{"$f":"IFERROR(VLOOKUP(E53,Participants!$B$3:$C$102,2,0),\"\")","v":""},null,null,null,null,null,null,50,"Uzbekistan",1491.37,0,null,"UZB","Uzbekistan",1491.37,0,null,"","","","","","","","","",""]
[null,null,null,{"$f":"IFERROR(VLOOKUP(C54,Participants!$B$3:$C$102,2,0),\"\")","v":""},null,{"$f":"IFERROR(VLOOKUP(E54,Participants!$B$3:$C$102,2,0),\"\")","v":""},null,null,null,null,null,null,51,"Venezuela",1486.32,0,null,"VEN","Venezuela",1486.32,0,null,"","","","","","","","","",""]
[null,null,null,{"$f":"IFERROR(VLOOKUP(C55,Participants!$B$3:$C$102,2,0),\"\")","v":""},null,{"$f":"IFERROR(VLOOKUP(E55,Participants!$B$3:$C$102,2,0),\"\")","v":""},null,null,null,null,null,null,52,"Panama",1482.51,0,null,"PAN","Panama",1482.51,0,null,"","","","","","","","","",""]
[null,null,null,{"$f":"IFERROR(VLOOKUP(C56,Participants!$B$3:$C$102,2,0),\"\")","v":""},null,{"$f":"IFERROR(VLOOKUP(E56,Participants!$B$3:$C$102,2,0),\"\")","v":""},null,null,null,null,null,null,53,"Haiti",1478.3,0,null,"HAI","Haiti",1478.3,0,null,"","","","","","","","","",""]
[null,null,null,{"$f":"IFERROR(VLOOKUP(C57,Participants!$B$3:$C$102,2,0),\"\")","v":""},null,{"$f":"IFERROR(VLOOKUP(E57,Participants!$B$3:$C$102,2,0),\"\")","v":""},null,null,null,null,null,null,54,"South Africa",1471.84,0,null,"RSA","South Africa",1471.84,0,null,"","","","","","","","","",""]
[null,null,null,{"$f":"IFERROR(VLOOKUP(C58,Participants!$B$3:$C$102,2,0),\"\")","v":""},null,{"$f":"IFERROR(VLOOKUP(E58,Participants!$B$3:$C$102,2,0),\"\")","v":""},null,null,null,null,null,null,55,"Papua New Guinea",1469.52,0,null,"PNG","Papua New Guinea",1469.52,0,null,"","","","","","","","","",""]
[null,null,null,{"$f":"IFERROR(VLOOKUP(C59,Participants!$B$3:$C$102,2,0),\"\")","v":""},null,{"$f":"IFERROR(VLOOKUP(E59,Participants!$B$3:$C$102,2,0),\"\")","v":""},null,null,null,null,null,null,56,"Cameroon",1445.75,0,null,"CMR","Cameroon",1445.75,0,null,"","","","","","","","","",""]
[null,null,null,{"$f":"IFERROR(VLOOKUP(C60,Participants!$B$3:$C$102,2,0),\"\")","v":""},null,{"$f":"IFERROR(VLOOKUP(E60,Participants!$B$3:$C$102,2,0),\"\")","v":""},null,null,null,null,null,null,57,"Belarus",1443.08,0,null,"BLR","Belarus",1443.08,0,null,"","","","","","","","","",""]
[null,null,null,{"$f":"IFERROR(VLOOKUP(C61,Participants!$B$3:$C$102,2,0),\"\")","v":""},null,{"$f":"IFERROR(VLOOKUP(E61,Participants!$B$3:$C$102,2,0),\"\")","v":""},null,null,null,null,null,null,58,"Croatia",1417.78,0,null,"CRO","Croatia",1417.78,0,null,"","","","","","","","","",""]
[null,null,null,{"$f":"IFERROR(VLOOKUP(C62,Participants!$B$3:$C$102,2,0),\"\")","v":""},null,{"$f":"IFERROR(VLOOKUP(E62,Participants!$B$3:$C$102,2,0),\"\")","v":""},null,null,null,null,null,null,59,"Ghana",1416.77,0,null,"GHA","Ghana",1416.77,0,null,"","","","","","","","","",""]
[null,null,null,{"$f":"IFERROR(VLOOKUP(C63,Participants!$B$3:$C$102,2,0),\"\")","v":""},null,{"$f":"IFERROR(VLOOKUP(E63,Participants!$B$3:$C$102,2,0),\"\")","v":""},null,null,null,null,null,null,60,"Greece",1404.31,0,null,"GRE","Greece",1404.31,0,null,"","","","","","","","","",""]
[null,null,null,{"$f":"IFERROR(VLOOKUP(C64,Participants!$B$3:$C$102,2,0),\"\")","v":""},null,{"$f":"IFERROR(VLOOKUP(E64,Participants!$B$3:$C$102,2,0),\"\")","v":""},null,null,null,null,null,null,61,"India",1391.3,0,null,"IND","India",1391.3,0,null,"","","","","","","","","",""]
[null,null,null,{"$f":"IFERROR(VLOOKUP(C65,Participants!$B$3:$C$102,2,0),\"\")","v":""},null,{"$f":"IFERROR(VLOOKUP(E65,Participants!$B$3:$C$102,2,0),\"\")","v":""},null,null,null,null,null,null,62,"Bosnia Herzeg.",1384.15,0,null,"BIH","Bosnia Herzeg.",1384.15,0,null,"","","","","","","","","",""]
[null,null,null,{"$f":"IFERROR(VLOOKUP(C66,Participants!$B$3:$C$102,2,0),\"\")","v":""},null,{"$f":"IFERROR(VLOOKUP(E66,Participants!$B$3:$C$102,2,0),\"\")","v":""},null,null,null,null,null,null,63,"Turkey",1383.24,0,null,"TUR","Turkey",1383.24,0,null,"","","","","","","","","",""]
[null,null,null,{"$f":"IFERROR(VLOOKUP(C67,Participants!$B$3:$C$102,2,0),\"\")","v":""},null,{"$f":"IFERROR(VLOOKUP(E67,Participants!$B$3:$C$102,2,0),\"\")","v":""},null,null,null,null,null,null,64,"Côte d'Ivoire",1379.39,0,null,"CIV","Côte d'Ivoire",1379.39,0,null,"","","","","","","","","",""]
[null,null,null,{"$f":"IFERROR(VLOOKUP(C68,Participants!$B$3:$C$102,2,0),\"\")","v":""},null,{"$f":"IFERROR(VLOOKUP(E68,Participants!$B$3:$C$102,2,0),\"\")","v":""},null,null,null,null,null,null,65,"Ecuador",1377.86,0,null,"ECU","Ecuador",1377.86,0,null,"","","","","","","","","",""]
[null,null,null,{"$f":"IFERROR(VLOOKUP(C69,Participants!$B$3:$C$102,2,0),\"\")","v":""},null,{"$f":"IFERROR(VLOOKUP(E69,Participants!$B$3:$C$102,2,0),\"\")","v":""},null,null,null,null,null,null,66,"Uruguay",1377.74,0,null,"URU","Uruguay",1377.74,0,null,"","","","","","","","","",""]
[null,null,null,{"$f":"IFERROR(VLOOKUP(C70,Participants!$B$3:$C$102,2,0),\"\")","v":""},null,{"$f":"IFERROR(VLOOKUP(E70,Participants!$B$3:$C$102,2,0),\"\")","v":""},null,null,null,null,null,null,{"$f":"IF(N70<>\"\",ROW()-3,\"\")","v":67},"Iran",1369.02,0,null,"IRN","Iran",1369.02,0,null,"","","","","","","","","",""]
[null,null,null,{"$f":"IFERROR(VLOOKUP(C71,Participants!$B$3:$C$102,2,0),\"\")","v":""},null,{"$f":"IFERROR(VLOOKUP(E71,Participants!$B$3:$C$102,2,0),\"\")","v":""},null,null,null,null,null,null,68,"Jordan",1368.74,0,null,"JOR","Jordan",1368.74,0,null,"","","","","","","","","",""]
[null,null,null,{"$f":"IFERROR(VLOOKUP(C72,Participants!$B$3:$C$102,2,0),\"\")","v":""},null,{"$f":"IFERROR(VLOOKUP(E72,Participants!$B$3:$C$102,2,0),\"\")","v":""},null,null,null,null,null,null,69,"Israel",1360.76,0,null,"ISR","Israel",1360.76,0,null,"","","","","","","","","",""]
[null,null,null,{"$f":"IFERROR(VLOOKUP(C73,Participants!$B$3:$C$102,2,0),\"\")","v":""},null,{"$f":"IFERROR(VLOOKUP(E73,Participants!$B$3:$C$102,2,0),\"\")","v":""},null,null,null,null,null,null,70,"Fiji",1345.58,0,null,"FIJ","Fiji",1345.58,0,null,"","","","","","","","","",""]
[null,null,null,{"$f":"IFERROR(VLOOKUP(C74,Participants!$B$3:$C$102,2,0),\"\")","v":""},null,{"$f":"IFERROR(VLOOKUP(E74,Participants!$B$3:$C$102,2,0),\"\")","v":""},null,null,null,null,null,null,"","","","",null,null,null,null,null,null,"","","","","","","","","",""]
[null,null,null,{"$f":"IFERROR(VLOOKUP(C75,Participants!$B$3:$C$102,2,0),\"\")","v":""},null,{"$f":"IFERROR(VLOOKUP(E75,Participants!$B$3:$C$102,2,0),\"\")","v":""},null,null,null,null,null,null,"","","","",null,null,null,null,null,null,"","","","","","","","","",""]
[null,null,null,{"$f":"IFERROR(VLOOKUP(C76,Participants!$B$3:$C$102,2,0),\"\")","v":""},null,{"$f":"IFERROR(VLOOKUP(E76,Participants!$B$3:$C$102,2,0),\"\")","v":""},null,null,null,null,null,null,"","","","",null,null,null,null,null,null,"","","","","","","","","",""]
[null,null,null,{"$f":"IFERROR(VLOOKUP(C77,Participants!$B$3:$C$102,2,0),\"\")","v":""},null,{"$f":"IFERROR(VLOOKUP(E77,Participants!$B$3:$C$102,2,0),\"\")","v":""},null,null,null,null,null,null,"","","","",null,null,null,null,null,null,"","","","","","","","","",""]
[null,null,null,{"$f":"IFERROR(VLOOKUP(C78,Participants!$B$3:$C$102,2,0),\"\")","v":""},null,{"$f":"IFERROR(VLOOKUP(E78,Participants!$B$3:$C$102,2,0),\"\")","v":""},null,null,null,null,null,null,"","","","",null,null,null,null,null,null,"","","","","","","","","",""]
[null,null,null,{"$f":"IFERROR(VLOOKUP(C79,Participants!$B$3:$C$102,2,0),\"\")","v":""},null,{"$f":"IFERROR(VLOOKUP(E79,Participants!$B$3:$C$102,2,0),\"\")","v":""},null,null,null,null,null,null,"","","","",null,null,null,null,null,null,"","","","","","","","","",""]
[null,null,null,{"$f":"IFERROR(VLOOKUP(C80,Participants!$B$3:$C$102,2,0),\"\")","v":""},null,{"$f":"IFERROR(VLOOKUP(E80,Participants!$B$3:$C$102,2,0),\"\")","v":""},null,null,null,null,null,null,"","","","",null,null,null,null,null,null,"","","","","","","","","",""]
[null,null,null,{"$f":"IFERROR(VLOOKUP(C81,Participants!$B$3:$C$102,2,0),\"\")","v":""},null,{"$f":"IFERROR(VLOOKUP(E81,Participants!$B$3:$C$102,2,0),\"\")","v":""},null,null,null,null,null,null,"","","","",null,null,null,null,null,null,"","","","","","","","","",""]
[null,null,null,{"$f":"IFERROR(VLOOKUP(C82,Participants!$B$3:$C$102,2,0),\"\")","v":""},null,{"$f":"IFERROR(VLOOKUP(E82,Participants!$B$3:$C$102,2,0),\"\")","v":""},null,null,null,null,null,null,"","","","",null,null,null,null,null,null,"","","","","","","","","",""]
[null,null,null,{"$f":"IFERROR(VLOOKUP(C83,Participants!$B$3:$C$102,2,0),\"\")","v":""},null,{"$f":"IFERROR(VLOOKUP(E83,Participants!$B$3:$C$102,2,0),\"\")","v":""},null,null,null,null,null,null,"","","","",null,null,null,null,null,null,"","","","","","","","","",""]
[null,null,null,{"$f":"IFERROR(VLOOKUP(C84,Participants!$B$3:$C$102,2,0),\"\")","v":""},null,{"$f":"IFERROR(VLOOKUP(E84,Participants!$B$3:$C$102,2,0),\"\")","v":""},null,null,null,null,null,null,"","","","",null,null,null,null,null,null,"","","","","","","","","",""]
[null,null,null,{"$f":"IFERROR(VLOOKUP(C85,Participants!$B$3:$C$102,2,0),\"\")","v":""},null,{"$f":"IFERROR(VLOOKUP(E85,Participants!$B$3:$C$102,2,0),\"\")","v":""},null,null,null,null,null,null,"","","","",null,null,null,null,null,null,"","","","","","","","","",""]
[null,null,null,{"$f":"IFERROR(VLOOKUP(C86,Participants!$B$3:$C$102,2,0),\"\")","v":""},null,{"$f":"IFERROR(VLOOKUP(E86,Participants!$B$3:$C$102,2,0),\"\")","v":""},null,null,null,null,null,null,"","","","",null,null,null,null,null,null,"","","","","","","","","",""]
[null,null,null,{"$f":"IFERROR(VLOOKUP(C87,Participants!$B$3:$C$102,2,0),\"\")","v":""},null,{"$f":"IFERROR(VLOOKUP(E87,Participants!$B$3:$C$102,2,0),\"\")","v":""},null,null,null,null,null,null,"","","","",null,null,null,null,null,null,"","","","","","","","","",""]
[null,null,null,{"$f":"IFERROR(VLOOKUP(C88,Participants!$B$3:$C$102,2,0),\"\")","v":""},null,{"$f":"IFERROR(VLOOKUP(E88,Participants!$B$3:$C$102,2,0),\"\")","v":""},null,null,null,null,null,null,"","","","",null,null,null,null,null,null,"","","","","","","","","",""]
[null,null,null,{"$f":"IFERROR(VLOOKUP(C89,Participants!$B$3:$C$102,2,0),\"\")","v":""},null,{"$f":"IFERROR(VLOOKUP(E89,Participants!$B$3:$C$102,2,0),\"\")","v":""},null,null,null,null,null,null,"","","","",null,null,null,null,null,null,"","","","","","","","","",""]
[null,null,null,{"$f":"IFERROR(VLOOKUP(C90,Participants!$B$3:$C$102,2,0),\"\")","v":""},null,{"$f":"IFERROR(VLOOKUP(E90,Participants!$B$3:$C$102,2,0),\"\")","v":""},null,null,null,null,null,null,"","","","",null,null,null,null,null,null,"","","","","","","","","",""]
[null,null,null,{"$f":"IFERROR(VLOOKUP(C91,Participants!$B$3:$C$102,2,0),\"\")","v":""},null,{"$f":"IFERROR(VLOOKUP(E91,Participants!$B$3:$C$102,2,0),\"\")","v":""},null,null,null,null,null,null,"","","","",null,null,null,null,null,null,"","","","","","","","","",""]
[null,null,null,{"$f":"IFERROR(VLOOKUP(C92,Participants!$B$3:$C$102,2,0),\"\")","v":""},null,{"$f":"IFERROR(VLOOKUP(E92,Participants!$B$3:$C$102,2,0),\"\")","v":""},null,null,null,null,null,null,"","","","",null,null,null,null,null,null,"","","","","","","","","",""]
[null,null,null,{"$f":"IFERROR(VLOOKUP(C93,Participants!$B$3:$C$102,2,0),\"\")","v":""},null,{"$f":"IFERROR(VLOOKUP(E93,Participants!$B$3:$C$102,2,0),\"\")","v":""},null,null,null,null,null,null,"","","","",null,null,null,null,null,null,"","","","","","","","","",""]
[null,null,null,{"$f":"IFERROR(VLOOKUP(C94,Participants!$B$3:$C$102,2,0),\"\")","v":""},null,{"$f":"IFERROR(VLOOKUP(E94,Participants!$B$3:$C$102,2,0),\"\")","v":""},null,null,null,null,null,null,"","","","",null,null,null,null,null,null,"","","","","","","","","",""]
[null,null,null,{"$f":"IFERROR(VLOOKUP(C95,Participants!$B$3:$C$102,2,0),\"\")","v":""},null,{"$f":"IFERROR(VLOOKUP(E95,Participants!$B$3:$C$102,2,0),\"\")","v":""},null,null,null,null,null,null,"","","","",null,null,null,null,null,null,"","","","","","","","","",""]
[null,null,null,{"$f":"IFERROR(VLOOKUP(C96,Participants!$B$3:$C$102,2,0),\"\")","v":""},null,{"$f":"IFERROR(VLOOKUP(E96,Participants!$B$3:$C$102,2,0),\"\")","v":""},null,null,null,null,null,null,"","","","",null,null,null,null,null,null,"","","","","","","","","",""]
[null,null,null,{"$f":"IFERROR(VLOOKUP(C97,Participants!$B$3:$C$102,2,0),\"\")","v":""},null,{"$f":"IFERROR(VLOOKUP(E97,Participants!$B$3:$C$102,2,0),\"\")","v":""},null,null,null,null,null,null,"","","","",null,null,null,null,null,null,"","","","","","","","","",""]
[null,null,null,{"$f":"IFERROR(VLOOKUP(C98,Participants!$B$3:$C$102,2,0),\"\")","v":""},null,{"$f":"IFERROR(VLOOKUP(E98,Participants!$B$3:$C$102,2,0),\"\")","v":""},null,null,null,null,null,null,"","","","",null,null,null,null,null,null,"","","","","","","","","",""]
[null,null,null,{"$f":"IFERROR(VLOOKUP(C99,Participants!$B$3:$C$102,2,0),\"\")","v":""},null,{"$f":"IFERROR(VLOOKUP(E99,Participants!$B$3:$C$102,2,0),\"\")","v":""},null,null,null,null,null,null,"","","","",null,null,null,null,null,null,"","","","","","","","","",""]
[null,null,null,{"$f":"IFERROR(VLOOKUP(C100,Participants!$B$3:$C$102,2,0),\"\")","v":""},null,{"$f":"IFERROR(VLOOKUP(E100,Participants!$B$3:$C$102,2,0),\"\")","v":""},null,null,null,null,null,null,"","","","",null,null,null,null,null,null,"","","","","","","","","",""]
[null,null,null,{"$f":"IFERROR(VLOOKUP(C101,Participants!$B$3:$C$102,2,0),\"\")","v":""},null,{"$f":"IFERROR(VLOOKUP(E101,Participants!$B$3:$C$102,2,0),\"\")","v":""},null,null,null,null,null,null,"","","","",null,null,null,null,null,null,"","","","","","","","","",""]
[null,null,null,{"$f":"IFERROR(VLOOKUP(C102,Participants!$B$3:$C$102,2,0),\"\")","v":""},null,{"$f":"IFERROR(VLOOKUP(E102,Participants!$B$3:$C$102,2,0),\"\")","v":""},null,null,null,null,null,null,"","","","",null,null,null,null,null,null,"","","","","","","","","",""]
[null,null,null,{"$f":"IFERROR(VLOOKUP(C103,Participants!$B$3:$C$102,2,0),\"\")","v":""},null,{"$f":"IFERROR(VLOOKUP(E103,Participants!$B$3:$C$102,2,0),\"\")","v":""},null,null,null,null,null,null,"","","","",null,null,null,null,null,null,"","","","","","","","","",""]

{"sheet":"Template","index":2,"n_rows":103,"n_cols":32,"rows_kept":103,"cut":false,"hidden":false,"merged":[[0,8,2,8],[0,9,2,9],[2,6,2,7]]}
[null,{"$f":"Language!$E$11","v":"Ranking"},null,{"$f":"Language!$E$12","v":"Old Date:"},null,{"$f":"Language!$E$13","v":"New Date:"},null,null,{"$f":"Language!$E$20","v":"Weight"},{"$f":"Language!$E$32","v":"Home advant."}]
[null,{"$f":"Language!$E$14","v":"Matches"},null,null,"\u009e",null,null,null,null,null,null,null,{"$f":"Language!$E$15","v":"New Ranking"},null,null,null,null,"Ranking List unsorted",null,null,null,null,"Matches sorted"]
[null,{"$f":"Language!$E$16","v":"Date"},{"$f":"Language!$E$17","v":"ID 1"},null,{"$f":"Language!$E$18","v":"ID 2"},null,{"$f":"Language!$E$19","v":"Result"},null,null,null,null,null,{"$f":"Language!$E$23","v":"Rank"},null,null,null,null,"ID"]
[null,null,null,{"$f":"IFERROR(VLOOKUP(C4,Participants!$B$3:$C$102,2,0),\"\")","v":""},null,{"$f":"IFERROR(VLOOKUP(E4,Participants!$B$3:$C$102,2,0),\"\")","v":""},null,null,null,null,null,null,{"$f":"IF(N5<>\"\",ROW()-3,\"\")","v":""},{"$f":"sortieren($S$4:$U$103,2,-1)","v":""},"","",null,null,null,null,null,null,{"$f":"sortieren($B$4:$K$103)","v":""},"","","","","","","","",""]
[null,null,null,{"$f":"IFERROR(VLOOKUP(C5,Participants!$B$3:$C$102,2,0),\"\")","v":""},null,{"$f":"IFERROR(VLOOKUP(E5,Participants!$B$3:$C$102,2,0),\"\")","v":""},null,null,null,null,null,null,{"$f":"IF(N5<>\"\",ROW()-3,\"\")","v":""},"","","",null,null,null,null,null,null,"","","","","","","","","",""]
[null,null,null,{"$f":"IFERROR(VLOOKUP(C6,Participants!$B$3:$C$102,2,0),\"\")","v":""},null,{"$f":"IFERROR(VLOOKUP(E6,Participants!$B$3:$C$102,2,0),\"\")","v":""},null,null,null,null,null,null,{"$f":"IF(N6<>\"\",ROW()-3,\"\")","v":""},"","","",null,null,null,null,null,null,"","","","","","","","","",""]
[null,null,null,{"$f":"IFERROR(VLOOKUP(C7,Participants!$B$3:$C$102,2,0),\"\")","v":""},null,{"$f":"IFERROR(VLOOKUP(E7,Participants!$B$3:$C$102,2,0),\"\")","v":""},null,null,null,null,null,null,"","","","",null,null,null,null,null,null,"","","","","","","","","",""]
[null,null,null,{"$f":"IFERROR(VLOOKUP(C8,Participants!$B$3:$C$102,2,0),\"\")","v":""},null,{"$f":"IFERROR(VLOOKUP(E8,Participants!$B$3:$C$102,2,0),\"\")","v":""},null,null,null,null,null,null,"","","","",null,null,null,null,null,null,"","","","","","","","","",""]
[null,null,null,{"$f":"IFERROR(VLOOKUP(C9,Participants!$B$3:$C$102,2,0),\"\")","v":""},null,{"$f":"IFERROR(VLOOKUP(E9,Participants!$B$3:$C$102,2,0),\"\")","v":""},null,null,null,null,null,null,"","","","",null,null,null,null,null,null,"","","","","","","","","",""]
[null,null,null,{"$f":"IFERROR(VLOOKUP(C10,Participants!$B$3:$C$102,2,0),\"\")","v":""},null,{"$f":"IFERROR(VLOOKUP(E10,Participants!$B$3:$C$102,2,0),\"\")","v":""},null,null,null,null,null,null,"","","","",null,null,null,null,null,null,"","","","","","","","","",""]
[null,null,null,{"$f":"IFERROR(VLOOKUP(C11,Participants!$B$3:$C$102,2,0),\"\")","v":""},null,{"$f":"IFERROR(VLOOKUP(E11,Participants!$B$3:$C$102,2,0),\"\")","v":""},null,null,null,null,null,null,"","","","",null,null,null,null,null,null,"","","","","","","","","",""]
[null,null,null,{"$f":"IFERROR(VLOOKUP(C12,Participants!$B$3:$C$102,2,0),\"\")","v":""},null,{"$f":"IFERROR(VLOOKUP(E12,Participants!$B$3:$C$102,2,0),\"\")","v":""},null,null,null,null,null,null,"","","","",null,null,null,null,null,null,"","","","","","","","","",""]
[null,null,null,{"$f":"IFERROR(VLOOKUP(C13,Participants!$B$3:$C$102,2,0),\"\")","v":""},null,{"$f":"IFERROR(VLOOKUP(E13,Participants!$B$3:$C$102,2,0),\"\")","v":""},null,null,null,null,null,null,"","","","",null,null,null,null,null,null,"","","","","","","","","",""]
[null,null,null,{"$f":"IFERROR(VLOOKUP(C14,Participants!$B$3:$C$102,2,0),\"\")","v":""},null,{"$f":"IFERROR(VLOOKUP(E14,Participants!$B$3:$C$102,2,0),\"\")","v":""},null,null,null,null,null,null,"","","","",null,null,null,null,null,null,"","","","","","","","","",""]
[null,null,null,{"$f":"IFERROR(VLOOKUP(C15,Participants!$B$3:$C$102,2,0),\"\")","v":""},null,{"$f":"IFERROR(VLOOKUP(E15,Participants!$B$3:$C$102,2,0),\"\")","v":""},null,null,null,null,null,null,"","","","",null,null,null,null,null,null,"","","","","","","","","",""]
[null,null,null,{"$f":"IFERROR(VLOOKUP(C16,Participants!$B$3:$C$102,2,0),\"\")","v":""},null,{"$f":"IFERROR(VLOOKUP(E16,Participants!$B$3:$C$102,2,0),\"\")","v":""},null,null,null,null,null,null,"","","","",null,null,null,null,null,null,"","","","","","","","","",""]
[null,null,null,{"$f":"IFERROR(VLOOKUP(C17,Participants!$B$3:$C$102,2,0),\"\")","v":""},null,{"$f":"IFERROR(VLOOKUP(E17,Participants!$B$3:$C$102,2,0),\"\")","v":""},null,null,null,null,null,null,"","","","",null,null,null,null,null,null,"","","","","","","","","",""]
[null,null,null,{"$f":"IFERROR(VLOOKUP(C18,Participants!$B$3:$C$102,2,0),\"\")","v":""},null,{"$f":"IFERROR(VLOOKUP(E18,Participants!$B$3:$C$102,2,0),\"\")","v":""},null,null,null,null,null,null,"","","","",null,null,null,null,null,null,"","","","","","","","","",""]
[null,null,null,{"$f":"IFERROR(VLOOKUP(C19,Participants!$B$3:$C$102,2,0),\"\")","v":""},null,{"$f":"IFERROR(VLOOKUP(E19,Participants!$B$3:$C$102,2,0),\"\")","v":""},null,null,null,null,null,null,"","","","",null,null,null,null,null,null,"","","","","","","","","",""]
[null,null,null,{"$f":"IFERROR(VLOOKUP(C20,Participants!$B$3:$C$102,2,0),\"\")","v":""},null,{"$f":"IFERROR(VLOOKUP(E20,Participants!$B$3:$C$102,2,0),\"\")","v":""},null,null,null,null,null,null,"","","","",null,null,null,null,null,null,"","","","","","","","","",""]
[null,null,null,{"$f":"IFERROR(VLOOKUP(C21,Participants!$B$3:$C$102,2,0),\"\")","v":""},null,{"$f":"IFERROR(VLOOKUP(E21,Participants!$B$3:$C$102,2,0),\"\")","v":""},null,null,null,null,null,null,"","","","",null,null,null,null,null,null,"","","","","","","","","",""]
[null,null,null,{"$f":"IFERROR(VLOOKUP(C22,Participants!$B$3:$C$102,2,0),\"\")","v":""},null,{"$f":"IFERROR(VLOOKUP(E22,Participants!$B$3:$C$102,2,0),\"\")","v":""},null,null,null,null,null,null,"","","","",null,null,null,null,null,null,"","","","","","","","","",""]
[null,null,null,{"$f":"IFERROR(VLOOKUP(C23,Participants!$B$3:$C$102,2,0),\"\")","v":""},null,{"$f":"IFERROR(VLOOKUP(E23,Participants!$B$3:$C$102,2,0),\"\")","v":""},null,null,null,null,null,null,"","","","",null,null,null,null,null,null,"","","","","","","","","",""]
[null,null,null,{"$f":"IFERROR(VLOOKUP(C24,Participants!$B$3:$C$102,2,0),\"\")","v":""},null,{"$f":"IFERROR(VLOOKUP(E24,Participants!$B$3:$C$102,2,0),\"\")","v":""},null,null,null,null,null,null,"","","","",null,null,null,null,null,null,"","","","","","","","","",""]
[null,null,null,{"$f":"IFERROR(VLOOKUP(C25,Participants!$B$3:$C$102,2,0),\"\")","v":""},null,{"$f":"IFERROR(VLOOKUP(E25,Participants!$B$3:$C$102,2,0),\"\")","v":""},null,null,null,null,null,null,"","","","",null,null,null,null,null,null,"","","","","","","","","",""]
[null,null,null,{"$f":"IFERROR(VLOOKUP(C26,Participants!$B$3:$C$102,2,0),\"\")","v":""},null,{"$f":"IFERROR(VLOOKUP(E26,Participants!$B$3:$C$102,2,0),\"\")","v":""},null,null,null,null,null,null,"","","","",null,null,null,null,null,null,"","","","","","","","","",""]
[null,null,null,{"$f":"IFERROR(VLOOKUP(C27,Participants!$B$3:$C$102,2,0),\"\")","v":""},null,{"$f":"IFERROR(VLOOKUP(E27,Participants!$B$3:$C$102,2,0),\"\")","v":""},null,null,null,null,null,null,"","","","",null,null,null,null,null,null,"","","","","","","","","",""]
[null,null,null,{"$f":"IFERROR(VLOOKUP(C28,Participants!$B$3:$C$102,2,0),\"\")","v":""},null,{"$f":"IFERROR(VLOOKUP(E28,Participants!$B$3:$C$102,2,0),\"\")","v":""},null,null,null,null,null,null,"","","","",null,null,null,null,null,null,"","","","","","","","","",""]
[null,null,null,{"$f":"IFERROR(VLOOKUP(C29,Participants!$B$3:$C$102,2,0),\"\")","v":""},null,{"$f":"IFERROR(VLOOKUP(E29,Participants!$B$3:$C$102,2,0),\"\")","v":""},null,null,null,null,null,null,"","","","",null,null,null,null,null,null,"","","","","","","","","",""]
[null,null,null,{"$f":"IFERROR(VLOOKUP(C30,Participants!$B$3:$C$102,2,0),\"\")","v":""},null,{"$f":"IFERROR(VLOOKUP(E30,Participants!$B$3:$C$102,2,0),\"\")","v":""},null,null,null,null,null,null,"","","","",null,null,null,null,null,null,"","","","","","","","","",""]
[null,null,null,{"$f":"IFERROR(VLOOKUP(C31,Participants!$B$3:$C$102,2,0),\"\")","v":""},null,{"$f":"IFERROR(VLOOKUP(E31,Participants!$B$3:$C$102,2,0),\"\")","v":""},null,null,null,null,null,null,"","","","",null,null,null,null,null,null,"","","","","","","","","",""]
[null,null,null,{"$f":"IFERROR(VLOOKUP(C32,Participants!$B$3:$C$102,2,0),\"\")","v":""},null,{"$f":"IFERROR(VLOOKUP(E32,Participants!$B$3:$C$102,2,0),\"\")","v":""},null,null,null,null,null,null,"","","","",null,null,null,null,null,null,"","","","","","","","","",""]
[null,null,null,{"$f":"IFERROR(VLOOKUP(C33,Participants!$B$3:$C$102,2,0),\"\")","v":""},null,{"$f":"IFERROR(VLOOKUP(E33,Participants!$B$3:$C$102,2,0),\"\")","v":""},null,null,null,null,null,null,"","","","",null,null,null,null,null,null,"","","","","","","","","",""]
[null,null,null,{"$f":"IFERROR(VLOOKUP(C34,Participants!$B$3:$C$102,2,0),\"\")","v":""},null,{"$f":"IFERROR(VLOOKUP(E34,Participants!$B$3:$C$102,2,0),\"\")","v":""},null,null,null,null,null,null,"","","","",null,null,null,null,null,null,"","","","","","","","","",""]
[null,null,null,{"$f":"IFERROR(VLOOKUP(C35,Participants!$B$3:$C$102,2,0),\"\")","v":""},null,{"$f":"IFERROR(VLOOKUP(E35,Participants!$B$3:$C$102,2,0),\"\")","v":""},null,null,null,null,null,null,"","","","",null,null,null,null,null,null,"","","","","","","","","",""]
[null,null,null,{"$f":"IFERROR(VLOOKUP(C36,Participants!$B$3:$C$102,2,0),\"\")","v":""},null,{"$f":"IFERROR(VLOOKUP(E36,Participants!$B$3:$C$102,2,0),\"\")","v":""},null,null,null,null,null,null,"","","","",null,null,null,null,null,null,"","","","","","","","","",""]
[null,null,null,{"$f":"IFERROR(VLOOKUP(C37,Participants!$B$3:$C$102,2,0),\"\")","v":""},null,{"$f":"IFERROR(VLOOKUP(E37,Participants!$B$3:$C$102,2,0),\"\")","v":""},null,null,null,null,null,null,"","","","",null,null,null,null,null,null,"","","","","","","","","",""]
[null,null,null,{"$f":"IFERROR(VLOOKUP(C38,Participants!$B$3:$C$102,2,0),\"\")","v":""},null,{"$f":"IFERROR(VLOOKUP(E38,Participants!$B$3:$C$102,2,0),\"\")","v":""},null,null,null,null,null,null,"","","","",null,null,null,null,null,null,"","","","","","","","","",""]
[null,null,null,{"$f":"IFERROR(VLOOKUP(C39,Participants!$B$3:$C$102,2,0),\"\")","v":""},null,{"$f":"IFERROR(VLOOKUP(E39,Participants!$B$3:$C$102,2,0),\"\")","v":""},null,null,null,null,null,null,"","","","",null,null,null,null,null,null,"","","","","","","","","",""]
[null,null,null,{"$f":"IFERROR(VLOOKUP(C40,Participants!$B$3:$C$102,2,0),\"\")","v":""},null,{"$f":"IFERROR(VLOOKUP(E40,Participants!$B$3:$C$102,2,0),\"\")","v":""},null,null,null,null,null,null,"","","","",null,null,null,null,null,null,"","","","","","","","","",""]
[null,null,null,{"$f":"IFERROR(VLOOKUP(C41,Participants!$B$3:$C$102,2,0),\"\")","v":""},null,{"$f":"IFERROR(VLOOKUP(E41,Participants!$B$3:$C$102,2,0),\"\")","v":""},null,null,null,null,null,null,"","","","",null,null,null,null,null,null,"","","","","","","","","",""]
[null,null,null,{"$f":"IFERROR(VLOOKUP(C42,Participants!$B$3:$C$102,2,0),\"\")","v":""},null,{"$f":"IFERROR(VLOOKUP(E42,Participants!$B$3:$C$102,2,0),\"\")","v":""},null,null,null,null,null,null,"","","","",null,null,null,null,null,null,"","","","","","","","","",""]
[null,null,null,{"$f":"IFERROR(VLOOKUP(C43,Participants!$B$3:$C$102,2,0),\"\")","v":""},null,{"$f":"IFERROR(VLOOKUP(E43,Participants!$B$3:$C$102,2,0),\"\")","v":""},null,null,null,null,null,null,"","","","",null,null,null,null,null,null,"","","","","","","","","",""]
[null,null,null,{"$f":"IFERROR(VLOOKUP(C44,Participants!$B$3:$C$102,2,0),\"\")","v":""},null,{"$f":"IFERROR(VLOOKUP(E44,Participants!$B$3:$C$102,2,0),\"\")","v":""},null,null,null,null,null,null,"","","","",null,null,null,null,null,null,"","","","","","","","","",""]
[null,null,null,{"$f":"IFERROR(VLOOKUP(C45,Participants!$B$3:$C$102,2,0),\"\")","v":""},null,{"$f":"IFERROR(VLOOKUP(E45,Participants!$B$3:$C$102,2,0),\"\")","v":""},null,null,null,null,null,null,"","","","",null,null,null,null,null,null,"","","","","","","","","",""]
[null,null,null,{"$f":"IFERROR(VLOOKUP(C46,Participants!$B$3:$C$102,2,0),\"\")","v":""},null,{"$f":"IFERROR(VLOOKUP(E46,Participants!$B$3:$C$102,2,0),\"\")","v":""},null,null,null,null,null,null,"","","","",null,null,null,null,null,null,"","","","","","","","","",""]
[null,null,null,{"$f":"IFERROR(VLOOKUP(C47,Participants!$B$3:$C$102,2,0),\"\")","v":""},null,{"$f":"IFERROR(VLOOKUP(E47,Participants!$B$3:$C$102,2,0),\"\")","v":""},null,null,null,null,null,null,"","","","",null,null,null,null,null,null,"","","","","","","","","",""]
[null,null,null,{"$f":"IFERROR(VLOOKUP(C48,Participants!$B$3:$C$102,2,0),\"\")","v":""},null,{"$f":"IFERROR(VLOOKUP(E48,Participants!$B$3:$C$102,2,0),\"\")","v":""},null,null,null,null,null,null,"","","","",null,null,null,null,null,null,"","","","","","","","","",""]
[null,null,null,{"$f":"IFERROR(VLOOKUP(C49,Participants!$B$3:$C$102,2,0),\"\")","v":""},null,{"$f":"IFERROR(VLOOKUP(E49,Participants!$B$3:$C$102,2,0),\"\")","v":""},null,null,null,null,null,null,"","","","",null,null,null,null,null,null,"","","","","","","","","",""]
[null,null,null,{"$f":"IFERROR(VLOOKUP(C50,Participants!$B$3:$C$102,2,0),\"\")","v":""},null,{"$f":"IFERROR(VLOOKUP(E50,Participants!$B$3:$C$102,2,0),\"\")","v":""},null,null,null,null,null,null,"","","","",null,null,null,null,null,null,"","","","","","","","","",""]
[null,null,null,{"$f":"IFERROR(VLOOKUP(C51,Participants!$B$3:$C$102,2,0),\"\")","v":""},null,{"$f":"IFERROR(VLOOKUP(E51,Participants!$B$3:$C$102,2,0),\"\")","v":""},null,null,null,null,null,null,"","","","",null,null,null,null,null,null,"","","","","","","","","",""]
[null,null,null,{"$f":"IFERROR(VLOOKUP(C52,Participants!$B$3:$C$102,2,0),\"\")","v":""},null,{"$f":"IFERROR(VLOOKUP(E52,Participants!$B$3:$C$102,2,0),\"\")","v":""},null,null,null,null,null,null,"","","","",null,null,null,null,null,null,"","","","","","","","","",""]
[null,null,null,{"$f":"IFERROR(VLOOKUP(C53,Participants!$B$3:$C$102,2,0),\"\")","v":""},null,{"$f":"IFERROR(VLOOKUP(E53,Participants!$B$3:$C$102,2,0),\"\")","v":""},null,null,null,null,null,null,"","","","",null,null,null,null,null,null,"","","","","","","","","",""]
[null,null,null,{"$f":"IFERROR(VLOOKUP(C54,Participants!$B$3:$C$102,2,0),\"\")","v":""},null,{"$f":"IFERROR(VLOOKUP(E54,Participants!$B$3:$C$102,2,0),\"\")","v":""},null,null,null,null,null,null,"","","","",null,null,null,null,null,null,"","","","","","","","","",""]
[null,null,null,{"$f":"IFERROR(VLOOKUP(C55,Participants!$B$3:$C$102,2,0),\"\")","v":""},null,{"$f":"IFERROR(VLOOKUP(E55,Participants!$B$3:$C$102,2,0),\"\")","v":""},null,null,null,null,null,null,"","","","",null,null,null,null,null,null,"","","","","","","","","",""]
[null,null,null,{"$f":"IFERROR(VLOOKUP(C56,Participants!$B$3:$C$102,2,0),\"\")","v":""},null,{"$f":"IFERROR(VLOOKUP(E56,Participants!$B$3:$C$102,2,0),\"\")","v":""},null,null,null,null,null,null,"","","","",null,null,null,null,null,null,"","","","","","","","","",""]
[null,null,null,{"$f":"IFERROR(VLOOKUP(C57,Participants!$B$3:$C$102,2,0),\"\")","v":""},null,{"$f":"IFERROR(VLOOKUP(E57,Participants!$B$3:$C$102,2,0),\"\")","v":""},null,null,null,null,null,null,"","","","",null,null,null,null,null,null,"","","","","","","","","",""]
[null,null,null,{"$f":"IFERROR(VLOOKUP(C58,Participants!$B$3:$C$102,2,0),\"\")","v":""},null,{"$f":"IFERROR(VLOOKUP(E58,Participants!$B$3:$C$102,2,0),\"\")","v":""},null,null,null,null,null,null,"","","","",null,null,null,null,null,null,"","","","","","","","","",""]
[null,null,null,{"$f":"IFERROR(VLOOKUP(C59,Participants!$B$3:$C$102,2,0),\"\")","v":""},null,{"$f":"IFERROR(VLOOKUP(E59,Participants!$B$3:$C$102,2,0),\"\")","v":""},null,null,null,null,null,null,"","","","",null,null,null,null,null,null,"","","","","","","","","",""]
[null,null,null,{"$f":"IFERROR(VLOOKUP(C60,Participants!$B$3:$C$102,2,0),\"\")","v":""},null,{"$f":"IFERROR(VLOOKUP(E60,Participants!$B$3:$C$102,2,0),\"\")","v":""},null,null,null,null,null,null,"","","","",null,null,null,null,null,null,"","","","","","","","","",""]
[null,null,null,{"$f":"IFERROR(VLOOKUP(C61,Participants!$B$3:$C$102,2,0),\"\")","v":""},null,{"$f":"IFERROR(VLOOKUP(E61,Participants!$B$3:$C$102,2,0),\"\")","v":""},null,null,null,null,null,null,"","","","",null,null,null,null,null,null,"","","","","","","","","",""]
[null,null,null,{"$f":"IFERROR(VLOOKUP(C62,Participants!$B$3:$C$102,2,0),\"\")","v":""},null,{"$f":"IFERROR(VLOOKUP(E62,Participants!$B$3:$C$102,2,0),\"\")","v":""},null,null,null,null,null,null,"","","","",null,null,null,null,null,null,"","","","","","","","","",""]
[null,null,null,{"$f":"IFERROR(VLOOKUP(C63,Participants!$B$3:$C$102,2,0),\"\")","v":""},null,{"$f":"IFERROR(VLOOKUP(E63,Participants!$B$3:$C$102,2,0),\"\")","v":""},null,null,null,null,null,null,"","","","",null,null,null,null,null,null,"","","","","","","","","",""]
[null,null,null,{"$f":"IFERROR(VLOOKUP(C64,Participants!$B$3:$C$102,2,0),\"\")","v":""},null,{"$f":"IFERROR(VLOOKUP(E64,Participants!$B$3:$C$102,2,0),\"\")","v":""},null,null,null,null,null,null,"","","","",null,null,null,null,null,null,"","","","","","","","","",""]
[null,null,null,{"$f":"IFERROR(VLOOKUP(C65,Participants!$B$3:$C$102,2,0),\"\")","v":""},null,{"$f":"IFERROR(VLOOKUP(E65,Participants!$B$3:$C$102,2,0),\"\")","v":""},null,null,null,null,null,null,"","","","",null,null,null,null,null,null,"","","","","","","","","",""]
[null,null,null,{"$f":"IFERROR(VLOOKUP(C66,Participants!$B$3:$C$102,2,0),\"\")","v":""},null,{"$f":"IFERROR(VLOOKUP(E66,Participants!$B$3:$C$102,2,0),\"\")","v":""},null,null,null,null,null,null,"","","","",null,null,null,null,null,null,"","","","","","","","","",""]
[null,null,null,{"$f":"IFERROR(VLOOKUP(C67,Participants!$B$3:$C$102,2,0),\"\")","v":""},null,{"$f":"IFERROR(VLOOKUP(E67,Participants!$B$3:$C$102,2,0),\"\")","v":""},null,null,null,null,null,null,"","","","",null,null,null,null,null,null,"","","","","","","","","",""]
[null,null,null,{"$f":"IFERROR(VLOOKUP(C68,Participants!$B$3:$C$102,2,0),\"\")","v":""},null,{"$f":"IFERROR(VLOOKUP(E68,Participants!$B$3:$C$102,2,0),\"\")","v":""},null,null,null,null,null,null,"","","","",null,null,null,null,null,null,"","","","","","","","","",""]
[null,null,null,{"$f":"IFERROR(VLOOKUP(C69,Participants!$B$3:$C$102,2,0),\"\")","v":""},null,{"$f":"IFERROR(VLOOKUP(E69,Participants!$B$3:$C$102,2,0),\"\")","v":""},null,null,null,null,null,null,"","","","",null,null,null,null,null,null,"","","","","","","","","",""]
[null,null,null,{"$f":"IFERROR(VLOOKUP(C70,Participants!$B$3:$C$102,2,0),\"\")","v":""},null,{"$f":"IFERROR(VLOOKUP(E70,Participants!$B$3:$C$102,2,0),\"\")","v":""},null,null,null,null,null,null,{"$f":"IF(N70<>\"\",ROW()-3,\"\")","v":""},"","","",null,null,null,null,null,null,"","","","","","","","","",""]
[null,null,null,{"$f":"IFERROR(VLOOKUP(C71,Participants!$B$3:$C$102,2,0),\"\")","v":""},null,{"$f":"IFERROR(VLOOKUP(E71,Participants!$B$3:$C$102,2,0),\"\")","v":""},null,null,null,null,null,null,"","","","",null,null,null,null,null,null,"","","","","","","","","",""]
[null,null,null,{"$f":"IFERROR(VLOOKUP(C72,Participants!$B$3:$C$102,2,0),\"\")","v":""},null,{"$f":"IFERROR(VLOOKUP(E72,Participants!$B$3:$C$102,2,0),\"\")","v":""},null,null,null,null,null,null,"","","","",null,null,null,null,null,null,"","","","","","","","","",""]
[null,null,null,{"$f":"IFERROR(VLOOKUP(C73,Participants!$B$3:$C$102,2,0),\"\")","v":""},null,{"$f":"IFERROR(VLOOKUP(E73,Participants!$B$3:$C$102,2,0),\"\")","v":""},null,null,null,null,null,null,"","","","",null,null,null,null,null,null,"","","","","","","","","",""]
[null,null,null,{"$f":"IFERROR(VLOOKUP(C74,Participants!$B$3:$C$102,2,0),\"\")","v":""},null,{"$f":"IFERROR(VLOOKUP(E74,Participants!$B$3:$C$102,2,0),\"\")","v":""},null,null,null,null,null,null,"","","","",null,null,null,null,null,null,"","","","","","","","","",""]
[null,null,null,{"$f":"IFERROR(VLOOKUP(C75,Participants!$B$3:$C$102,2,0),\"\")","v":""},null,{"$f":"IFERROR(VLOOKUP(E75,Participants!$B$3:$C$102,2,0),\"\")","v":""},null,null,null,null,null,null,"","","","",null,null,null,null,null,null,"","","","","","","","","",""]
[null,null,null,{"$f":"IFERROR(VLOOKUP(C76,Participants!$B$3:$C$102,2,0),\"\")","v":""},null,{"$f":"IFERROR(VLOOKUP(E76,Participants!$B$3:$C$102,2,0),\"\")","v":""},null,null,null,null,null,null,"","","","",null,null,null,null,null,null,"","","","","","","","","",""]
[null,null,null,{"$f":"IFERROR(VLOOKUP(C77,Participants!$B$3:$C$102,2,0),\"\")","v":""},null,{"$f":"IFERROR(VLOOKUP(E77,Participants!$B$3:$C$102,2,0),\"\")","v":""},null,null,null,null,null,null,"","","","",null,null,null,null,null,null,"","","","","","","","","",""]
[null,null,null,{"$f":"IFERROR(VLOOKUP(C78,Participants!$B$3:$C$102,2,0),\"\")","v":""},null,{"$f":"IFERROR(VLOOKUP(E78,Participants!$B$3:$C$102,2,0),\"\")","v":""},null,null,null,null,null,null,"","","","",null,null,null,null,null,null,"","","","","","","","","",""]
[null,null,null,{"$f":"IFERROR(VLOOKUP(C79,Participants!$B$3:$C$102,2,0),\"\")","v":""},null,{"$f":"IFERROR(VLOOKUP(E79,Participants!$B$3:$C$102,2,0),\"\")","v":""},null,null,null,null,null,null,"","","","",null,null,null,null,null,null,"","","","","","","","","",""]
[null,null,null,{"$f":"IFERROR(VLOOKUP(C80,Participants!$B$3:$C$102,2,0),\"\")","v":""},null,{"$f":"IFERROR(VLOOKUP(E80,Participants!$B$3:$C$102,2,0),\"\")","v":""},null,null,null,null,null,null,"","","","",null,null,null,null,null,null,"","","","","","","","","",""]
[null,null,null,{"$f":"IFERROR(VLOOKUP(C81,Participants!$B$3:$C$102,2,0),\"\")","v":""},null,{"$f":"IFERROR(VLOOKUP(E81,Participants!$B$3:$C$102,2,0),\"\")","v":""},null,null,null,null,null,null,"","","","",null,null,null,null,null,null,"","","","","","","","","",""]
[null,null,null,{"$f":"IFERROR(VLOOKUP(C82,Participants!$B$3:$C$102,2,0),\"\")","v":""},null,{"$f":"IFERROR(VLOOKUP(E82,Participants!$B$3:$C$102,2,0),\"\")","v":""},null,null,null,null,null,null,"","","","",null,null,null,null,null,null,"","","","","","","","","",""]
[null,null,null,{"$f":"IFERROR(VLOOKUP(C83,Participants!$B$3:$C$102,2,0),\"\")","v":""},null,{"$f":"IFERROR(VLOOKUP(E83,Participants!$B$3:$C$102,2,0),\"\")","v":""},null,null,null,null,null,null,"","","","",null,null,null,null,null,null,"","","","","","","","","",""]
[null,null,null,{"$f":"IFERROR(VLOOKUP(C84,Participants!$B$3:$C$102,2,0),\"\")","v":""},null,{"$f":"IFERROR(VLOOKUP(E84,Participants!$B$3:$C$102,2,0),\"\")","v":""},null,null,null,null,null,null,"","","","",null,null,null,null,null,null,"","","","","","","","","",""]
[null,null,null,{"$f":"IFERROR(VLOOKUP(C85,Participants!$B$3:$C$102,2,0),\"\")","v":""},null,{"$f":"IFERROR(VLOOKUP(E85,Participants!$B$3:$C$102,2,0),\"\")","v":""},null,null,null,null,null,null,"","","","",null,null,null,null,null,null,"","","","","","","","","",""]
[null,null,null,{"$f":"IFERROR(VLOOKUP(C86,Participants!$B$3:$C$102,2,0),\"\")","v":""},null,{"$f":"IFERROR(VLOOKUP(E86,Participants!$B$3:$C$102,2,0),\"\")","v":""},null,null,null,null,null,null,"","","","",null,null,null,null,null,null,"","","","","","","","","",""]
[null,null,null,{"$f":"IFERROR(VLOOKUP(C87,Participants!$B$3:$C$102,2,0),\"\")","v":""},null,{"$f":"IFERROR(VLOOKUP(E87,Participants!$B$3:$C$102,2,0),\"\")","v":""},null,null,null,null,null,null,"","","","",null,null,null,null,null,null,"","","","","","","","","",""]
[null,null,null,{"$f":"IFERROR(VLOOKUP(C88,Participants!$B$3:$C$102,2,0),\"\")","v":""},null,{"$f":"IFERROR(VLOOKUP(E88,Participants!$B$3:$C$102,2,0),\"\")","v":""},null,null,null,null,null,null,"","","","",null,null,null,null,null,null,"","","","","","","","","",""]
[null,null,null,{"$f":"IFERROR(VLOOKUP(C89,Participants!$B$3:$C$102,2,0),\"\")","v":""},null,{"$f":"IFERROR(VLOOKUP(E89,Participants!$B$3:$C$102,2,0),\"\")","v":""},null,null,null,null,null,null,"","","","",null,null,null,null,null,null,"","","","","","","","","",""]
[null,null,null,{"$f":"IFERROR(VLOOKUP(C90,Participants!$B$3:$C$102,2,0),\"\")","v":""},null,{"$f":"IFERROR(VLOOKUP(E90,Participants!$B$3:$C$102,2,0),\"\")","v":""},null,null,null,null,null,null,"","","","",null,null,null,null,null,null,"","","","","","","","","",""]
[null,null,null,{"$f":"IFERROR(VLOOKUP(C91,Participants!$B$3:$C$102,2,0),\"\")","v":""},null,{"$f":"IFERROR(VLOOKUP(E91,Participants!$B$3:$C$102,2,0),\"\")","v":""},null,null,null,null,null,null,"","","","",null,null,null,null,null,null,"","","","","","","","","",""]
[null,null,null,{"$f":"IFERROR(VLOOKUP(C92,Participants!$B$3:$C$102,2,0),\"\")","v":""},null,{"$f":"IFERROR(VLOOKUP(E92,Participants!$B$3:$C$102,2,0),\"\")","v":""},null,null,null,null,null,null,"","","","",null,null,null,null,null,null,"","","","","","","","","",""]
[null,null,null,{"$f":"IFERROR(VLOOKUP(C93,Participants!$B$3:$C$102,2,0),\"\")","v":""},null,{"$f":"IFERROR(VLOOKUP(E93,Participants!$B$3:$C$102,2,0),\"\")","v":""},null,null,null,null,null,null,"","","","",null,null,null,null,null,null,"","","","","","","","","",""]
[null,null,null,{"$f":"IFERROR(VLOOKUP(C94,Participants!$B$3:$C$102,2,0),\"\")","v":""},null,{"$f":"IFERROR(VLOOKUP(E94,Participants!$B$3:$C$102,2,0),\"\")","v":""},null,null,null,null,null,null,"","","","",null,null,null,null,null,null,"","","","","","","","","",""]
[null,null,null,{"$f":"IFERROR(VLOOKUP(C95,Participants!$B$3:$C$102,2,0),\"\")","v":""},null,{"$f":"IFERROR(VLOOKUP(E95,Participants!$B$3:$C$102,2,0),\"\")","v":""},null,null,null,null,null,null,"","","","",null,null,null,null,null,null,"","","","","","","","","",""]
[null,null,null,{"$f":"IFERROR(VLOOKUP(C96,Participants!$B$3:$C$102,2,0),\"\")","v":""},null,{"$f":"IFERROR(VLOOKUP(E96,Participants!$B$3:$C$102,2,0),\"\")","v":""},null,null,null,null,null,null,"","","","",null,null,null,null,null,null,"","","","","","","","","",""]
[null,null,null,{"$f":"IFERROR(VLOOKUP(C97,Participants!$B$3:$C$102,2,0),\"\")","v":""},null,{"$f":"IFERROR(VLOOKUP(E97,Participants!$B$3:$C$102,2,0),\"\")","v":""},null,null,null,null,null,null,"","","","",null,null,null,null,null,null,"","","","","","","","","",""]
[null,null,null,{"$f":"IFERROR(VLOOKUP(C98,Participants!$B$3:$C$102,2,0),\"\")","v":""},null,{"$f":"IFERROR(VLOOKUP(E98,Participants!$B$3:$C$102,2,0),\"\")","v":""},null,null,null,null,null,null,"","","","",null,null,null,null,null,null,"","","","","","","","","",""]
[null,null,null,{"$f":"IFERROR(VLOOKUP(C99,Participants!$B$3:$C$102,2,0),\"\")","v":""},null,{"$f":"IFERROR(VLOOKUP(E99,Participants!$B$3:$C$102,2,0),\"\")","v":""},null,null,null,null,null,null,"","","","",null,null,null,null,null,null,"","","","","","","","","",""]
[null,null,null,{"$f":"IFERROR(VLOOKUP(C100,Participants!$B$3:$C$102,2,0),\"\")","v":""},null,{"$f":"IFERROR(VLOOKUP(E100,Participants!$B$3:$C$102,2,0),\"\")","v":""},null,null,null,null,null,null,"","","","",null,null,null,null,null,null,"","","","","","","","","",""]
[null,null,null,{"$f":"IFERROR(VLOOKUP(C101,Participants!$B$3:$C$102,2,0),\"\")","v":""},null,{"$f":"IFERROR(VLOOKUP(E101,Participants!$B$3:$C$102,2,0),\"\")","v":""},null,null,null,null,null,null,"","","","",null,null,null,null,null,null,"","","","","","","","","",""]
[null,null,null,{"$f":"IFERROR(VLOOKUP(C102,Participants!$B$3:$C$102,2,0),\"\")","v":""},null,{"$f":"IFERROR(VLOOKUP(E102,Participants!$B$3:$C$102,2,0),\"\")","v":""},null,null,null,null,null,null,"","","","",null,null,null,null,null,null,"","","","","","","","","",""]
[null,null,null,{"$f":"IFERROR(VLOOKUP(C103,Participants!$B$3:$C$102,2,0),\"\")","v":""},null,{"$f":"IFERROR(VLOOKUP(E103,Participants!$B$3:$C$102,2,0),\"\")","v":""},null,null,null,null,null,null,"","","","",null,null,null,null,null,null,"","","","","","","","","",""]

{"sheet":"Settings","index":3,"n_rows":6,"n_cols":5,"rows_kept":6,"cut":false,"hidden":true,"merged":[]}
[null,{"$f":"Language!$E$24","v":"Settings"}]
[]
[null,{"$f":"Language!$E$25","v":"ELO Divisor:"},400,null,{"$f":"Language!$E$26","v":"600  for soccer rating numbers (men)"}]
[null,null,null,null,{"$f":"Language!$E$33","v":"400  for soccer rating numbers (women)"}]
[null,null,null,null,{"$f":"Language!$E$27","v":"400  for chess skill levels"}]
[null,null,null,null,{"$f":"Language!$E$28","v":"200  for table tennis"}]

{"sheet":"Language","index":4,"n_rows":49,"n_cols":12,"rows_kept":49,"cut":false,"hidden":false,"merged":[[0,5,0,7],[1,5,1,6],[2,3,3,3],[2,4,3,4],[2,5,3,5],[2,6,3,6],[2,7,3,7]]}
[null,null,null,null,null,{"$f":"$E$31","v":"Language"},null,null,null,"english",{"$f":"_xlfn.UNICHAR(8592)","v":"←"},{"$f":"$E$46","v":"Choose language"}]
[]
[null,"english",{"$f":"IF(AND($J$1<>B4,$J$1<>B5),1,0)","v":1},null,null,"english","deutsch","my language"]
[null,"deutsch",{"$f":"IF($J$1=B4,1,0)","v":0}]
[null,"my language",{"$f":"IF($J$1=B5,1,0)","v":0},null,null,{"$f":"$E$30","v":"Captions"}]
[null,null,null,null,{"$f":"IF($C$3,F6,IF($C$4,G6,IF($H6<>\"\",$H6,$F6)))","v":"Participants"},"Participants","Teilnehmer"]
[null,null,null,null,{"$f":"IF($C$3,F7,IF($C$4,G7,IF($H7<>\"\",$H7,$F7)))","v":"Starting number"},"Starting number","Startwert"]
[null,null,null,null,"ID","ID","ID"]
[null,null,null,null,"No.","No.","Nr."]
[null,null,null,null,"Name","Name","Name"]
[null,null,null,null,"Ranking","Ranking","Rangliste"]
[null,null,null,null,"Old Date:","Old Date:","Altes Datum:"]
[null,null,null,null,"New Date:","New Date:","Neues Datum:"]
[null,null,null,null,"Matches","Matches","Spiele"]
[null,null,null,null,"New Ranking","New Ranking","Neue Rangliste"]
[null,null,null,null,"Date","Date","Datum"]
[null,null,null,null,"ID 1","ID 1","ID 1"]
[null,null,null,null,"ID 2","ID 2","ID 2"]
[null,null,null,null,"Result","Result","Ergebnis"]
[null,null,null,null,"Weight","Weight","Wichtung"]
[null,null,null,null,"Penalty","Penalty","Elfmetersch."]
[null,null,null,null,"KO round","KO round","KO-Runde"]
[null,null,null,null,"Rank","Rank","Rang"]
[null,null,null,null,"Settings","Settings","Einstellungen"]
[null,null,null,null,"ELO Divisor:","ELO Divisor:","ELO Divisor:"]
[null,null,null,null,"600  for soccer rating numbers (men)","600  for soccer rating numbers (men)","600  für Fußball-Bewertungszahlen (Männer)"]
[null,null,null,null,"400  for chess skill levels","400  for chess skill levels","400  für Schach-Spielstärken"]
[null,null,null,null,"200  for table tennis","200  for table tennis","200  für Tischtennis"]
[null,null,null,null,"Messages","Messages","Meldungen"]
[null,null,null,null,"Captions","Captions","Überschriften"]
[null,null,null,null,"Language","Language","Sprache"]
[null,null,null,null,"Home advant.","Home advant.","Heimvorteil"]
[null,null,null,null,"400  for soccer rating numbers (women)","400  for soccer rating numbers (women)","400  für Fußball-Bewertungszahlen (Frauen)"]
[null,null,null,null,0]
[null,null,null,null,0]
[null,null,null,null,"Messages",{"$f":"$E$29","v":"Messages"}]
[null,null,null,null,"Old Date is missing!","Old Date is missing!","Altes Datum fehlt!"]
[null,null,null,null,"New Date is missing!","New Date is missing!","Neues Datum fehlt!"]
[null,null,null,null,"Old Date not found on worksheet 'Participants'!","Old Date not found on worksheet 'Participants'!","Altes Datum nicht gefunden auf dem Tabellenblatt 'Participants'!"]
[null,null,null,null,"Date is missing!","Date is missing!","Datum fehlt!"]
[null,null,null,null,"Participant is missing!","Participant is missing!","Teilnehmer fehlt!"]
[null,null,null,null,"Result is missing!","Result is missing!","Ergebnis fehlt!"]
[null,null,null,null,"Weight is missing!","Weight is missing!","Wichtung fehlt!"]
[null,null,null,null,"No participants entered on worksheet 'Participants'!","No participants entered on worksheet 'Participants'!","Keine Teilnehmer eingetragen auf dem Tabellenblatt 'Participants'!"]
[null,null,null,null,"No matches entered!","No matches entered!","Keine Spiele eingetragen!"]
[null,null,null,null,"Choose language","Choose language","Sprache wählen"]
[null,null,null,null,"ID not found!","ID not found!","ID nicht gefunden!"]
[null,null,null,null,0]
[null,null,null,null,0]

{"sheet":"Info","index":5,"n_rows":45,"n_cols":16,"rows_kept":45,"cut":false,"hidden":false,"merged":[[43,1,43,7],[43,9,43,15],[44,1,44,7],[44,9,44,15]]}
[null,null,null,null,null,null,null,null,null,null,null,null,null,null,null,"hb / Version 1.0"]
[null,"English",null,null,null,null,null,null,null,"Deutsch",null,null,null,null,null,"2023-04-13"]
[]
[]
[]
[]
[]
[]
[]
[]
[]
[]
[]
[]
[]
[]
[]
[]
[]
[]
[]
[]
[]
[]
[]
[]
[]
[]
[]
[]
[]
[]
[]
[]
[]
[]
[]
[]
[]
[]
[]
[]
[]
[null,"If there are any discrepancies, I am very grateful for notification!",null,null,null,null,null,null,null,"Bei Unstimmigkeiten bin ich für eine entsprechende Benachrichtigung sehr dankbar!"]
[null,"mail@hermann-baum.de",null,null,null,null,null,null,null,"mail@hermann-baum.de"]