{"text_format":"1","workbook":"xlsx","n_sheets":6,"sheets":["Participants","2023-04-12","Template","Settings","Language","Info"],"not_rendered":{"charts":0,"images":2,"macros":1,"external_links":0,"defined_names":0,"comments":0,"pivot_tables":0},"unopened":[],"bounds":{"document_bytes":16777216,"sheet_cells":100000,"rows_first":2000,"rows_last":500,"rows_between":2000,"halvings":0,"cell_chars":16384,"cell_head_chars":4096},"cells_cut":0,"cells_raw":0,"read":"whole","date_system":"1900"}

{"sheet":"Participants","index":0,"n_rows":102,"n_cols":5,"rows_kept":102,"cut":false,"hidden":false,"merged":[]}
[{"$f":"Language!$E$6","v":"Participants"},null,null,{"$f":"Language!$E$7","v":"Starting number"}]
[{"$f":"Language!$E$9","v":"No."},{"$f":"Language!$E$8","v":"ID"},{"$f":"Language!$E$10","v":"Name"},"2023-03-24","2023-04-12"]
["1.","USA","USA",2091.38,2091.4651970069663]
["2.","GER","Germany",2068.12,2058.4664312367008]
["3.","SWE","Sweden",2064.67,2064.67]
["4.","ENG","England",2055.8200000000002,2046.5242459673245]
["5.","FRA","France",2021.02,2021.02]
["6.","CAN","Canada",2001.56,2001.56]
["7.","ESP","Spain",1997.65,1997.65]
["8.","NED","Netherlands",1991.45,1985.5449380847715]
["9.","BRA","Brazil",1972.99,1989.8861632223318]
["10.","AUS","Australia",1917.91,1918.1591355944697]
["11.","JAP","Japan",1917.33,1917.33]
["12.","NOR","Norway",1905.58,1905.58]
["13.","CHN","China",1856.98,1856.98]
["14.","ISL","Iceland",1851.77,1851.77]
["15.","DEN","Denmark",1851.25,1851.25]
["16.","ITA","Italy",1845.93,1845.93]
["17.","KOR","South Korea",1840.68,1840.68]
["18.","AUT","Austria",1808.69,1808.69]
["19.","BEL","Belgium",1804.02,1804.02]
["20.","SUI","Switzerland",1772.27,1772.27]
["21.","POR","Portugal",1752.53,1752.53]
["22.","IRL","Ireland",1742.25,1742.1648029930338]
["23.","SCO","Scotland",1724.17,1737.4800025365216]
["24.","RUS","Russia",1717.06,1717.06]
["25.","NZL","New Zealand",1706.96,1706.96]
["26.","COL","Colombia",1703.61,1703.61]
["27.","CZE","Czechia",1693.91,1693.91]
["28.","ARG","Argentina",1682.45,1682.45]
{"$rows_left_out":73}
{"sheet":"2023-04-12","index":1,"n_rows":103,"n_cols":32,"rows_kept":103,"cut":false,"hidden":false,"merged":[[0,8,2,8],[0,9,2,9],[2,6,2,7]]}
[null,{"$f":"Language!$E$11","v":"Ranking"},null,{"$f":"Language!$E$12","v":"Old Date:"},null,{"$f":"Language!$E$13","v":"New Date:"},null,null,{"$f":"Language!$E$20","v":"Weight"},{"$f":"Language!$E$32","v":"Home advant."}]
[null,{"$f":"Language!$E$14","v":"Matches"},null,"2023-03-24","\u009e","2023-04-12",null,null,null,null,null,null,{"$f":"Language!$E$15","v":"New Ranking"},null,null,null,null,"Ranking List unsorted",null,null,null,null,"Matches sorted"]
[null,{"$f":"Language!$E$16","v":"Date"},{"$f":"Language!$E$17","v":"ID 1"},null,{"$f":"Language!$E$18","v":"ID 2"},null,{"$f":"Language!$E$19","v":"Result"},null,null,null,null,null,{"$f":"Language!$E$23","v":"Rank"},null,null,null,null,"ID"]
[null,"2023-04-07","NED",{"$f":"IFERROR(VLOOKUP(C4,Participants!$B$3:$C$102,2,0),\"\")","v":"Netherlands"},"GER",{"$f":"IFERROR(VLOOKUP(E4,Participants!$B$3:$C$102,2,0),\"\")","v":"Germany"},0,1,30,null,null,null,{"$f":"IF(N5<>\"\",ROW()-3,\"\")","v":1},{"$f":"sortieren($S$4:$U$103,2,-1)","v":"USA"},2091.4651970069663,8.5197006966154731E-2,null,"USA","USA",2091.4651970069663,8.5197006966154731E-2,null,{"$f":"sortieren($B$4:$K$103)","v":"2023-04-06"},"POL","Poland","CRC","Costa Rica",2,1,15,"",""]
[null,"2023-04-08","USA",{"$f":"IFERROR(VLOOKUP(C5,Participants!$B$3:$C$102,2,0),\"\")","v":"USA"},"IRL",{"$f":"IFERROR(VLOOKUP(E5,Participants!$B$3:$C$102,2,0),\"\")","v":"Ireland"},2,0,15,null,null,null,{"$f":"IF(N5<>\"\",ROW()-3,\"\")","v":2},"Sweden",2064.67,0,null,"GER","Germany",2058.4664312367008,-9.653568763299063,null,"2023-04-07","SCO","Scotland","AUS","Australia",1,0,15,"",""]
[null,"2023-04-11","GER",{"$f":"IFERROR(VLOOKUP(C6,Participants!$B$3:$C$102,2,0),\"\")","v":"Germany"},"BRA",{"$f":"IFERROR(VLOOKUP(E6,Participants!$B$3:$C$102,2,0),\"\")","v":"Brazil"},0,2,30,null,null,null,{"$f":"IF(N6<>\"\",ROW()-3,\"\")","v":3},"Germany",2058.4664312367008,-9.653568763299063,null,"SWE","Sweden",2064.67,0,null,"2023-04-07","NED","Netherlands","GER","Germany",0,1,30,"",""]
[null,"2023-04-11","NED",{"$f":"IFERROR(VLOOKUP(C7,Participants!$B$3:$C$102,2,0),\"\")","v":"Netherlands"},"POL",{"$f":"IFERROR(VLOOKUP(E7,Participants!$B$3:$C$102,2,0),\"\")","v":"Poland"},4,1,15,null,null,null,4,"England",2046.5242459673245,-9.2957540326756316,null,"ENG","England",2046.5242459673245,-9.2957540326756316,null,"2023-04-08","USA","USA","IRL","Ireland",2,0,15,"",""]
[null,"2023-04-12","USA",{"$f":"IFERROR(VLOOKUP(C8,Participants!$B$3:$C$102,2,0),\"\")","v":"USA"},"IRL",{"$f":"IFERROR(VLOOKUP(E8,Participants!$B$3:$C$102,2,0),\"\")","v":"Ireland"},1,0,15,null,null,null,5,"France",2021.02,0,null,"FRA","France",2021.02,0,null,"2023-04-11","SCO","Scotland","CRC","Costa Rica",4,0,15,"",""]
[null,"2023-04-06","POL",{"$f":"IFERROR(VLOOKUP(C9,Participants!$B$3:$C$102,2,0),\"\")","v":"Poland"},"CRC",{"$f":"IFERROR(VLOOKUP(E9,Participants!$B$3:$C$102,2,0),\"\")","v":"Costa Rica"},2,1,15,null,null,null,6,"Canada",2001.56,0,null,"CAN","Canada",2001.56,0,null,"2023-04-11","ENG","England","AUS","Australia",0,2,15,"",""]
[null,"2023-04-11","SCO",{"$f":"IFERROR(VLOOKUP(C10,Participants!$B$3:$C$102,2,0),\"\")","v":"Scotland"},"CRC",{"$f":"IFERROR(VLOOKUP(E10,Participants!$B$3:$C$102,2,0),\"\")","v":"Costa Rica"},4,0,15,null,null,null,7,"Spain",1997.65,0,null,"ESP","Spain",1997.65,0,null,"2023-04-11","GER","Germany","BRA","Brazil",0,2,30,"",""]
[null,"2023-04-07","SCO",{"$f":"IFERROR(VLOOKUP(C11,Participants!$B$3:$C$102,2,0),\"\")","v":"Scotland"},"AUS",{"$f":"IFERROR(VLOOKUP(E11,Participants!$B$3:$C$102,2,0),\"\")","v":"Australia"},1,0,15,null,null,null,8,"Brazil",1989.8861632223318,16.896163222331779,null,"NED","Netherlands",1985.5449380847715,-5.9050619152285435,null,"2023-04-11","NED","Netherlands","POL","Poland",4,1,15,"",""]
[null,"2023-04-11","ENG",{"$f":"IFERROR(VLOOKUP(C12,Participants!$B$3:$C$102,2,0),\"\")","v":"England"},"AUS",{"$f":"IFERROR(VLOOKUP(E12,Participants!$B$3:$C$102,2,0),\"\")","v":"Australia"},0,2,15,null,null,null,9,"Netherlands",1985.5449380847715,-5.9050619152285435,null,"BRA","Brazil",1989.8861632223318,16.896163222331779,null,"2023-04-12","USA","USA","IRL","Ireland",1,0,15,"",""]
[null,null,null,{"$f":"IFERROR(VLOOKUP(C13,Participants!$B$3:$C$102,2,0),\"\")","v":""},null,{"$f":"IFERROR(VLOOKUP(E13,Participants!$B$3:$C$102,2,0),\"\")","v":""},null,null,null,null,null,null,10,"Australia",1918.1591355944697,0.24913559446963518,null,"AUS","Australia",1918.1591355944697,0.24913559446963518,null,"","","","","","","","","",""]
[null,null,null,{"$f":"IFERROR(VLOOKUP(C14,Participants!$B$3:$C$102,2,0),\"\")","v":""},null,{"$f":"IFERROR(VLOOKUP(E14,Participants!$B$3:$C$102,2,0),\"\")","v":""},null,null,null,null,null,null,11,"Japan",1917.33,0,null,"JAP","Japan",1917.33,0,null,"","","","","","","","","",""]
[null,null,null,{"$f":"IFERROR(VLOOKUP(C15,Participants!$B$3:$C$102,2,0),\"\")","v":""},null,{"$f":"IFERROR(VLOOKUP(E15,Participants!$B$3:$C$102,2,0),\"\")","v":""},null,null,null,null,null,null,12,"Norway",1905.58,0,null,"NOR","Norway",1905.58,0,null,"","","","","","","","","",""]
[null,null,null,{"$f":"IFERROR(VLOOKUP(C16,Participants!$B$3:$C$102,2,0),\"\")","v":""},null,{"$f":"IFERROR(VLOOKUP(E16,Participants!$B$3:$C$102,2,0),\"\")","v":""},null,null,null,null,null,null,13,"China",1856.98,0,null,"CHN","China",1856.98,0,null,"","","","","","","","","",""]
[null,null,null,{"$f":"IFERROR(VLOOKUP(C17,Participants!$B$3:$C$102,2,0),\"\")","v":""},null,{"$f":"IFERROR(VLOOKUP(E17,Participants!$B$3:$C$102,2,0),\"\")","v":""},null,null,null,null,null,null,14,"Iceland",1851.77,0,null,"ISL","Iceland",1851.77,0,null,"","","","","","","","","",""]
[null,null,null,{"$f":"IFERROR(VLOOKUP(C18,Participants!$B$3:$C$102,2,0),\"\")","v":""},null,{"$f":"IFERROR(VLOOKUP(E18,Participants!$B$3:$C$102,2,0),\"\")","v":""},null,null,null,null,null,null,15,"Denmark",1851.25,0,null,"DEN","Denmark",1851.25,0,null,"","","","","","","","","",""]
[null,null,null,{"$f":"IFERROR(VLOOKUP(C19,Participants!$B$3:$C$102,2,0),\"\")","v":""},null,{"$f":"IFERROR(VLOOKUP(E19,Participants!$B$3:$C$102,2,0),\"\")","v":""},null,null,null,null,null,null,16,"Italy",1845.93,0,null,"ITA","Italy",1845.93,0,null,"","","","","","","","","",""]
[null,null,null,{"$f":"IFERROR(VLOOKUP(C20,Participants!$B$3:$C$102,2,0),\"\")","v":""},null,{"$f":"IFERROR(VLOOKUP(E20,Participants!$B$3:$C$102,2,0),\"\")","v":""},null,null,null,null,null,null,17,"South Korea",1840.68,0,null,"KOR","South Korea",1840.68,0,null,"","","","","","","","","",""]
[null,null,null,{"$f":"IFERROR(VLOOKUP(C21,Participants!$B$3:$C$102,2,0),\"\")","v":""},null,{"$f":"IFERROR(VLOOKUP(E21,Participants!$B$3:$C$102,2,0),\"\")","v":""},null,null,null,null,null,null,18,"Austria",1808.69,0,null,"AUT","Austria",1808.69,0,null,"","","","","","","","","",""]
[null,null,null,{"$f":"IFERROR(VLOOKUP(C22,Participants!$B$3:$C$102,2,0),\"\")","v":""},null,{"$f":"IFERROR(VLOOKUP(E22,Participants!$B$3:$C$102,2,0),\"\")","v":""},null,null,null,null,null,null,19,"Belgium",1804.02,0,null,"BEL","Belgium",1804.02,0,null,"","","","","","","","","",""]
[null,null,null,{"$f":"IFERROR(VLOOKUP(C23,Participants!$B$3:$C$102,2,0),\"\")","v":""},null,{"$f":"IFERROR(VLOOKUP(E23,Participants!$B$3:$C$102,2,0),\"\")","v":""},null,null,null,null,null,null,20,"Switzerland",1772.27,0,null,"SUI","Switzerland",1772.27,0,null,"","","","","","","","","",""]
[null,null,null,{"$f":"IFERROR(VLOOKUP(C24,Participants!$B$3:$C$102,2,0),\"\")","v":""},null,{"$f":"IFERROR(VLOOKUP(E24,Participants!$B$3:$C$102,2,0),\"\")","v":""},null,null,null,null,null,null,21,"Portugal",1752.53,0,null,"POR","Portugal",1752.53,0,null,"","","","","","","","","",""]
[null,null,null,{"$f":"IFERROR(VLOOKUP(C25,Participants!$B$3:$C$102,2,0),\"\")","v":""},null,{"$f":"IFERROR(VLOOKUP(E25,Participants!$B$3:$C$102,2,0),\"\")","v":""},null,null,null,null,null,null,22,"Ireland",1742.1648029930338,-8.5197006966154731E-2,null,"IRL","Ireland",1742.1648029930338,-8.5197006966154731E-2,null,"","","","","","","","","",""]
[null,null,null,{"$f":"IFERROR(VLOOKUP(C26,Participants!$B$3:$C$102,2,0),\"\")","v":""},null,{"$f":"IFERROR(VLOOKUP(E26,Participants!$B$3:$C$102,2,0),\"\")","v":""},null,null,null,null,null,null,23,"Scotland",1737.4800025365216,13.310002536521552,null,"SCO","Scotland",1737.4800025365216,13.310002536521552,null,"","","","","","","","","",""]
[null,null,null,{"$f":"IFERROR(VLOOKUP(C27,Participants!$B$3:$C$102,2,0),\"\")","v":""},null,{"$f":"IFERROR(VLOOKUP(E27,Participants!$B$3:$C$102,2,0),\"\")","v":""},null,null,null,null,null,null,24,"Russia",1717.06,0,null,"RUS","Russia",1717.06,0,null,"","","","","","","","","",""]
[null,null,null,{"$f":"IFERROR(VLOOKUP(C28,Participants!$B$3:$C$102,2,0),\"\")","v":""},null,{"$f":"IFERROR(VLOOKUP(E28,Participants!$B$3:$C$102,2,0),\"\")","v":""},null,null,null,null,null,null,25,"New Zealand",1706.96,0,null,"NZL","New Zealand",1706.96,0,null,"","","","","","","","","",""]
[null,null,null,{"$f":"IFERROR(VLOOKUP(C29,Participants!$B$3:$C$102,2,0),\"\")","v":""},null,{"$f":"IFERROR(VLOOKUP(E29,Participants!$B$3:$C$102,2,0),\"\")","v":""},null,null,null,null,null,null,26,"Colombia",1703.61,0,null,"COL","Colombia",1703.61,0,null,"","","","","","","","","",""]
[null,null,null,{"$f":"IFERROR(VLOOKUP(C30,Participants!$B$3:$C$102,2,0),\"\")","v":""},null,{"$f":"IFERROR(VLOOKUP(E30,Participants!$B$3:$C$102,2,0),\"\")","v":""},null,null,null,null,null,null,27,"Czechia",1693.91,0,null,"CZE","Czechia",1693.91,0,null,"","","","","","","","","",""]
{"$rows_left_out":74}
{"sheet":"Template","index":2,"n_rows":103,"n_cols":32,"rows_kept":103,"cut":false,"hidden":false,"merged":[[0,8,2,8],[0,9,2,9],[2,6,2,7]]}
[null,{"$f":"Language!$E$11","v":"Ranking"},null,{"$f":"Language!$E$12","v":"Old Date:"},null,{"$f":"Language!$E$13","v":"New Date:"},null,null,{"$f":"Language!$E$20","v":"Weight"},{"$f":"Language!$E$32","v":"Home advant."}]
[null,{"$f":"Language!$E$14","v":"Matches"},null,null,"\u009e",null,null,null,null,null,null,null,{"$f":"Language!$E$15","v":"New Ranking"},null,null,null,null,"Ranking List unsorted",null,null,null,null,"Matches sorted"]
[null,{"$f":"Language!$E$16","v":"Date"},{"$f":"Language!$E$17","v":"ID 1"},null,{"$f":"Language!$E$18","v":"ID 2"},null,{"$f":"Language!$E$19","v":"Result"},null,null,null,null,null,{"$f":"Language!$E$23","v":"Rank"},null,null,null,null,"ID"]
[null,null,null,{"$f":"IFERROR(VLOOKUP(C4,Participants!$B$3:$C$102,2,0),\"\")","v":""},null,{"$f":"IFERROR(VLOOKUP(E4,Participants!$B$3:$C$102,2,0),\"\")","v":""},null,null,null,null,null,null,{"$f":"IF(N5<>\"\",ROW()-3,\"\")","v":""},{"$f":"sortieren($S$4:$U$103,2,-1)","v":""},"","",null,null,null,null,null,null,{"$f":"sortieren($B$4:$K$103)","v":""},"","","","","","","","",""]
[null,null,null,{"$f":"IFERROR(VLOOKUP(C5,Participants!$B$3:$C$102,2,0),\"\")","v":""},null,{"$f":"IFERROR(VLOOKUP(E5,Participants!$B$3:$C$102,2,0),\"\")","v":""},null,null,null,null,null,null,{"$f":"IF(N5<>\"\",ROW()-3,\"\")","v":""},"","","",null,null,null,null,null,null,"","","","","","","","","",""]
[null,null,null,{"$f":"IFERROR(VLOOKUP(C6,Participants!$B$3:$C$102,2,0),\"\")","v":""},null,{"$f":"IFERROR(VLOOKUP(E6,Participants!$B$3:$C$102,2,0),\"\")","v":""},null,null,null,null,null,null,{"$f":"IF(N6<>\"\",ROW()-3,\"\")","v":""},"","","",null,null,null,null,null,null,"","","","","","","","","",""]
[null,null,null,{"$f":"IFERROR(VLOOKUP(C7,Participants!$B$3:$C$102,2,0),\"\")","v":""},null,{"$f":"IFERROR(VLOOKUP(E7,Participants!$B$3:$C$102,2,0),\"\")","v":""},null,null,null,null,null,null,"","","","",null,null,null,null,null,null,"","","","","","","","","",""]
[null,null,null,{"$f":"IFERROR(VLOOKUP(C8,Participants!$B$3:$C$102,2,0),\"\")","v":""},null,{"$f":"IFERROR(VLOOKUP(E8,Participants!$B$3:$C$102,2,0),\"\")","v":""},null,null,null,null,null,null,"","","","",null,null,null,null,null,null,"","","","","","","","","",""]
[null,null,null,{"$f":"IFERROR(VLOOKUP(C9,Participants!$B$3:$C$102,2,0),\"\")","v":""},null,{"$f":"IFERROR(VLOOKUP(E9,Participants!$B$3:$C$102,2,0),\"\")","v":""},null,null,null,null,null,null,"","","","",null,null,null,null,null,null,"","","","","","","","","",""]
[null,null,null,{"$f":"IFERROR(VLOOKUP(C10,Participants!$B$3:$C$102,2,0),\"\")","v":""},null,{"$f":"IFERROR(VLOOKUP(E10,Participants!$B$3:$C$102,2,0),\"\")","v":""},null,null,null,null,null,null,"","","","",null,null,null,null,null,null,"","","","","","","","","",""]
[null,null,null,{"$f":"IFERROR(VLOOKUP(C11,Participants!$B$3:$C$102,2,0),\"\")","v":""},null,{"$f":"IFERROR(VLOOKUP(E11,Participants!$B$3:$C$102,2,0),\"\")","v":""},null,null,null,null,null,null,"","","","",null,null,null,null,null,null,"","","","","","","","","",""]
[null,null,null,{"$f":"IFERROR(VLOOKUP(C12,Participants!$B$3:$C$102,2,0),\"\")","v":""},null,{"$f":"IFERROR(VLOOKUP(E12,Participants!$B$3:$C$102,2,0),\"\")","v":""},null,null,null,null,null,null,"","","","",null,null,null,null,null,null,"","","","","","","","","",""]
[null,null,null,{"$f":"IFERROR(VLOOKUP(C13,Participants!$B$3:$C$102,2,0),\"\")","v":""},null,{"$f":"IFERROR(VLOOKUP(E13,Participants!$B$3:$C$102,2,0),\"\")","v":""},null,null,null,null,null,null,"","","","",null,null,null,null,null,null,"","","","","","","","","",""]
[null,null,null,{"$f":"IFERROR(VLOOKUP(C14,Participants!$B$3:$C$102,2,0),\"\")","v":""},null,{"$f":"IFERROR(VLOOKUP(E14,Participants!$B$3:$C$102,2,0),\"\")","v":""},null,null,null,null,null,null,"","","","",null,null,null,null,null,null,"","","","","","","","","",""]
[null,null,null,{"$f":"IFERROR(VLOOKUP(C15,Participants!$B$3:$C$102,2,0),\"\")","v":""},null,{"$f":"IFERROR(VLOOKUP(E15,Participants!$B$3:$C$102,2,0),\"\")","v":""},null,null,null,null,null,null,"","","","",null,null,null,null,null,null,"","","","","","","","","",""]
[null,null,null,{"$f":"IFERROR(VLOOKUP(C16,Participants!$B$3:$C$102,2,0),\"\")","v":""},null,{"$f":"IFERROR(VLOOKUP(E16,Participants!$B$3:$C$102,2,0),\"\")","v":""},null,null,null,null,null,null,"","","","",null,null,null,null,null,null,"","","","","","","","","",""]
[null,null,null,{"$f":"IFERROR(VLOOKUP(C17,Participants!$B$3:$C$102,2,0),\"\")","v":""},null,{"$f":"IFERROR(VLOOKUP(E17,Participants!$B$3:$C$102,2,0),\"\")","v":""},null,null,null,null,null,null,"","","","",null,null,null,null,null,null,"","","","","","","","","",""]
[null,null,null,{"$f":"IFERROR(VLOOKUP(C18,Participants!$B$3:$C$102,2,0),\"\")","v":""},null,{"$f":"IFERROR(VLOOKUP(E18,Participants!$B$3:$C$102,2,0),\"\")","v":""},null,null,null,null,null,null,"","","","",null,null,null,null,null,null,"","","","","","","","","",""]
[null,null,null,{"$f":"IFERROR(VLOOKUP(C19,Participants!$B$3:$C$102,2,0),\"\")","v":""},null,{"$f":"IFERROR(VLOOKUP(E19,Participants!$B$3:$C$102,2,0),\"\")","v":""},null,null,null,null,null,null,"","","","",null,null,null,null,null,null,"","","","","","","","","",""]
[null,null,null,{"$f":"IFERROR(VLOOKUP(C20,Participants!$B$3:$C$102,2,0),\"\")","v":""},null,{"$f":"IFERROR(VLOOKUP(E20,Participants!$B$3:$C$102,2,0),\"\")","v":""},null,null,null,null,null,null,"","","","",null,null,null,null,null,null,"","","","","","","","","",""]
[null,null,null,{"$f":"IFERROR(VLOOKUP(C21,Participants!$B$3:$C$102,2,0),\"\")","v":""},null,{"$f":"IFERROR(VLOOKUP(E21,Participants!$B$3:$C$102,2,0),\"\")","v":""},null,null,null,null,null,null,"","","","",null,null,null,null,null,null,"","","","","","","","","",""]
[null,null,null,{"$f":"IFERROR(VLOOKUP(C22,Participants!$B$3:$C$102,2,0),\"\")","v":""},null,{"$f":"IFERROR(VLOOKUP(E22,Participants!$B$3:$C$102,2,0),\"\")","v":""},null,null,null,null,null,null,"","","","",null,null,null,null,null,null,"","","","","","","","","",""]
[null,null,null,{"$f":"IFERROR(VLOOKUP(C23,Participants!$B$3:$C$102,2,0),\"\")","v":""},null,{"$f":"IFERROR(VLOOKUP(E23,Participants!$B$3:$C$102,2,0),\"\")","v":""},null,null,null,null,null,null,"","","","",null,null,null,null,null,null,"","","","","","","","","",""]
[null,null,null,{"$f":"IFERROR(VLOOKUP(C24,Participants!$B$3:$C$102,2,0),\"\")","v":""},null,{"$f":"IFERROR(VLOOKUP(E24,Participants!$B$3:$C$102,2,0),\"\")","v":""},null,null,null,null,null,null,"","","","",null,null,null,null,null,null,"","","","","","","","","",""]
[null,null,null,{"$f":"IFERROR(VLOOKUP(C25,Participants!$B$3:$C$102,2,0),\"\")","v":""},null,{"$f":"IFERROR(VLOOKUP(E25,Participants!$B$3:$C$102,2,0),\"\")","v":""},null,null,null,null,null,null,"","","","",null,null,null,null,null,null,"","","","","","","","","",""]
[null,null,null,{"$f":"IFERROR(VLOOKUP(C26,Participants!$B$3:$C$102,2,0),\"\")","v":""},null,{"$f":"IFERROR(VLOOKUP(E26,Participants!$B$3:$C$102,2,0),\"\")","v":""},null,null,null,null,null,null,"","","","",null,null,null,null,null,null,"","","","","","","","","",""]
[null,null,null,{"$f":"IFERROR(VLOOKUP(C27,Participants!$B$3:$C$102,2,0),\"\")","v":""},null,{"$f":"IFERROR(VLOOKUP(E27,Participants!$B$3:$C$102,2,0),\"\")","v":""},null,null,null,null,null,null,"","","","",null,null,null,null,null,null,"","","","","","","","","",""]
[null,null,null,{"$f":"IFERROR(VLOOKUP(C28,Participants!$B$3:$C$102,2,0),\"\")","v":""},null,{"$f":"IFERROR(VLOOKUP(E28,Participants!$B$3:$C$102,2,0),\"\")","v":""},null,null,null,null,null,null,"","","","",null,null,null,null,null,null,"","","","","","","","","",""]
[null,null,null,{"$f":"IFERROR(VLOOKUP(C29,Participants!$B$3:$C$102,2,0),\"\")","v":""},null,{"$f":"IFERROR(VLOOKUP(E29,Participants!$B$3:$C$102,2,0),\"\")","v":""},null,null,null,null,null,null,"","","","",null,null,null,null,null,null,"","","","","","","","","",""]
[null,null,null,{"$f":"IFERROR(VLOOKUP(C30,Participants!$B$3:$C$102,2,0),\"\")","v":""},null,{"$f":"IFERROR(VLOOKUP(E30,Participants!$B$3:$C$102,2,0),\"\")","v":""},null,null,null,null,null,null,"","","","",null,null,null,null,null,null,"","","","","","","","","",""]
{"$rows_left_out":74}
{"sheet":"Settings","index":3,"n_rows":6,"n_cols":5,"rows_kept":6,"cut":false,"hidden":true,"merged":[]}
[null,{"$f":"Language!$E$24","v":"Settings"}]
[]
[null,{"$f":"Language!$E$25","v":"ELO Divisor:"},400,null,{"$f":"Language!$E$26","v":"600  for soccer rating numbers (men)"}]
[null,null,null,null,{"$f":"Language!$E$33","v":"400  for soccer rating numbers (women)"}]
[null,null,null,null,{"$f":"Language!$E$27","v":"400  for chess skill levels"}]
[null,null,null,null,{"$f":"Language!$E$28","v":"200  for table tennis"}]

{"sheet":"Language","index":4,"n_rows":49,"n_cols":12,"rows_kept":49,"cut":false,"hidden":false,"merged":[[0,5,0,7],[1,5,1,6],[2,3,3,3],[2,4,3,4],[2,5,3,5],[2,6,3,6],[2,7,3,7]]}
[null,null,null,null,null,{"$f":"$E$31","v":"Language"},null,null,null,"english",{"$f":"_xlfn.UNICHAR(8592)","v":"←"},{"$f":"$E$46","v":"Choose language"}]
[]
[null,"english",{"$f":"IF(AND($J$1<>B4,$J$1<>B5),1,0)","v":1},null,null,"english","deutsch","my language"]
[null,"deutsch",{"$f":"IF($J$1=B4,1,0)","v":0}]
[null,"my language",{"$f":"IF($J$1=B5,1,0)","v":0},null,null,{"$f":"$E$30","v":"Captions"}]
[null,null,null,null,{"$f":"IF($C$3,F6,IF($C$4,G6,IF($H6<>\"\",$H6,$F6)))","v":"Participants"},"Participants","Teilnehmer"]
[null,null,null,null,{"$f":"IF($C$3,F7,IF($C$4,G7,IF($H7<>\"\",$H7,$F7)))","v":"Starting number"},"Starting number","Startwert"]
[null,null,null,null,"ID","ID","ID"]
[null,null,null,null,"No.","No.","Nr."]
[null,null,null,null,"Name","Name","Name"]
[null,null,null,null,"Ranking","Ranking","Rangliste"]
[null,null,null,null,"Old Date:","Old Date:","Altes Datum:"]
[null,null,null,null,"New Date:","New Date:","Neues Datum:"]
[null,null,null,null,"Matches","Matches","Spiele"]
[null,null,null,null,"New Ranking","New Ranking","Neue Rangliste"]
[null,null,null,null,"Date","Date","Datum"]
[null,null,null,null,"ID 1","ID 1","ID 1"]
[null,null,null,null,"ID 2","ID 2","ID 2"]
[null,null,null,null,"Result","Result","Ergebnis"]
[null,null,null,null,"Weight","Weight","Wichtung"]
[null,null,null,null,"Penalty","Penalty","Elfmetersch."]
[null,null,null,null,"KO round","KO round","KO-Runde"]
[null,null,null,null,"Rank","Rank","Rang"]
[null,null,null,null,"Settings","Settings","Einstellungen"]
[null,null,null,null,"ELO Divisor:","ELO Divisor:","ELO Divisor:"]
[null,null,null,null,"600  for soccer rating numbers (men)","600  for soccer rating numbers (men)","600  für Fußball-Bewertungszahlen (Männer)"]
[null,null,null,null,"400  for chess skill levels","400  for chess skill levels","400  für Schach-Spielstärken"]
[null,null,null,null,"200  for table tennis","200  for table tennis","200  für Tischtennis"]
[null,null,null,null,"Messages","Messages","Meldungen"]
[null,null,null,null,"Captions","Captions","Überschriften"]
{"$rows_left_out":20}
{"sheet":"Info","index":5,"n_rows":45,"n_cols":16,"rows_kept":45,"cut":false,"hidden":false,"merged":[[43,1,43,7],[43,9,43,15],[44,1,44,7],[44,9,44,15]]}
[null,null,null,null,null,null,null,null,null,null,null,null,null,null,null,"hb / Version 1.0"]
[null,"English",null,null,null,null,null,null,null,"Deutsch",null,null,null,null,null,"2023-04-13"]
[]
[]
[]
[]
[]
[]
[]
[]
[]
[]
[]
[]
[]
[]
[]
[]
[]
[]
[]
[]
[]
[]
[]
[]
[]
[]
[]
[]
{"$rows_left_out":15}