{"text_format":"1","workbook":"xlsx","n_sheets":7,"sheets":["Planning","Results","CrossTable","Paarungen","Language","Settings","Help"],"not_rendered":{"charts":0,"images":0,"macros":1,"external_links":0,"defined_names":8,"comments":0,"pivot_tables":0},"unopened":[],"bounds":{"document_bytes":16777216,"sheet_cells":100000,"rows_first":2000,"rows_last":500,"rows_between":2000,"halvings":0,"cell_chars":16384,"cell_head_chars":4096},"cells_cut":0,"cells_raw":0,"read":"whole","date_system":"1900"}

{"sheet":"Planning","index":0,"n_rows":106,"n_cols":22,"rows_kept":106,"cut":false,"hidden":false,"merged":[[4,2,4,3],[5,10,6,10],[7,10,8,10],[9,10,10,10],[11,10,12,10],[13,10,14,10],[5,11,6,11],[7,11,8,11],[9,11,10,11],[11,11,12,11],[13,11,14,11],[5,12,6,12],[7,12,8,12],[9,12,10,12],[11,12,12,12],[13,12,14,12]]}
[]
[null,null,{"$f":"Language!$E$30","v":"Participant list"}]
[null,null,null,{"$f":"Language!$E$29","v":"Number of rounds:"},5,{"$f":"Language!$E$53","v":"recomm.:"},{"$f":"IF($E$4=4,\"2 - 3\",IF($E$4=5,\"3 - 5\",IF($E$4=6,\"4 - 5\",IFERROR(INT(LOG($E$4,2))+2&\" - \"&INT(LOG($E$4,2))+4,\"- -\"))))","v":"5 - 7"},null,null,null,null,null,null,null,null,"Anz. Rnd. Start"]
[null,null,null,{"$f":"Language!$E$31","v":"Number of participants:"},{"$f":"COUNTA($D$7:$D$106)","v":11},11,null,null,null,null,null,null,null,null,null,5]
[null,null,{"$f":"Language!$E$76","v":"Duplicate names"},null,null,null,null,null,null,null,{"$f":"Language!$E$90","v":"Schedule"}]
[null,{"$f":"MAX($B$7:$B$106)","v":1},{"$f":"Language!$E$9","v":"No."},{"$f":"Language!$E$10","v":"Participant or Team"},{"$f":"Language!$E$44","v":"Playing strength"},null,null,null,null,null,{"$f":"Language!$E$91","v":"Start:"},"09:00:00",{"$f":"Language!$E$98","v":" "},null,"Home","Away","Letzte",null,null,null,"Teiln. (Backup)","St. (Backup)"]
[null,{"$f":"COUNTIF($D$7:$D$106,$D7)","v":1},1,"FC Augsburg",null,null,null,null,null,null,null,null,null,null,2,1,1,"1.",{"$f":"IF(D7=\"\",\"\",D7)","v":"FC Augsburg"},null,"FC Augsburg"]
[null,{"$f":"COUNTIF($D$7:$D$106,$D8)","v":1},2,"Hertha BSC",null,null,null,null,null,null,{"$f":"Language!$E$95","v":"Playing time per match:"},20,"min",null,1,1,1,"2.",{"$f":"IF(D8=\"\",\"\",D8)","v":"Hertha BSC"},null,"Hertha BSC"]
[null,1,3,"1. FC Union Berlin",null,null,null,null,null,null,null,null,null,null,1,2,-1,"3.","1. FC Union Berlin",null,"1. FC Union Berlin"]
[null,1,4,"VFL Bochum 1848",null,null,null,null,null,null,{"$f":"Language!$E$96","v":"Change time:"},5,"min",null,2,1,-1,"4.","VFL Bochum 1848",null,"VFL Bochum 1848"]
[null,1,5,"SV Werder Bremen",null,null,null,null,null,null,null,null,null,null,1,2,-2,"5.","SV Werder Bremen",null,"SV Werder Bremen"]
[null,1,6,"Borussia Dortmund",null,null,null,null,null,null,{"$f":"Language!$E$97","v":"Number of fields:"},3,"(max. 100)",null,1,1,1,"6.","Borussia Dortmund",null,"Borussia Dortmund"]
[null,1,7,"Eintracht Frankfurt",null,null,null,null,null,null,null,null,null,null,2,1,1,"7.","Eintracht Frankfurt",null,"Eintracht Frankfurt"]
[null,1,8,"Sport-Club Freiburg",null,null,null,null,null,null,{"$f":"Language!$E$92","v":"End:"},"13:05:00",null,null,1,2,-1,"8.","Sport-Club Freiburg",null,"Sport-Club Freiburg"]
[null,1,9,"TSG Hoffenheim",null,null,null,null,null,null,null,null,null,null,1,1,1,"9.","TSG Hoffenheim",null,"TSG Hoffenheim"]
[null,1,10,"1. FC Köln",null,null,null,null,null,null,null,null,null,null,1,2,-2,"10.","1. FC Köln",null,"1. FC Köln"]
[null,1,11,"RB Leipzig",null,null,null,null,null,null,null,null,null,null,2,1,2,"11.","RB Leipzig",null,"RB Leipzig"]
[null,0,12,null,null,null,null,null,null,null,null,null,null,null,null,null,null,"12.",""]
[null,0,13,null,null,null,null,null,null,null,null,null,null,null,null,null,null,"13.",""]
[null,0,14,null,null,null,null,null,null,null,null,null,null,null,null,null,null,"14.",""]
[null,0,15,null,null,null,null,null,null,null,null,null,null,null,null,null,null,"15.",""]
[null,0,16,null,null,null,null,null,null,null,null,null,null,null,null,null,null,"16.",""]
[null,0,17,null,null,null,null,null,null,null,null,null,null,null,null,null,null,"17.",""]
[null,0,18,null,null,null,null,null,null,null,null,null,null,null,null,null,null,"18.",""]
[null,0,19,null,null,null,null,null,null,null,null,null,null,null,null,null,null,"19.",""]
[null,0,20,null,null,null,null,null,null,null,null,null,null,null,null,null,null,"20.",""]
[null,0,21,null,null,null,null,null,null,null,null,null,null,null,null,null,null,"21.",""]
[null,0,22,null,null,null,null,null,null,null,null,null,null,null,null,null,null,"22.",""]
[null,0,23,null,null,null,null,null,null,null,null,null,null,null,null,null,null,"23.",""]
[null,0,24,null,null,null,null,null,null,null,null,null,null,null,null,null,null,"24.",""]
[null,0,25,null,null,null,null,null,null,null,null,null,null,null,null,null,null,"25.",""]
[null,0,26,null,null,null,null,null,null,null,null,null,null,null,null,null,null,"26.",""]
[null,0,27,null,null,null,null,null,null,null,null,null,null,null,null,null,null,"27.",""]
[null,0,28,null,null,null,null,null,null,null,null,null,null,null,null,null,null,"28.",""]
[null,0,29,null,null,null,null,null,null,null,null,null,null,null,null,null,null,"29.",""]
[null,0,30,null,null,null,null,null,null,null,null,null,null,null,null,null,null,"30.",""]
[null,0,31,null,null,null,null,null,null,null,null,null,null,null,null,null,null,"31.",""]
[null,0,32,null,null,null,null,null,null,null,null,null,null,null,null,null,null,"32.",""]
[null,0,33,null,null,null,null,null,null,null,null,null,null,null,null,null,null,"33.",""]
[null,0,34,null,null,null,null,null,null,null,null,null,null,null,null,null,null,"34.",""]
[null,0,35,null,null,null,null,null,null,null,null,null,null,null,null,null,null,"35.",""]
[null,0,36,null,null,null,null,null,null,null,null,null,null,null,null,null,null,"36.",""]
[null,0,37,null,null,null,null,null,null,null,null,null,null,null,null,null,null,"37.",""]
[null,0,38,null,null,null,null,null,null,null,null,null,null,null,null,null,null,"38.",""]
[null,0,39,null,null,null,null,null,null,null,null,null,null,null,null,null,null,"39.",""]
[null,0,40,null,null,null,null,null,null,null,null,null,null,null,null,null,null,"40.",""]
[null,0,41,null,null,null,null,null,null,null,null,null,null,null,null,null,null,"41.",""]
[null,0,42,null,null,null,null,null,null,null,null,null,null,null,null,null,null,"42.",""]
[null,0,43,null,null,null,null,null,null,null,null,null,null,null,null,null,null,"43.",""]
[null,0,44,null,null,null,null,null,null,null,null,null,null,null,null,null,null,"44.",""]
[null,0,45,null,null,null,null,null,null,null,null,null,null,null,null,null,null,"45.",""]
[null,0,46,null,null,null,null,null,null,null,null,null,null,null,null,null,null,"46.",""]
[null,0,47,null,null,null,null,null,null,null,null,null,null,null,null,null,null,"47.",""]
[null,0,48,null,null,null,null,null,null,null,null,null,null,null,null,null,null,"48.",""]
[null,0,49,null,null,null,null,null,null,null,null,null,null,null,null,null,null,"49.",""]
[null,0,50,null,null,null,null,null,null,null,null,null,null,null,null,null,null,"50.",""]
[null,0,51,null,null,null,null,null,null,null,null,null,null,null,null,null,null,"51.",""]
[null,0,52,null,null,null,null,null,null,null,null,null,null,null,null,null,null,"52.",""]
[null,0,53,null,null,null,null,null,null,null,null,null,null,null,null,null,null,"53.",""]
[null,0,54,null,null,null,null,null,null,null,null,null,null,null,null,null,null,"54.",""]
[null,0,55,null,null,null,null,null,null,null,null,null,null,null,null,null,null,"55.",""]
[null,0,56,null,null,null,null,null,null,null,null,null,null,null,null,null,null,"56.",""]
[null,0,57,null,null,null,null,null,null,null,null,null,null,null,null,null,null,"57.",""]
[null,0,58,null,null,null,null,null,null,null,null,null,null,null,null,null,null,"58.",""]
[null,0,59,null,null,null,null,null,null,null,null,null,null,null,null,null,null,"59.",""]
[null,0,60,null,null,null,null,null,null,null,null,null,null,null,null,null,null,"60.",""]
[null,0,61,null,null,null,null,null,null,null,null,null,null,null,null,null,null,"61.",""]
[null,0,62,null,null,null,null,null,null,null,null,null,null,null,null,null,null,"62.",""]
[null,0,63,null,null,null,null,null,null,null,null,null,null,null,null,null,null,"63.",""]
[null,0,64,null,null,null,null,null,null,null,null,null,null,null,null,null,null,"64.",""]
[null,0,65,null,null,null,null,null,null,null,null,null,null,null,null,null,null,"65.",""]
[null,{"$f":"COUNTIF($D$7:$D$106,$D72)","v":0},66,null,null,null,null,null,null,null,null,null,null,null,null,null,null,"66.",{"$f":"IF(D72=\"\",\"\",D72)","v":""}]
[null,0,67,null,null,null,null,null,null,null,null,null,null,null,null,null,null,"67.",""]
[null,0,68,null,null,null,null,null,null,null,null,null,null,null,null,null,null,"68.",""]
[null,0,69,null,null,null,null,null,null,null,null,null,null,null,null,null,null,"69.",""]
[null,0,70,null,null,null,null,null,null,null,null,null,null,null,null,null,null,"70.",""]
[null,0,71,null,null,null,null,null,null,null,null,null,null,null,null,null,null,"71.",""]
[null,0,72,null,null,null,null,null,null,null,null,null,null,null,null,null,null,"72.",""]
[null,0,73,null,null,null,null,null,null,null,null,null,null,null,null,null,null,"73.",""]
[null,0,74,null,null,null,null,null,null,null,null,null,null,null,null,null,null,"74.",""]
[null,0,75,null,null,null,null,null,null,null,null,null,null,null,null,null,null,"75.",""]
[null,0,76,null,null,null,null,null,null,null,null,null,null,null,null,null,null,"76.",""]
[null,0,77,null,null,null,null,null,null,null,null,null,null,null,null,null,null,"77.",""]
[null,0,78,null,null,null,null,null,null,null,null,null,null,null,null,null,null,"78.",""]
[null,0,79,null,null,null,null,null,null,null,null,null,null,null,null,null,null,"79.",""]
[null,0,80,null,null,null,null,null,null,null,null,null,null,null,null,null,null,"80.",""]
[null,0,81,null,null,null,null,null,null,null,null,null,null,null,null,null,null,"81.",""]
[null,0,82,null,null,null,null,null,null,null,null,null,null,null,null,null,null,"82.",""]
[null,0,83,null,null,null,null,null,null,null,null,null,null,null,null,null,null,"83.",""]
[null,0,84,null,null,null,null,null,null,null,null,null,null,null,null,null,null,"84.",""]
[null,0,85,null,null,null,null,null,null,null,null,null,null,null,null,null,null,"85.",""]
[null,0,86,null,null,null,null,null,null,null,null,null,null,null,null,null,null,"86.",""]
[null,0,87,null,null,null,null,null,null,null,null,null,null,null,null,null,null,"87.",""]
[null,0,88,null,null,null,null,null,null,null,null,null,null,null,null,null,null,"88.",""]
[null,0,89,null,null,null,null,null,null,null,null,null,null,null,null,null,null,"89.",""]
[null,0,90,null,null,null,null,null,null,null,null,null,null,null,null,null,null,"90.",""]
[null,0,91,null,null,null,null,null,null,null,null,null,null,null,null,null,null,"91.",""]
[null,0,92,null,null,null,null,null,null,null,null,null,null,null,null,null,null,"92.",""]
[null,0,93,null,null,null,null,null,null,null,null,null,null,null,null,null,null,"93.",""]
[null,0,94,null,null,null,null,null,null,null,null,null,null,null,null,null,null,"94.",""]
[null,0,95,null,null,null,null,null,null,null,null,null,null,null,null,null,null,"95.",""]
[null,0,96,null,null,null,null,null,null,null,null,null,null,null,null,null,null,"96.",""]
[null,0,97,null,null,null,null,null,null,null,null,null,null,null,null,null,null,"97.",""]
[null,0,98,null,null,null,null,null,null,null,null,null,null,null,null,null,null,"98.",""]
[null,0,99,null,null,null,null,null,null,null,null,null,null,null,null,null,null,"99.",""]
[null,0,100,null,null,null,null,null,null,null,null,null,null,null,null,null,null,"100.",""]

{"sheet":"Results","index":1,"n_rows":1008,"n_cols":40,"rows_kept":1008,"cut":false,"hidden":false,"merged":[[7,5,7,6],[0,28,0,29],[1,28,1,29],[7,16,7,17],[7,7,7,9],[7,10,7,12],[7,25,7,27],[2,7,2,19],[3,7,3,19],[5,5,5,6],[1,7,1,19],[6,13,7,13],[6,10,6,12]]}
[null,null,null,null,null,null,null,null,null,null,null,null,null,null,null,null,null,null,null,null,null,null,null,null,null,null,null,null,"Vers.  1.9"]
[null,null,null,null,null,null,null,"Tournament SWISS SYSTEM ",null,null,null,null,null,null,null,null,null,null,null,null,null,null,null,null,null,null,null,null,"2026-01-13"]
[null,null,null,null,null,null,null,"max. 100 Teams"]
[null,null,null,null,null,null,null,"Last updated: 13.01.2026"]
[]
[null,null,null,null,null,{"$f":"Language!$E$46","v":"Bye:"},null,"TSG Hoffenheim",null,{"$f":"Language!$E$42","v":"Current round:"},3,"/",{"$f":"Planning!$E$3","v":5},{"$f":"IF(OR(Planning!$L$14=\"\",$K$6>Planning!$E$3),\"\",Planning!$K$14&\" \"&TEXT(Planning!$L$14,\"hh:mm\"))","v":"End: 13:05"}]
[null,{"$f":"QUOTIENT(Planning!$E$4,2)","v":5},{"$f":"Planning!$E$4*(Planning!$E$4-1)/2","v":55},null,null,null,null,null,null,null,null,null,null,{"$f":"Language!$E$99","v":"Addit. break (min)"}]
[null,{"$f":"Language!$E$43","v":"Round"},{"$f":"Language!$E$9","v":"No."},{"$f":"Language!$E$50","v":"Time"},{"$f":"Language!$E$59","v":"Field"},null,null,{"$f":"Language!$E$14","v":"Matchup"},null,null,{"$f":"Language!$E$15","v":"Result"},null,null,null,null,{"$f":"Language!$E$66","v":"H - A"},null,null,{"$f":"Language!$E$21","v":"Pl"},{"$f":"Language!$E$22","v":"W"},{"$f":"Language!$E$28","v":"D"},{"$f":"Language!$E$24","v":"L"},{"$f":"Language!$E$18","v":"BH"},{"$f":"Language!$E$19","v":"FBH"},{"$f":"Language!$E$45","v":"Byes"},{"$f":"Language!$E$8","v":"Match points"},null,null,{"$f":"Language!$E$23","v":"Diff."},{"$f":"IF(Settings!$C$5=Language!$E$104,Language!$E$27,Language!$E$49)","v":"Pts"},null,"rf","Ranking number","Pool number","rf 1","rf 2","bye","Participant","number of Home","number of Away"]
[null,{"$f":"IF($B$7=0,\"\",IF(OR($B$7=0,QUOTIENT($C9-1,$B$7)+1>MAX($K$6,Planning!$E$3)),\"\",IF(OR($C9>$C$7,MOD($C9-1,$B$7)>0),\"\",QUOTIENT($C9-1,$B$7)+1)))","v":1},1,"09:00:00",2,4,11,"VFL Bochum 1848","-","RB Leipzig",1," : ",3,null,null,{"$f":"IF($AM$9:$AM$108=\"\",\"\",$AM$9:$AM$108&\" - \"&$AN$9:$AN$108)","v":"2 - 1"},1,"Eintracht Frankfurt",3,2,1,0,7,31,null,6," - ",1,5,5,null,7,2050007031.5005093,null,null,null,null,{"$f":"IF(Planning!$D7=\"\",\"\",Planning!$D7)","v":"FC Augsburg"},{"$f":"IFERROR(INDEX(Planning!$O$7:$O$106,MATCH($R$9:$R$108,Planning!$D$7:$D$106,0)),\"\")","v":2},{"$f":"COUNTIF($J$9:$J$108,$R9)","v":1}]
[null,{"$f":"IF($B$7=0,\"\",IF(OR($B$7=0,QUOTIENT($C10-1,$B$7)+1>MAX($K$6,Planning!$E$3)),\"\",IF(OR($C10>$C$7,MOD($C10-1,$B$7)>0),\"\",QUOTIENT($C10-1,$B$7)+1)))","v":""},2,"09:00:00",3,10,2,"1. FC Köln","-","Hertha BSC",3," : ",1,null,null,"1 - 2",2,"1. FC Köln",3,2,0,1,9,21,null,5," - ",3,2,4,null,10,2040009021.5002091,null,null,null,1,{"$f":"IF(Planning!$D8=\"\",\"\",Planning!$D8)","v":"Hertha BSC"},1,{"$f":"COUNTIF($J$9:$J$108,$R10)","v":2}]
[null,{"$f":"IF($B$7=0,\"\",IF(OR($B$7=0,QUOTIENT($C11-1,$B$7)+1>MAX($K$6,Planning!$E$3)),\"\",IF(OR($C11>$C$7,MOD($C11-1,$B$7)>0),\"\",QUOTIENT($C11-1,$B$7)+1)))","v":""},3,"09:00:00",1,7,9,"Eintracht Frankfurt","-","TSG Hoffenheim",3," : ",0,null,null,"1 - 1",3,"Borussia Dortmund",2,2,0,0,7,19,1,7," - ",2,5,4,null,6,2040007019.5005093,null,null,null,null,{"$f":"IF(Planning!$D9=\"\",\"\",Planning!$D9)","v":"1. FC Union Berlin"},1,1]
[null,{"$f":"IF($B$7=0,\"\",IF(OR($B$7=0,QUOTIENT($C12-1,$B$7)+1>MAX($K$6,Planning!$E$3)),\"\",IF(OR($C12>$C$7,MOD($C12-1,$B$7)>0),\"\",QUOTIENT($C12-1,$B$7)+1)))","v":""},4,"09:25:00",2,1,3,"FC Augsburg","-","1. FC Union Berlin",1," : ",2,null,null,"1 - 2",4,"Sport-Club Freiburg",3,2,0,1,6,25,null,5," - ",6,-1,4,null,8,2040006025.4999094,null,null,null,null,{"$f":"IF(Planning!$D10=\"\",\"\",Planning!$D10)","v":"VFL Bochum 1848"},1,2]
[null,{"$f":"IF($B$7=0,\"\",IF(OR($B$7=0,QUOTIENT($C13-1,$B$7)+1>MAX($K$6,Planning!$E$3)),\"\",IF(OR($C13>$C$7,MOD($C13-1,$B$7)>0),\"\",QUOTIENT($C13-1,$B$7)+1)))","v":""},5,"09:25:00",1,5,8,"SV Werder Bremen","-","Sport-Club Freiburg",1," : ",2,null,null,"2 - 1",5,"FC Augsburg",3,2,0,1,5,28,null,7," - ",5,2,4,null,1,2040005028.50021,null,null,null,null,{"$f":"IF(Planning!$D11=\"\",\"\",Planning!$D11)","v":"SV Werder Bremen"},2,1]
[null,{"$f":"IF($B$7=0,\"\",IF(OR($B$7=0,QUOTIENT($C14-1,$B$7)+1>MAX($K$6,Planning!$E$3)),\"\",IF(OR($C14>$C$7,MOD($C14-1,$B$7)>0),\"\",QUOTIENT($C14-1,$B$7)+1)))","v":2},6,"09:50:00",1,11,10,"RB Leipzig","-","1. FC Köln",0," : ",2,null,null,"1 - 2",6,"1. FC Union Berlin",3,1,1,1,13,19,null,4," - ",5,-1,3,null,3,2030013019.4999099,null,null,null,1,{"$f":"IF(Planning!$D12=\"\",\"\",Planning!$D12)","v":"Borussia Dortmund"},1,2]
[null,{"$f":"IF($B$7=0,\"\",IF(OR($B$7=0,QUOTIENT($C15-1,$B$7)+1>MAX($K$6,Planning!$E$3)),\"\",IF(OR($C15>$C$7,MOD($C15-1,$B$7)>0),\"\",QUOTIENT($C15-1,$B$7)+1)))","v":""},7,"09:50:00",2,8,6,"Sport-Club Freiburg","-","Borussia Dortmund",1," : ",4,null,null,"2 - 1",7,"RB Leipzig",3,1,0,2,10,21,null,4," - ",5,-1,2,null,11,2020010021.4999089,null,null,null,null,{"$f":"IF(Planning!$D13=\"\",\"\",Planning!$D13)","v":"Eintracht Frankfurt"},2,1]
[null,{"$f":"IF($B$7=0,\"\",IF(OR($B$7=0,QUOTIENT($C16-1,$B$7)+1>MAX($K$6,Planning!$E$3)),\"\",IF(OR($C16>$C$7,MOD($C16-1,$B$7)>0),\"\",QUOTIENT($C16-1,$B$7)+1)))","v":""},8,"09:50:00",3,9,1,"TSG Hoffenheim","-","FC Augsburg",1," : ",3,null,null,"2 - 1",8,"VFL Bochum 1848",3,1,0,2,6,23,null,6," - ",7,-1,2,null,4,2020006023.4999096,null,null,null,null,{"$f":"IF(Planning!$D14=\"\",\"\",Planning!$D14)","v":"Sport-Club Freiburg"},2,1]
[null,{"$f":"IF($B$7=0,\"\",IF(OR($B$7=0,QUOTIENT($C17-1,$B$7)+1>MAX($K$6,Planning!$E$3)),\"\",IF(OR($C17>$C$7,MOD($C17-1,$B$7)>0),\"\",QUOTIENT($C17-1,$B$7)+1)))","v":""},9,"10:15:00",1,4,5,"VFL Bochum 1848","-","SV Werder Bremen",3," : ",1,null,null,"1 - 1",9,"Hertha BSC",2,1,0,1,4,17,1,3," - ",4,-1,2,null,2,2020004017.4999099,null,null,null,1,{"$f":"IF(Planning!$D15=\"\",\"\",Planning!$D15)","v":"TSG Hoffenheim"},1,1]
[null,{"$f":"IF($B$7=0,\"\",IF(OR($B$7=0,QUOTIENT($C18-1,$B$7)+1>MAX($K$6,Planning!$E$3)),\"\",IF(OR($C18>$C$7,MOD($C18-1,$B$7)>0),\"\",QUOTIENT($C18-1,$B$7)+1)))","v":""},10,"10:15:00",3,3,7,"1. FC Union Berlin","-","Eintracht Frankfurt",1," : ",1,null,null,"1 - 1",10,"TSG Hoffenheim",2,0,0,2,9,12,1,1," - ",6,-5,0,null,9,2000009012.4995091,null,null,null,null,{"$f":"IF(Planning!$D16=\"\",\"\",Planning!$D16)","v":"1. FC Köln"},1,1]
[null,{"$f":"IF($B$7=0,\"\",IF(OR($B$7=0,QUOTIENT($C19-1,$B$7)+1>MAX($K$6,Planning!$E$3)),\"\",IF(OR($C19>$C$7,MOD($C19-1,$B$7)>0),\"\",QUOTIENT($C19-1,$B$7)+1)))","v":3},11,"10:40:00",1,11,8,"RB Leipzig","-","Sport-Club Freiburg",1," : ",2,null,null,"1 - 2",11,"SV Werder Bremen",3,0,0,3,8,16,null,3," - ",7,-4,0,null,5,2000008016.4996095,null,null,null,null,{"$f":"IF(Planning!$D17=\"\",\"\",Planning!$D17)","v":"RB Leipzig"},1,2]
[null,{"$f":"IF($B$7=0,\"\",IF(OR($B$7=0,QUOTIENT($C20-1,$B$7)+1>MAX($K$6,Planning!$E$3)),\"\",IF(OR($C20>$C$7,MOD($C20-1,$B$7)>0),\"\",QUOTIENT($C20-1,$B$7)+1)))","v":""},12,"10:40:00",2,2,5,"Hertha BSC","-","SV Werder Bremen",2," : ",1,null,null,"",null,null,null,null,null,null,null,null,null,null,null,null,null,null,null,null,null,null,null,null,null,{"$f":"IF(Planning!$D18=\"\",\"\",Planning!$D18)","v":""},"",0]
[null,{"$f":"IF($B$7=0,\"\",IF(OR($B$7=0,QUOTIENT($C21-1,$B$7)+1>MAX($K$6,Planning!$E$3)),\"\",IF(OR($C21>$C$7,MOD($C21-1,$B$7)>0),\"\",QUOTIENT($C21-1,$B$7)+1)))","v":""},13,"10:40:00",3,1,4,"FC Augsburg","-","VFL Bochum 1848",3," : ",2,null,null,"",null,null,null,null,null,null,null,null,null,null,null,null,null,null,null,null,null,null,null,null,null,{"$f":"IF(Planning!$D19=\"\",\"\",Planning!$D19)","v":""},"",0]
[null,{"$f":"IF($B$7=0,\"\",IF(OR($B$7=0,QUOTIENT($C22-1,$B$7)+1>MAX($K$6,Planning!$E$3)),\"\",IF(OR($C22>$C$7,MOD($C22-1,$B$7)>0),\"\",QUOTIENT($C22-1,$B$7)+1)))","v":""},14,"11:05:00",2,6,3,"Borussia Dortmund","-","1. FC Union Berlin",3," : ",1,null,null,"",null,null,null,null,null,null,null,null,null,null,null,null,null,null,null,null,null,null,null,null,null,{"$f":"IF(Planning!$D20=\"\",\"\",Planning!$D20)","v":""},"",0]
[null,{"$f":"IF($B$7=0,\"\",IF(OR($B$7=0,QUOTIENT($C23-1,$B$7)+1>MAX($K$6,Planning!$E$3)),\"\",IF(OR($C23>$C$7,MOD($C23-1,$B$7)>0),\"\",QUOTIENT($C23-1,$B$7)+1)))","v":""},15,"11:05:00",1,7,10,"Eintracht Frankfurt","-","1. FC Köln",2," : ",0,null,null,"",null,null,null,null,null,null,null,null,null,null,null,null,null,null,null,null,null,null,null,null,null,{"$f":"IF(Planning!$D21=\"\",\"\",Planning!$D21)","v":""},"",0]
[null,{"$f":"IF($B$7=0,\"\",IF(OR($B$7=0,QUOTIENT($C24-1,$B$7)+1>MAX($K$6,Planning!$E$3)),\"\",IF(OR($C24>$C$7,MOD($C24-1,$B$7)>0),\"\",QUOTIENT($C24-1,$B$7)+1)))","v":4},16,"11:30:00",3,null,null,null,"-",null,null," : ",null,null,null,"",null,null,null,null,null,null,null,null,null,null,null,null,null,null,null,null,null,null,null,null,null,{"$f":"IF(Planning!$D22=\"\",\"\",Planning!$D22)","v":""},"",0]
[null,{"$f":"IF($B$7=0,\"\",IF(OR($B$7=0,QUOTIENT($C25-1,$B$7)+1>MAX($K$6,Planning!$E$3)),\"\",IF(OR($C25>$C$7,MOD($C25-1,$B$7)>0),\"\",QUOTIENT($C25-1,$B$7)+1)))","v":""},17,"11:30:00",2,null,null,null,"-",null,null," : ",null,null,null,"",null,null,null,null,null,null,null,null,null,null,null,null,null,null,null,null,null,null,null,null,null,{"$f":"IF(Planning!$D23=\"\",\"\",Planning!$D23)","v":""},"",0]
[null,{"$f":"IF($B$7=0,\"\",IF(OR($B$7=0,QUOTIENT($C26-1,$B$7)+1>MAX($K$6,Planning!$E$3)),\"\",IF(OR($C26>$C$7,MOD($C26-1,$B$7)>0),\"\",QUOTIENT($C26-1,$B$7)+1)))","v":""},18,"11:30:00",1,null,null,null,"-",null,null," : ",null,null,null,"",null,null,null,null,null,null,null,null,null,null,null,null,null,null,null,null,null,null,null,null,null,{"$f":"IF(Planning!$D24=\"\",\"\",Planning!$D24)","v":""},"",0]
[null,{"$f":"IF($B$7=0,\"\",IF(OR($B$7=0,QUOTIENT($C27-1,$B$7)+1>MAX($K$6,Planning!$E$3)),\"\",IF(OR($C27>$C$7,MOD($C27-1,$B$7)>0),\"\",QUOTIENT($C27-1,$B$7)+1)))","v":""},19,"11:55:00",2,null,null,null,"-",null,null," : ",null,null,null,"",null,null,null,null,null,null,null,null,null,null,null,null,null,null,null,null,null,null,null,null,null,{"$f":"IF(Planning!$D25=\"\",\"\",Planning!$D25)","v":""},"",0]
[null,{"$f":"IF($B$7=0,\"\",IF(OR($B$7=0,QUOTIENT($C28-1,$B$7)+1>MAX($K$6,Planning!$E$3)),\"\",IF(OR($C28>$C$7,MOD($C28-1,$B$7)>0),\"\",QUOTIENT($C28-1,$B$7)+1)))","v":""},20,"11:55:00",1,null,null,null,"-",null,null," : ",null,null,null,"",null,null,null,null,null,null,null,null,null,null,null,null,null,null,null,null,null,null,null,null,null,{"$f":"IF(Planning!$D26=\"\",\"\",Planning!$D26)","v":""},"",0]
[null,{"$f":"IF($B$7=0,\"\",IF(OR($B$7=0,QUOTIENT($C29-1,$B$7)+1>MAX($K$6,Planning!$E$3)),\"\",IF(OR($C29>$C$7,MOD($C29-1,$B$7)>0),\"\",QUOTIENT($C29-1,$B$7)+1)))","v":5},21,"12:20:00",1,null,null,null,"-",null,null," : ",null,null,null,"",null,null,null,null,null,null,null,null,null,null,null,null,null,null,null,null,null,null,null,null,null,{"$f":"IF(Planning!$D27=\"\",\"\",Planning!$D27)","v":""},"",0]
[null,{"$f":"IF($B$7=0,\"\",IF(OR($B$7=0,QUOTIENT($C30-1,$B$7)+1>MAX($K$6,Planning!$E$3)),\"\",IF(OR($C30>$C$7,MOD($C30-1,$B$7)>0),\"\",QUOTIENT($C30-1,$B$7)+1)))","v":""},22,"12:20:00",2,null,null,null,"-",null,null," : ",null,null,null,"",null,null,null,null,null,null,null,null,null,null,null,null,null,null,null,null,null,null,null,null,null,{"$f":"IF(Planning!$D28=\"\",\"\",Planning!$D28)","v":""},"",0]
[null,{"$f":"IF($B$7=0,\"\",IF(OR($B$7=0,QUOTIENT($C31-1,$B$7)+1>MAX($K$6,Planning!$E$3)),\"\",IF(OR($C31>$C$7,MOD($C31-1,$B$7)>0),\"\",QUOTIENT($C31-1,$B$7)+1)))","v":""},23,"12:20:00",3,null,null,null,"-",null,null," : ",null,null,null,"",null,null,null,null,null,null,null,null,null,null,null,null,null,null,null,null,null,null,null,null,null,{"$f":"IF(Planning!$D29=\"\",\"\",Planning!$D29)","v":""},"",0]
[null,{"$f":"IF($B$7=0,\"\",IF(OR($B$7=0,QUOTIENT($C32-1,$B$7)+1>MAX($K$6,Planning!$E$3)),\"\",IF(OR($C32>$C$7,MOD($C32-1,$B$7)>0),\"\",QUOTIENT($C32-1,$B$7)+1)))","v":""},24,"12:45:00",1,null,null,null,"-",null,null," : ",null,null,null,"",null,null,null,null,null,null,null,null,null,null,null,null,null,null,null,null,null,null,null,null,null,{"$f":"IF(Planning!$D30=\"\",\"\",Planning!$D30)","v":""},"",0]
[null,{"$f":"IF($B$7=0,\"\",IF(OR($B$7=0,QUOTIENT($C33-1,$B$7)+1>MAX($K$6,Planning!$E$3)),\"\",IF(OR($C33>$C$7,MOD($C33-1,$B$7)>0),\"\",QUOTIENT($C33-1,$B$7)+1)))","v":""},25,"12:45:00",3,null,null,null,"-",null,null," : ",null,null,null,"",null,null,null,null,null,null,null,null,null,null,null,null,null,null,null,null,null,null,null,null,null,{"$f":"IF(Planning!$D31=\"\",\"\",Planning!$D31)","v":""},"",0]
[null,{"$f":"IF($B$7=0,\"\",IF(OR($B$7=0,QUOTIENT($C34-1,$B$7)+1>MAX($K$6,Planning!$E$3)),\"\",IF(OR($C34>$C$7,MOD($C34-1,$B$7)>0),\"\",QUOTIENT($C34-1,$B$7)+1)))","v":""},26,null,null,null,null,null,"-",null,null," : ",null,null,null,"",null,null,null,null,null,null,null,null,null,null,null,null,null,null,null,null,null,null,null,null,null,{"$f":"IF(Planning!$D32=\"\",\"\",Planning!$D32)","v":""},"",0]
[null,{"$f":"IF($B$7=0,\"\",IF(OR($B$7=0,QUOTIENT($C35-1,$B$7)+1>MAX($K$6,Planning!$E$3)),\"\",IF(OR($C35>$C$7,MOD($C35-1,$B$7)>0),\"\",QUOTIENT($C35-1,$B$7)+1)))","v":""},27,null,null,null,null,null,"-",null,null," : ",null,null,null,"",null,null,null,null,null,null,null,null,null,null,null,null,null,null,null,null,null,null,null,null,null,{"$f":"IF(Planning!$D33=\"\",\"\",Planning!$D33)","v":""},"",0]
[null,{"$f":"IF($B$7=0,\"\",IF(OR($B$7=0,QUOTIENT($C36-1,$B$7)+1>MAX($K$6,Planning!$E$3)),\"\",IF(OR($C36>$C$7,MOD($C36-1,$B$7)>0),\"\",QUOTIENT($C36-1,$B$7)+1)))","v":""},28,null,null,null,null,null,"-",null,null," : ",null,null,null,"",null,null,null,null,null,null,null,null,null,null,null,null,null,null,null,null,null,null,null,null,null,{"$f":"IF(Planning!$D34=\"\",\"\",Planning!$D34)","v":""},"",0]
[null,{"$f":"IF($B$7=0,\"\",IF(OR($B$7=0,QUOTIENT($C37-1,$B$7)+1>MAX($K$6,Planning!$E$3)),\"\",IF(OR($C37>$C$7,MOD($C37-1,$B$7)>0),\"\",QUOTIENT($C37-1,$B$7)+1)))","v":""},29,null,null,null,null,null,"-",null,null," : ",null,null,null,"",null,null,null,null,null,null,null,null,null,null,null,null,null,null,null,null,null,null,null,null,null,{"$f":"IF(Planning!$D35=\"\",\"\",Planning!$D35)","v":""},"",0]
[null,{"$f":"IF($B$7=0,\"\",IF(OR($B$7=0,QUOTIENT($C38-1,$B$7)+1>MAX($K$6,Planning!$E$3)),\"\",IF(OR($C38>$C$7,MOD($C38-1,$B$7)>0),\"\",QUOTIENT($C38-1,$B$7)+1)))","v":""},30,null,null,null,null,null,"-",null,null," : ",null,null,null,"",null,null,null,null,null,null,null,null,null,null,null,null,null,null,null,null,null,null,null,null,null,{"$f":"IF(Planning!$D36=\"\",\"\",Planning!$D36)","v":""},"",0]
[null,{"$f":"IF($B$7=0,\"\",IF(OR($B$7=0,QUOTIENT($C39-1,$B$7)+1>MAX($K$6,Planning!$E$3)),\"\",IF(OR($C39>$C$7,MOD($C39-1,$B$7)>0),\"\",QUOTIENT($C39-1,$B$7)+1)))","v":""},31,null,null,null,null,null,"-",null,null," : ",null,null,null,"",null,null,null,null,null,null,null,null,null,null,null,null,null,null,null,null,null,null,null,null,null,{"$f":"IF(Planning!$D37=\"\",\"\",Planning!$D37)","v":""},"",0]
[null,{"$f":"IF($B$7=0,\"\",IF(OR($B$7=0,QUOTIENT($C40-1,$B$7)+1>MAX($K$6,Planning!$E$3)),\"\",IF(OR($C40>$C$7,MOD($C40-1,$B$7)>0),\"\",QUOTIENT($C40-1,$B$7)+1)))","v":""},32,null,null,null,null,null,"-",null,null," : ",null,null,null,"",null,null,null,null,null,null,null,null,null,null,null,null,null,null,null,null,null,null,null,null,null,{"$f":"IF(Planning!$D38=\"\",\"\",Planning!$D38)","v":""},"",0]
[null,{"$f":"IF($B$7=0,\"\",IF(OR($B$7=0,QUOTIENT($C41-1,$B$7)+1>MAX($K$6,Planning!$E$3)),\"\",IF(OR($C41>$C$7,MOD($C41-1,$B$7)>0),\"\",QUOTIENT($C41-1,$B$7)+1)))","v":""},33,null,null,null,null,null,"-",null,null," : ",null,null,null,"",null,null,null,null,null,null,null,null,null,null,null,null,null,null,null,null,null,null,null,null,null,{"$f":"IF(Planning!$D39=\"\",\"\",Planning!$D39)","v":""},"",0]
[null,{"$f":"IF($B$7=0,\"\",IF(OR($B$7=0,QUOTIENT($C42-1,$B$7)+1>MAX($K$6,Planning!$E$3)),\"\",IF(OR($C42>$C$7,MOD($C42-1,$B$7)>0),\"\",QUOTIENT($C42-1,$B$7)+1)))","v":""},34,null,null,null,null,null,"-",null,null," : ",null,null,null,"",null,null,null,null,null,null,null,null,null,null,null,null,null,null,null,null,null,null,null,null,null,{"$f":"IF(Planning!$D40=\"\",\"\",Planning!$D40)","v":""},"",0]
[null,{"$f":"IF($B$7=0,\"\",IF(OR($B$7=0,QUOTIENT($C43-1,$B$7)+1>MAX($K$6,Planning!$E$3)),\"\",IF(OR($C43>$C$7,MOD($C43-1,$B$7)>0),\"\",QUOTIENT($C43-1,$B$7)+1)))","v":""},35,null,null,null,null,null,"-",null,null," : ",null,null,null,"",null,null,null,null,null,null,null,null,null,null,null,null,null,null,null,null,null,null,null,null,null,{"$f":"IF(Planning!$D41=\"\",\"\",Planning!$D41)","v":""},"",0]
[null,{"$f":"IF($B$7=0,\"\",IF(OR($B$7=0,QUOTIENT($C44-1,$B$7)+1>MAX($K$6,Planning!$E$3)),\"\",IF(OR($C44>$C$7,MOD($C44-1,$B$7)>0),\"\",QUOTIENT($C44-1,$B$7)+1)))","v":""},36,null,null,null,null,null,"-",null,null," : ",null,null,null,"",null,null,null,null,null,null,null,null,null,null,null,null,null,null,null,null,null,null,null,null,null,{"$f":"IF(Planning!$D42=\"\",\"\",Planning!$D42)","v":""},"",0]
[null,{"$f":"IF($B$7=0,\"\",IF(OR($B$7=0,QUOTIENT($C45-1,$B$7)+1>MAX($K$6,Planning!$E$3)),\"\",IF(OR($C45>$C$7,MOD($C45-1,$B$7)>0),\"\",QUOTIENT($C45-1,$B$7)+1)))","v":""},37,null,null,null,null,null,"-",null,null," : ",null,null,null,"",null,null,null,null,null,null,null,null,null,null,null,null,null,null,null,null,null,null,null,null,null,{"$f":"IF(Planning!$D43=\"\",\"\",Planning!$D43)","v":""},"",0]
[null,{"$f":"IF($B$7=0,\"\",IF(OR($B$7=0,QUOTIENT($C46-1,$B$7)+1>MAX($K$6,Planning!$E$3)),\"\",IF(OR($C46>$C$7,MOD($C46-1,$B$7)>0),\"\",QUOTIENT($C46-1,$B$7)+1)))","v":""},38,null,null,null,null,null,"-",null,null," : ",null,null,null,"",null,null,null,null,null,null,null,null,null,null,null,null,null,null,null,null,null,null,null,null,null,{"$f":"IF(Planning!$D44=\"\",\"\",Planning!$D44)","v":""},"",0]
[null,{"$f":"IF($B$7=0,\"\",IF(OR($B$7=0,QUOTIENT($C47-1,$B$7)+1>MAX($K$6,Planning!$E$3)),\"\",IF(OR($C47>$C$7,MOD($C47-1,$B$7)>0),\"\",QUOTIENT($C47-1,$B$7)+1)))","v":""},39,null,null,null,null,null,"-",null,null," : ",null,null,null,"",null,null,null,null,null,null,null,null,null,null,null,null,null,null,null,null,null,null,null,null,null,{"$f":"IF(Planning!$D45=\"\",\"\",Planning!$D45)","v":""},"",0]
[null,{"$f":"IF($B$7=0,\"\",IF(OR($B$7=0,QUOTIENT($C48-1,$B$7)+1>MAX($K$6,Planning!$E$3)),\"\",IF(OR($C48>$C$7,MOD($C48-1,$B$7)>0),\"\",QUOTIENT($C48-1,$B$7)+1)))","v":""},40,null,null,null,null,null,"-",null,null," : ",null,null,null,"",null,null,null,null,null,null,null,null,null,null,null,null,null,null,null,null,null,null,null,null,null,{"$f":"IF(Planning!$D46=\"\",\"\",Planning!$D46)","v":""},"",0]
[null,{"$f":"IF($B$7=0,\"\",IF(OR($B$7=0,QUOTIENT($C49-1,$B$7)+1>MAX($K$6,Planning!$E$3)),\"\",IF(OR($C49>$C$7,MOD($C49-1,$B$7)>0),\"\",QUOTIENT($C49-1,$B$7)+1)))","v":""},41,null,null,null,null,null,"-",null,null," : ",null,null,null,"",null,null,null,null,null,null,null,null,null,null,null,null,null,null,null,null,null,null,null,null,null,{"$f":"IF(Planning!$D47=\"\",\"\",Planning!$D47)","v":""},"",0]
[null,{"$f":"IF($B$7=0,\"\",IF(OR($B$7=0,QUOTIENT($C50-1,$B$7)+1>MAX($K$6,Planning!$E$3)),\"\",IF(OR($C50>$C$7,MOD($C50-1,$B$7)>0),\"\",QUOTIENT($C50-1,$B$7)+1)))","v":""},42,null,null,null,null,null,"-",null,null," : ",null,null,null,"",null,null,null,null,null,null,null,null,null,null,null,null,null,null,null,null,null,null,null,null,null,{"$f":"IF(Planning!$D48=\"\",\"\",Planning!$D48)","v":""},"",0]
[null,{"$f":"IF($B$7=0,\"\",IF(OR($B$7=0,QUOTIENT($C51-1,$B$7)+1>MAX($K$6,Planning!$E$3)),\"\",IF(OR($C51>$C$7,MOD($C51-1,$B$7)>0),\"\",QUOTIENT($C51-1,$B$7)+1)))","v":""},43,null,null,null,null,null,"-",null,null," : ",null,null,null,"",null,null,null,null,null,null,null,null,null,null,null,null,null,null,null,null,null,null,null,null,null,{"$f":"IF(Planning!$D49=\"\",\"\",Planning!$D49)","v":""},"",0]
[null,{"$f":"IF($B$7=0,\"\",IF(OR($B$7=0,QUOTIENT($C52-1,$B$7)+1>MAX($K$6,Planning!$E$3)),\"\",IF(OR($C52>$C$7,MOD($C52-1,$B$7)>0),\"\",QUOTIENT($C52-1,$B$7)+1)))","v":""},44,null,null,null,null,null,"-",null,null," : ",null,null,null,"",null,null,null,null,null,null,null,null,null,null,null,null,null,null,null,null,null,null,null,null,null,{"$f":"IF(Planning!$D50=\"\",\"\",Planning!$D50)","v":""},"",0]
[null,{"$f":"IF($B$7=0,\"\",IF(OR($B$7=0,QUOTIENT($C53-1,$B$7)+1>MAX($K$6,Planning!$E$3)),\"\",IF(OR($C53>$C$7,MOD($C53-1,$B$7)>0),\"\",QUOTIENT($C53-1,$B$7)+1)))","v":""},45,null,null,null,null,null,"-",null,null," : ",null,null,null,"",null,null,null,null,null,null,null,null,null,null,null,null,null,null,null,null,null,null,null,null,null,{"$f":"IF(Planning!$D51=\"\",\"\",Planning!$D51)","v":""},"",0]
[null,{"$f":"IF($B$7=0,\"\",IF(OR($B$7=0,QUOTIENT($C54-1,$B$7)+1>MAX($K$6,Planning!$E$3)),\"\",IF(OR($C54>$C$7,MOD($C54-1,$B$7)>0),\"\",QUOTIENT($C54-1,$B$7)+1)))","v":""},46,null,null,null,null,null,"-",null,null," : ",null,null,null,"",null,null,null,null,null,null,null,null,null,null,null,null,null,null,null,null,null,null,null,null,null,{"$f":"IF(Planning!$D52=\"\",\"\",Planning!$D52)","v":""},"",0]
[null,{"$f":"IF($B$7=0,\"\",IF(OR($B$7=0,QUOTIENT($C55-1,$B$7)+1>MAX($K$6,Planning!$E$3)),\"\",IF(OR($C55>$C$7,MOD($C55-1,$B$7)>0),\"\",QUOTIENT($C55-1,$B$7)+1)))","v":""},47,null,null,null,null,null,"-",null,null," : ",null,null,null,"",null,null,null,null,null,null,null,null,null,null,null,null,null,null,null,null,null,null,null,null,null,{"$f":"IF(Planning!$D53=\"\",\"\",Planning!$D53)","v":""},"",0]
[null,{"$f":"IF($B$7=0,\"\",IF(OR($B$7=0,QUOTIENT($C56-1,$B$7)+1>MAX($K$6,Planning!$E$3)),\"\",IF(OR($C56>$C$7,MOD($C56-1,$B$7)>0),\"\",QUOTIENT($C56-1,$B$7)+1)))","v":""},48,null,null,null,null,null,"-",null,null," : ",null,null,null,"",null,null,null,null,null,null,null,null,null,null,null,null,null,null,null,null,null,null,null,null,null,{"$f":"IF(Planning!$D54=\"\",\"\",Planning!$D54)","v":""},"",0]
[null,{"$f":"IF($B$7=0,\"\",IF(OR($B$7=0,QUOTIENT($C57-1,$B$7)+1>MAX($K$6,Planning!$E$3)),\"\",IF(OR($C57>$C$7,MOD($C57-1,$B$7)>0),\"\",QUOTIENT($C57-1,$B$7)+1)))","v":""},49,null,null,null,null,null,"-",null,null," : ",null,null,null,"",null,null,null,null,null,null,null,null,null,null,null,null,null,null,null,null,null,null,null,null,null,{"$f":"IF(Planning!$D55=\"\",\"\",Planning!$D55)","v":""},"",0]
[null,{"$f":"IF($B$7=0,\"\",IF(OR($B$7=0,QUOTIENT($C58-1,$B$7)+1>MAX($K$6,Planning!$E$3)),\"\",IF(OR($C58>$C$7,MOD($C58-1,$B$7)>0),\"\",QUOTIENT($C58-1,$B$7)+1)))","v":""},50,null,null,null,null,null,"-",null,null," : ",null,null,null,"",null,null,null,null,null,null,null,null,null,null,null,null,null,null,null,null,null,null,null,null,null,{"$f":"IF(Planning!$D56=\"\",\"\",Planning!$D56)","v":""},"",0]
[null,{"$f":"IF($B$7=0,\"\",IF(OR($B$7=0,QUOTIENT($C59-1,$B$7)+1>MAX($K$6,Planning!$E$3)),\"\",IF(OR($C59>$C$7,MOD($C59-1,$B$7)>0),\"\",QUOTIENT($C59-1,$B$7)+1)))","v":""},51,null,null,null,null,null,"-",null,null," : ",null,null,null,"",null,null,null,null,null,null,null,null,null,null,null,null,null,null,null,null,null,null,null,null,null,{"$f":"IF(Planning!$D57=\"\",\"\",Planning!$D57)","v":""},"",0]
[null,{"$f":"IF($B$7=0,\"\",IF(OR($B$7=0,QUOTIENT($C60-1,$B$7)+1>MAX($K$6,Planning!$E$3)),\"\",IF(OR($C60>$C$7,MOD($C60-1,$B$7)>0),\"\",QUOTIENT($C60-1,$B$7)+1)))","v":""},52,null,null,null,null,null,"-",null,null," : ",null,null,null,"",null,null,null,null,null,null,null,null,null,null,null,null,null,null,null,null,null,null,null,null,null,{"$f":"IF(Planning!$D58=\"\",\"\",Planning!$D58)","v":""},"",0]
[null,{"$f":"IF($B$7=0,\"\",IF(OR($B$7=0,QUOTIENT($C61-1,$B$7)+1>MAX($K$6,Planning!$E$3)),\"\",IF(OR($C61>$C$7,MOD($C61-1,$B$7)>0),\"\",QUOTIENT($C61-1,$B$7)+1)))","v":""},53,null,null,null,null,null,"-",null,null," : ",null,null,null,"",null,null,null,null,null,null,null,null,null,null,null,null,null,null,null,null,null,null,null,null,null,{"$f":"IF(Planning!$D59=\"\",\"\",Planning!$D59)","v":""},"",0]
[null,{"$f":"IF($B$7=0,\"\",IF(OR($B$7=0,QUOTIENT($C62-1,$B$7)+1>MAX($K$6,Planning!$E$3)),\"\",IF(OR($C62>$C$7,MOD($C62-1,$B$7)>0),\"\",QUOTIENT($C62-1,$B$7)+1)))","v":""},54,null,null,null,null,null,"-",null,null," : ",null,null,null,"",null,null,null,null,null,null,null,null,null,null,null,null,null,null,null,null,null,null,null,null,null,{"$f":"IF(Planning!$D60=\"\",\"\",Planning!$D60)","v":""},"",0]
[null,{"$f":"IF($B$7=0,\"\",IF(OR($B$7=0,QUOTIENT($C63-1,$B$7)+1>MAX($K$6,Planning!$E$3)),\"\",IF(OR($C63>$C$7,MOD($C63-1,$B$7)>0),\"\",QUOTIENT($C63-1,$B$7)+1)))","v":""},55,null,null,null,null,null,"-",null,null," : ",null,null,null,"",null,null,null,null,null,null,null,null,null,null,null,null,null,null,null,null,null,null,null,null,null,{"$f":"IF(Planning!$D61=\"\",\"\",Planning!$D61)","v":""},"",0]
[null,{"$f":"IF($B$7=0,\"\",IF(OR($B$7=0,QUOTIENT($C64-1,$B$7)+1>MAX($K$6,Planning!$E$3)),\"\",IF(OR($C64>$C$7,MOD($C64-1,$B$7)>0),\"\",QUOTIENT($C64-1,$B$7)+1)))","v":""},56,null,null,null,null,null,"-",null,null," : ",null,null,null,"",null,null,null,null,null,null,null,null,null,null,null,null,null,null,null,null,null,null,null,null,null,{"$f":"IF(Planning!$D62=\"\",\"\",Planning!$D62)","v":""},"",0]
[null,{"$f":"IF($B$7=0,\"\",IF(OR($B$7=0,QUOTIENT($C65-1,$B$7)+1>MAX($K$6,Planning!$E$3)),\"\",IF(OR($C65>$C$7,MOD($C65-1,$B$7)>0),\"\",QUOTIENT($C65-1,$B$7)+1)))","v":""},57,null,null,null,null,null,"-",null,null," : ",null,null,null,"",null,null,null,null,null,null,null,null,null,null,null,null,null,null,null,null,null,null,null,null,null,{"$f":"IF(Planning!$D63=\"\",\"\",Planning!$D63)","v":""},"",0]
[null,{"$f":"IF($B$7=0,\"\",IF(OR($B$7=0,QUOTIENT($C66-1,$B$7)+1>MAX($K$6,Planning!$E$3)),\"\",IF(OR($C66>$C$7,MOD($C66-1,$B$7)>0),\"\",QUOTIENT($C66-1,$B$7)+1)))","v":""},58,null,null,null,null,null,"-",null,null," : ",null,null,null,"",null,null,null,null,null,null,null,null,null,null,null,null,null,null,null,null,null,null,null,null,null,{"$f":"IF(Planning!$D64=\"\",\"\",Planning!$D64)","v":""},"",0]
[null,{"$f":"IF($B$7=0,\"\",IF(OR($B$7=0,QUOTIENT($C67-1,$B$7)+1>MAX($K$6,Planning!$E$3)),\"\",IF(OR($C67>$C$7,MOD($C67-1,$B$7)>0),\"\",QUOTIENT($C67-1,$B$7)+1)))","v":""},59,null,null,null,null,null,"-",null,null," : ",null,null,null,"",null,null,null,null,null,null,null,null,null,null,null,null,null,null,null,null,null,null,null,null,null,{"$f":"IF(Planning!$D65=\"\",\"\",Planning!$D65)","v":""},"",0]
[null,{"$f":"IF($B$7=0,\"\",IF(OR($B$7=0,QUOTIENT($C68-1,$B$7)+1>MAX($K$6,Planning!$E$3)),\"\",IF(OR($C68>$C$7,MOD($C68-1,$B$7)>0),\"\",QUOTIENT($C68-1,$B$7)+1)))","v":""},60,null,null,null,null,null,"-",null,null," : ",null,null,null,"",null,null,null,null,null,null,null,null,null,null,null,null,null,null,null,null,null,null,null,null,null,{"$f":"IF(Planning!$D66=\"\",\"\",Planning!$D66)","v":""},"",0]
[null,{"$f":"IF($B$7=0,\"\",IF(OR($B$7=0,QUOTIENT($C69-1,$B$7)+1>MAX($K$6,Planning!$E$3)),\"\",IF(OR($C69>$C$7,MOD($C69-1,$B$7)>0),\"\",QUOTIENT($C69-1,$B$7)+1)))","v":""},61,null,null,null,null,null,"-",null,null," : ",null,null,null,"",null,null,null,null,null,null,null,null,null,null,null,null,null,null,null,null,null,null,null,null,null,{"$f":"IF(Planning!$D67=\"\",\"\",Planning!$D67)","v":""},"",0]
[null,{"$f":"IF($B$7=0,\"\",IF(OR($B$7=0,QUOTIENT($C70-1,$B$7)+1>MAX($K$6,Planning!$E$3)),\"\",IF(OR($C70>$C$7,MOD($C70-1,$B$7)>0),\"\",QUOTIENT($C70-1,$B$7)+1)))","v":""},62,null,null,null,null,null,"-",null,null," : ",null,null,null,"",null,null,null,null,null,null,null,null,null,null,null,null,null,null,null,null,null,null,null,null,null,{"$f":"IF(Planning!$D68=\"\",\"\",Planning!$D68)","v":""},"",0]
[null,{"$f":"IF($B$7=0,\"\",IF(OR($B$7=0,QUOTIENT($C71-1,$B$7)+1>MAX($K$6,Planning!$E$3)),\"\",IF(OR($C71>$C$7,MOD($C71-1,$B$7)>0),\"\",QUOTIENT($C71-1,$B$7)+1)))","v":""},63,null,null,null,null,null,"-",null,null," : ",null,null,null,"",null,null,null,null,null,null,null,null,null,null,null,null,null,null,null,null,null,null,null,null,null,{"$f":"IF(Planning!$D69=\"\",\"\",Planning!$D69)","v":""},"",0]
[null,{"$f":"IF($B$7=0,\"\",IF(OR($B$7=0,QUOTIENT($C72-1,$B$7)+1>MAX($K$6,Planning!$E$3)),\"\",IF(OR($C72>$C$7,MOD($C72-1,$B$7)>0),\"\",QUOTIENT($C72-1,$B$7)+1)))","v":""},64,null,null,null,null,null,"-",null,null," : ",null,null,null,"",null,null,null,null,null,null,null,null,null,null,null,null,null,null,null,null,null,null,null,null,null,{"$f":"IF(Planning!$D70=\"\",\"\",Planning!$D70)","v":""},"",0]
[null,{"$f":"IF($B$7=0,\"\",IF(OR($B$7=0,QUOTIENT($C73-1,$B$7)+1>MAX($K$6,Planning!$E$3)),\"\",IF(OR($C73>$C$7,MOD($C73-1,$B$7)>0),\"\",QUOTIENT($C73-1,$B$7)+1)))","v":""},65,null,null,null,null,null,"-",null,null," : ",null,null,null,"",null,null,null,null,null,null,null,null,null,null,null,null,null,null,null,null,null,null,null,null,null,{"$f":"IF(Planning!$D71=\"\",\"\",Planning!$D71)","v":""},"",0]
[null,{"$f":"IF($B$7=0,\"\",IF(OR($B$7=0,QUOTIENT($C74-1,$B$7)+1>MAX($K$6,Planning!$E$3)),\"\",IF(OR($C74>$C$7,MOD($C74-1,$B$7)>0),\"\",QUOTIENT($C74-1,$B$7)+1)))","v":""},66,null,null,null,null,null,"-",null,null," : ",null,null,null,"",null,null,null,null,null,null,null,null,null,null,null,null,null,null,null,null,null,null,null,null,null,{"$f":"IF(Planning!$D72=\"\",\"\",Planning!$D72)","v":""},"",{"$f":"COUNTIF($J$9:$J$108,$R74)","v":0}]
[null,{"$f":"IF($B$7=0,\"\",IF(OR($B$7=0,QUOTIENT($C75-1,$B$7)+1>MAX($K$6,Planning!$E$3)),\"\",IF(OR($C75>$C$7,MOD($C75-1,$B$7)>0),\"\",QUOTIENT($C75-1,$B$7)+1)))","v":""},67,null,null,null,null,null,"-",null,null," : ",null,null,null,"",null,null,null,null,null,null,null,null,null,null,null,null,null,null,null,null,null,null,null,null,null,{"$f":"IF(Planning!$D73=\"\",\"\",Planning!$D73)","v":""},"",0]
[null,{"$f":"IF($B$7=0,\"\",IF(OR($B$7=0,QUOTIENT($C76-1,$B$7)+1>MAX($K$6,Planning!$E$3)),\"\",IF(OR($C76>$C$7,MOD($C76-1,$B$7)>0),\"\",QUOTIENT($C76-1,$B$7)+1)))","v":""},68,null,null,null,null,null,"-",null,null," : ",null,null,null,"",null,null,null,null,null,null,null,null,null,null,null,null,null,null,null,null,null,null,null,null,null,{"$f":"IF(Planning!$D74=\"\",\"\",Planning!$D74)","v":""},"",0]
[null,{"$f":"IF($B$7=0,\"\",IF(OR($B$7=0,QUOTIENT($C77-1,$B$7)+1>MAX($K$6,Planning!$E$3)),\"\",IF(OR($C77>$C$7,MOD($C77-1,$B$7)>0),\"\",QUOTIENT($C77-1,$B$7)+1)))","v":""},69,null,null,null,null,null,"-",null,null," : ",null,null,null,"",null,null,null,null,null,null,null,null,null,null,null,null,null,null,null,null,null,null,null,null,null,{"$f":"IF(Planning!$D75=\"\",\"\",Planning!$D75)","v":""},"",0]
[null,{"$f":"IF($B$7=0,\"\",IF(OR($B$7=0,QUOTIENT($C78-1,$B$7)+1>MAX($K$6,Planning!$E$3)),\"\",IF(OR($C78>$C$7,MOD($C78-1,$B$7)>0),\"\",QUOTIENT($C78-1,$B$7)+1)))","v":""},70,null,null,null,null,null,"-",null,null," : ",null,null,null,"",null,null,null,null,null,null,null,null,null,null,null,null,null,null,null,null,null,null,null,null,null,{"$f":"IF(Planning!$D76=\"\",\"\",Planning!$D76)","v":""},"",0]
[null,{"$f":"IF($B$7=0,\"\",IF(OR($B$7=0,QUOTIENT($C79-1,$B$7)+1>MAX($K$6,Planning!$E$3)),\"\",IF(OR($C79>$C$7,MOD($C79-1,$B$7)>0),\"\",QUOTIENT($C79-1,$B$7)+1)))","v":""},71,null,null,null,null,null,"-",null,null," : ",null,null,null,"",null,null,null,null,null,null,null,null,null,null,null,null,null,null,null,null,null,null,null,null,null,{"$f":"IF(Planning!$D77=\"\",\"\",Planning!$D77)","v":""},"",0]
[null,{"$f":"IF($B$7=0,\"\",IF(OR($B$7=0,QUOTIENT($C80-1,$B$7)+1>MAX($K$6,Planning!$E$3)),\"\",IF(OR($C80>$C$7,MOD($C80-1,$B$7)>0),\"\",QUOTIENT($C80-1,$B$7)+1)))","v":""},72,null,null,null,null,null,"-",null,null," : ",null,null,null,"",null,null,null,null,null,null,null,null,null,null,null,null,null,null,null,null,null,null,null,null,null,{"$f":"IF(Planning!$D78=\"\",\"\",Planning!$D78)","v":""},"",0]
[null,{"$f":"IF($B$7=0,\"\",IF(OR($B$7=0,QUOTIENT($C81-1,$B$7)+1>MAX($K$6,Planning!$E$3)),\"\",IF(OR($C81>$C$7,MOD($C81-1,$B$7)>0),\"\",QUOTIENT($C81-1,$B$7)+1)))","v":""},73,null,null,null,null,null,"-",null,null," : ",null,null,null,"",null,null,null,null,null,null,null,null,null,null,null,null,null,null,null,null,null,null,null,null,null,{"$f":"IF(Planning!$D79=\"\",\"\",Planning!$D79)","v":""},"",0]
[null,{"$f":"IF($B$7=0,\"\",IF(OR($B$7=0,QUOTIENT($C82-1,$B$7)+1>MAX($K$6,Planning!$E$3)),\"\",IF(OR($C82>$C$7,MOD($C82-1,$B$7)>0),\"\",QUOTIENT($C82-1,$B$7)+1)))","v":""},74,null,null,null,null,null,"-",null,null," : ",null,null,null,"",null,null,null,null,null,null,null,null,null,null,null,null,null,null,null,null,null,null,null,null,null,{"$f":"IF(Planning!$D80=\"\",\"\",Planning!$D80)","v":""},"",0]
[null,{"$f":"IF($B$7=0,\"\",IF(OR($B$7=0,QUOTIENT($C83-1,$B$7)+1>MAX($K$6,Planning!$E$3)),\"\",IF(OR($C83>$C$7,MOD($C83-1,$B$7)>0),\"\",QUOTIENT($C83-1,$B$7)+1)))","v":""},75,null,null,null,null,null,"-",null,null," : ",null,null,null,"",null,null,null,null,null,null,null,null,null,null,null,null,null,null,null,null,null,null,null,null,null,{"$f":"IF(Planning!$D81=\"\",\"\",Planning!$D81)","v":""},"",0]
[null,{"$f":"IF($B$7=0,\"\",IF(OR($B$7=0,QUOTIENT($C84-1,$B$7)+1>MAX($K$6,Planning!$E$3)),\"\",IF(OR($C84>$C$7,MOD($C84-1,$B$7)>0),\"\",QUOTIENT($C84-1,$B$7)+1)))","v":""},76,null,null,null,null,null,"-",null,null," : ",null,null,null,"",null,null,null,null,null,null,null,null,null,null,null,null,null,null,null,null,null,null,null,null,null,{"$f":"IF(Planning!$D82=\"\",\"\",Planning!$D82)","v":""},"",0]
[null,{"$f":"IF($B$7=0,\"\",IF(OR($B$7=0,QUOTIENT($C85-1,$B$7)+1>MAX($K$6,Planning!$E$3)),\"\",IF(OR($C85>$C$7,MOD($C85-1,$B$7)>0),\"\",QUOTIENT($C85-1,$B$7)+1)))","v":""},77,null,null,null,null,null,"-",null,null," : ",null,null,null,"",null,null,null,null,null,null,null,null,null,null,null,null,null,null,null,null,null,null,null,null,null,{"$f":"IF(Planning!$D83=\"\",\"\",Planning!$D83)","v":""},"",0]
[null,{"$f":"IF($B$7=0,\"\",IF(OR($B$7=0,QUOTIENT($C86-1,$B$7)+1>MAX($K$6,Planning!$E$3)),\"\",IF(OR($C86>$C$7,MOD($C86-1,$B$7)>0),\"\",QUOTIENT($C86-1,$B$7)+1)))","v":""},78,null,null,null,null,null,"-",null,null," : ",null,null,null,"",null,null,null,null,null,null,null,null,null,null,null,null,null,null,null,null,null,null,null,null,null,{"$f":"IF(Planning!$D84=\"\",\"\",Planning!$D84)","v":""},"",0]
[null,{"$f":"IF($B$7=0,\"\",IF(OR($B$7=0,QUOTIENT($C87-1,$B$7)+1>MAX($K$6,Planning!$E$3)),\"\",IF(OR($C87>$C$7,MOD($C87-1,$B$7)>0),\"\",QUOTIENT($C87-1,$B$7)+1)))","v":""},79,null,null,null,null,null,"-",null,null," : ",null,null,null,"",null,null,null,null,null,null,null,null,null,null,null,null,null,null,null,null,null,null,null,null,null,{"$f":"IF(Planning!$D85=\"\",\"\",Planning!$D85)","v":""},"",0]
[null,{"$f":"IF($B$7=0,\"\",IF(OR($B$7=0,QUOTIENT($C88-1,$B$7)+1>MAX($K$6,Planning!$E$3)),\"\",IF(OR($C88>$C$7,MOD($C88-1,$B$7)>0),\"\",QUOTIENT($C88-1,$B$7)+1)))","v":""},80,null,null,null,null,null,"-",null,null," : ",null,null,null,"",null,null,null,null,null,null,null,null,null,null,null,null,null,null,null,null,null,null,null,null,null,{"$f":"IF(Planning!$D86=\"\",\"\",Planning!$D86)","v":""},"",0]
[null,{"$f":"IF($B$7=0,\"\",IF(OR($B$7=0,QUOTIENT($C89-1,$B$7)+1>MAX($K$6,Planning!$E$3)),\"\",IF(OR($C89>$C$7,MOD($C89-1,$B$7)>0),\"\",QUOTIENT($C89-1,$B$7)+1)))","v":""},81,null,null,null,null,null,"-",null,null," : ",null,null,null,"",null,null,null,null,null,null,null,null,null,null,null,null,null,null,null,null,null,null,null,null,null,{"$f":"IF(Planning!$D87=\"\",\"\",Planning!$D87)","v":""},"",0]
[null,{"$f":"IF($B$7=0,\"\",IF(OR($B$7=0,QUOTIENT($C90-1,$B$7)+1>MAX($K$6,Planning!$E$3)),\"\",IF(OR($C90>$C$7,MOD($C90-1,$B$7)>0),\"\",QUOTIENT($C90-1,$B$7)+1)))","v":""},82,null,null,null,null,null,"-",null,null," : ",null,null,null,"",null,null,null,null,null,null,null,null,null,null,null,null,null,null,null,null,null,null,null,null,null,{"$f":"IF(Planning!$D88=\"\",\"\",Planning!$D88)","v":""},"",0]
[null,{"$f":"IF($B$7=0,\"\",IF(OR($B$7=0,QUOTIENT($C91-1,$B$7)+1>MAX($K$6,Planning!$E$3)),\"\",IF(OR($C91>$C$7,MOD($C91-1,$B$7)>0),\"\",QUOTIENT($C91-1,$B$7)+1)))","v":""},83,null,null,null,null,null,"-",null,null," : ",null,null,null,"",null,null,null,null,null,null,null,null,null,null,null,null,null,null,null,null,null,null,null,null,null,{"$f":"IF(Planning!$D89=\"\",\"\",Planning!$D89)","v":""},"",0]
[null,{"$f":"IF($B$7=0,\"\",IF(OR($B$7=0,QUOTIENT($C92-1,$B$7)+1>MAX($K$6,Planning!$E$3)),\"\",IF(OR($C92>$C$7,MOD($C92-1,$B$7)>0),\"\",QUOTIENT($C92-1,$B$7)+1)))","v":""},84,null,null,null,null,null,"-",null,null," : ",null,null,null,"",null,null,null,null,null,null,null,null,null,null,null,null,null,null,null,null,null,null,null,null,null,{"$f":"IF(Planning!$D90=\"\",\"\",Planning!$D90)","v":""},"",0]
[null,{"$f":"IF($B$7=0,\"\",IF(OR($B$7=0,QUOTIENT($C93-1,$B$7)+1>MAX($K$6,Planning!$E$3)),\"\",IF(OR($C93>$C$7,MOD($C93-1,$B$7)>0),\"\",QUOTIENT($C93-1,$B$7)+1)))","v":""},85,null,null,null,null,null,"-",null,null," : ",null,null,null,"",null,null,null,null,null,null,null,null,null,null,null,null,null,null,null,null,null,null,null,null,null,{"$f":"IF(Planning!$D91=\"\",\"\",Planning!$D91)","v":""},"",0]
[null,{"$f":"IF($B$7=0,\"\",IF(OR($B$7=0,QUOTIENT($C94-1,$B$7)+1>MAX($K$6,Planning!$E$3)),\"\",IF(OR($C94>$C$7,MOD($C94-1,$B$7)>0),\"\",QUOTIENT($C94-1,$B$7)+1)))","v":""},86,null,null,null,null,null,"-",null,null," : ",null,null,null,"",null,null,null,null,null,null,null,null,null,null,null,null,null,null,null,null,null,null,null,null,null,{"$f":"IF(Planning!$D92=\"\",\"\",Planning!$D92)","v":""},"",0]
[null,{"$f":"IF($B$7=0,\"\",IF(OR($B$7=0,QUOTIENT($C95-1,$B$7)+1>MAX($K$6,Planning!$E$3)),\"\",IF(OR($C95>$C$7,MOD($C95-1,$B$7)>0),\"\",QUOTIENT($C95-1,$B$7)+1)))","v":""},87,null,null,null,null,null,"-",null,null," : ",null,null,null,"",null,null,null,null,null,null,null,null,null,null,null,null,null,null,null,null,null,null,null,null,null,{"$f":"IF(Planning!$D93=\"\",\"\",Planning!$D93)","v":""},"",0]
[null,{"$f":"IF($B$7=0,\"\",IF(OR($B$7=0,QUOTIENT($C96-1,$B$7)+1>MAX($K$6,Planning!$E$3)),\"\",IF(OR($C96>$C$7,MOD($C96-1,$B$7)>0),\"\",QUOTIENT($C96-1,$B$7)+1)))","v":""},88,null,null,null,null,null,"-",null,null," : ",null,null,null,"",null,null,null,null,null,null,null,null,null,null,null,null,null,null,null,null,null,null,null,null,null,{"$f":"IF(Planning!$D94=\"\",\"\",Planning!$D94)","v":""},"",0]
[null,{"$f":"IF($B$7=0,\"\",IF(OR($B$7=0,QUOTIENT($C97-1,$B$7)+1>MAX($K$6,Planning!$E$3)),\"\",IF(OR($C97>$C$7,MOD($C97-1,$B$7)>0),\"\",QUOTIENT($C97-1,$B$7)+1)))","v":""},89,null,null,null,null,null,"-",null,null," : ",null,null,null,"",null,null,null,null,null,null,null,null,null,null,null,null,null,null,null,null,null,null,null,null,null,{"$f":"IF(Planning!$D95=\"\",\"\",Planning!$D95)","v":""},"",0]
[null,{"$f":"IF($B$7=0,\"\",IF(OR($B$7=0,QUOTIENT($C98-1,$B$7)+1>MAX($K$6,Planning!$E$3)),\"\",IF(OR($C98>$C$7,MOD($C98-1,$B$7)>0),\"\",QUOTIENT($C98-1,$B$7)+1)))","v":""},90,null,null,null,null,null,"-",null,null," : ",null,null,null,"",null,null,null,null,null,null,null,null,null,null,null,null,null,null,null,null,null,null,null,null,null,{"$f":"IF(Planning!$D96=\"\",\"\",Planning!$D96)","v":""},"",0]
[null,{"$f":"IF($B$7=0,\"\",IF(OR($B$7=0,QUOTIENT($C99-1,$B$7)+1>MAX($K$6,Planning!$E$3)),\"\",IF(OR($C99>$C$7,MOD($C99-1,$B$7)>0),\"\",QUOTIENT($C99-1,$B$7)+1)))","v":""},91,null,null,null,null,null,"-",null,null," : ",null,null,null,"",null,null,null,null,null,null,null,null,null,null,null,null,null,null,null,null,null,null,null,null,null,{"$f":"IF(Planning!$D97=\"\",\"\",Planning!$D97)","v":""},"",0]
[null,{"$f":"IF($B$7=0,\"\",IF(OR($B$7=0,QUOTIENT($C100-1,$B$7)+1>MAX($K$6,Planning!$E$3)),\"\",IF(OR($C100>$C$7,MOD($C100-1,$B$7)>0),\"\",QUOTIENT($C100-1,$B$7)+1)))","v":""},92,null,null,null,null,null,"-",null,null," : ",null,null,null,"",null,null,null,null,null,null,null,null,null,null,null,null,null,null,null,null,null,null,null,null,null,{"$f":"IF(Planning!$D98=\"\",\"\",Planning!$D98)","v":""},"",0]
[null,{"$f":"IF($B$7=0,\"\",IF(OR($B$7=0,QUOTIENT($C101-1,$B$7)+1>MAX($K$6,Planning!$E$3)),\"\",IF(OR($C101>$C$7,MOD($C101-1,$B$7)>0),\"\",QUOTIENT($C101-1,$B$7)+1)))","v":""},93,null,null,null,null,null,"-",null,null," : ",null,null,null,"",null,null,null,null,null,null,null,null,null,null,null,null,null,null,null,null,null,null,null,null,null,{"$f":"IF(Planning!$D99=\"\",\"\",Planning!$D99)","v":""},"",0]
[null,{"$f":"IF($B$7=0,\"\",IF(OR($B$7=0,QUOTIENT($C102-1,$B$7)+1>MAX($K$6,Planning!$E$3)),\"\",IF(OR($C102>$C$7,MOD($C102-1,$B$7)>0),\"\",QUOTIENT($C102-1,$B$7)+1)))","v":""},94,null,null,null,null,null,"-",null,null," : ",null,null,null,"",null,null,null,null,null,null,null,null,null,null,null,null,null,null,null,null,null,null,null,null,null,{"$f":"IF(Planning!$D100=\"\",\"\",Planning!$D100)","v":""},"",0]
[null,{"$f":"IF($B$7=0,\"\",IF(OR($B$7=0,QUOTIENT($C103-1,$B$7)+1>MAX($K$6,Planning!$E$3)),\"\",IF(OR($C103>$C$7,MOD($C103-1,$B$7)>0),\"\",QUOTIENT($C103-1,$B$7)+1)))","v":""},95,null,null,null,null,null,"-",null,null," : ",null,null,null,"",null,null,null,null,null,null,null,null,null,null,null,null,null,null,null,null,null,null,null,null,null,{"$f":"IF(Planning!$D101=\"\",\"\",Planning!$D101)","v":""},"",0]
[null,{"$f":"IF($B$7=0,\"\",IF(OR($B$7=0,QUOTIENT($C104-1,$B$7)+1>MAX($K$6,Planning!$E$3)),\"\",IF(OR($C104>$C$7,MOD($C104-1,$B$7)>0),\"\",QUOTIENT($C104-1,$B$7)+1)))","v":""},96,null,null,null,null,null,"-",null,null," : ",null,null,null,"",null,null,null,null,null,null,null,null,null,null,null,null,null,null,null,null,null,null,null,null,null,{"$f":"IF(Planning!$D102=\"\",\"\",Planning!$D102)","v":""},"",0]
[null,{"$f":"IF($B$7=0,\"\",IF(OR($B$7=0,QUOTIENT($C105-1,$B$7)+1>MAX($K$6,Planning!$E$3)),\"\",IF(OR($C105>$C$7,MOD($C105-1,$B$7)>0),\"\",QUOTIENT($C105-1,$B$7)+1)))","v":""},97,null,null,null,null,null,"-",null,null," : ",null,null,null,"",null,null,null,null,null,null,null,null,null,null,null,null,null,null,null,null,null,null,null,null,null,{"$f":"IF(Planning!$D103=\"\",\"\",Planning!$D103)","v":""},"",0]
[null,{"$f":"IF($B$7=0,\"\",IF(OR($B$7=0,QUOTIENT($C106-1,$B$7)+1>MAX($K$6,Planning!$E$3)),\"\",IF(OR($C106>$C$7,MOD($C106-1,$B$7)>0),\"\",QUOTIENT($C106-1,$B$7)+1)))","v":""},98,null,null,null,null,null,"-",null,null," : ",null,null,null,"",null,null,null,null,null,null,null,null,null,null,null,null,null,null,null,null,null,null,null,null,null,{"$f":"IF(Planning!$D104=\"\",\"\",Planning!$D104)","v":""},"",0]
[null,{"$f":"IF($B$7=0,\"\",IF(OR($B$7=0,QUOTIENT($C107-1,$B$7)+1>MAX($K$6,Planning!$E$3)),\"\",IF(OR($C107>$C$7,MOD($C107-1,$B$7)>0),\"\",QUOTIENT($C107-1,$B$7)+1)))","v":""},99,null,null,null,null,null,"-",null,null," : ",null,null,null,"",null,null,null,null,null,null,null,null,null,null,null,null,null,null,null,null,null,null,null,null,null,{"$f":"IF(Planning!$D105=\"\",\"\",Planning!$D105)","v":""},"",0]
[null,{"$f":"IF($B$7=0,\"\",IF(OR($B$7=0,QUOTIENT($C108-1,$B$7)+1>MAX($K$6,Planning!$E$3)),\"\",IF(OR($C108>$C$7,MOD($C108-1,$B$7)>0),\"\",QUOTIENT($C108-1,$B$7)+1)))","v":""},100,null,null,null,null,null,"-",null,null," : ",null,null,null,"",null,null,null,null,null,null,null,null,null,null,null,null,null,null,null,null,null,null,null,null,null,{"$f":"IF(Planning!$D106=\"\",\"\",Planning!$D106)","v":""},"",0]
[null,{"$f":"IF($B$7=0,\"\",IF(OR($B$7=0,QUOTIENT($C109-1,$B$7)+1>MAX($K$6,Planning!$E$3)),\"\",IF(OR($C109>$C$7,MOD($C109-1,$B$7)>0),\"\",QUOTIENT($C109-1,$B$7)+1)))","v":""},101,null,null,null,null,null,"-",null,null," : "]
[null,{"$f":"IF($B$7=0,\"\",IF(OR($B$7=0,QUOTIENT($C110-1,$B$7)+1>MAX($K$6,Planning!$E$3)),\"\",IF(OR($C110>$C$7,MOD($C110-1,$B$7)>0),\"\",QUOTIENT($C110-1,$B$7)+1)))","v":""},102,null,null,null,null,null,"-",null,null," : "]
[null,{"$f":"IF($B$7=0,\"\",IF(OR($B$7=0,QUOTIENT($C111-1,$B$7)+1>MAX($K$6,Planning!$E$3)),\"\",IF(OR($C111>$C$7,MOD($C111-1,$B$7)>0),\"\",QUOTIENT($C111-1,$B$7)+1)))","v":""},103,null,null,null,null,null,"-",null,null," : "]
[null,{"$f":"IF($B$7=0,\"\",IF(OR($B$7=0,QUOTIENT($C112-1,$B$7)+1>MAX($K$6,Planning!$E$3)),\"\",IF(OR($C112>$C$7,MOD($C112-1,$B$7)>0),\"\",QUOTIENT($C112-1,$B$7)+1)))","v":""},104,null,null,null,null,null,"-",null,null," : "]
[null,{"$f":"IF($B$7=0,\"\",IF(OR($B$7=0,QUOTIENT($C113-1,$B$7)+1>MAX($K$6,Planning!$E$3)),\"\",IF(OR($C113>$C$7,MOD($C113-1,$B$7)>0),\"\",QUOTIENT($C113-1,$B$7)+1)))","v":""},105,null,null,null,null,null,"-",null,null," : "]
[null,{"$f":"IF($B$7=0,\"\",IF(OR($B$7=0,QUOTIENT($C114-1,$B$7)+1>MAX($K$6,Planning!$E$3)),\"\",IF(OR($C114>$C$7,MOD($C114-1,$B$7)>0),\"\",QUOTIENT($C114-1,$B$7)+1)))","v":""},106,null,null,null,null,null,"-",null,null," : "]
[null,{"$f":"IF($B$7=0,\"\",IF(OR($B$7=0,QUOTIENT($C115-1,$B$7)+1>MAX($K$6,Planning!$E$3)),\"\",IF(OR($C115>$C$7,MOD($C115-1,$B$7)>0),\"\",QUOTIENT($C115-1,$B$7)+1)))","v":""},107,null,null,null,null,null,"-",null,null," : "]
[null,{"$f":"IF($B$7=0,\"\",IF(OR($B$7=0,QUOTIENT($C116-1,$B$7)+1>MAX($K$6,Planning!$E$3)),\"\",IF(OR($C116>$C$7,MOD($C116-1,$B$7)>0),\"\",QUOTIENT($C116-1,$B$7)+1)))","v":""},108,null,null,null,null,null,"-",null,null," : "]
[null,{"$f":"IF($B$7=0,\"\",IF(OR($B$7=0,QUOTIENT($C117-1,$B$7)+1>MAX($K$6,Planning!$E$3)),\"\",IF(OR($C117>$C$7,MOD($C117-1,$B$7)>0),\"\",QUOTIENT($C117-1,$B$7)+1)))","v":""},109,null,null,null,null,null,"-",null,null," : "]
[null,{"$f":"IF($B$7=0,\"\",IF(OR($B$7=0,QUOTIENT($C118-1,$B$7)+1>MAX($K$6,Planning!$E$3)),\"\",IF(OR($C118>$C$7,MOD($C118-1,$B$7)>0),\"\",QUOTIENT($C118-1,$B$7)+1)))","v":""},110,null,null,null,null,null,"-",null,null," : "]
[null,{"$f":"IF($B$7=0,\"\",IF(OR($B$7=0,QUOTIENT($C119-1,$B$7)+1>MAX($K$6,Planning!$E$3)),\"\",IF(OR($C119>$C$7,MOD($C119-1,$B$7)>0),\"\",QUOTIENT($C119-1,$B$7)+1)))","v":""},111,null,null,null,null,null,"-",null,null," : "]
[null,{"$f":"IF($B$7=0,\"\",IF(OR($B$7=0,QUOTIENT($C120-1,$B$7)+1>MAX($K$6,Planning!$E$3)),\"\",IF(OR($C120>$C$7,MOD($C120-1,$B$7)>0),\"\",QUOTIENT($C120-1,$B$7)+1)))","v":""},112,null,null,null,null,null,"-",null,null," : "]
[null,{"$f":"IF($B$7=0,\"\",IF(OR($B$7=0,QUOTIENT($C121-1,$B$7)+1>MAX($K$6,Planning!$E$3)),\"\",IF(OR($C121>$C$7,MOD($C121-1,$B$7)>0),\"\",QUOTIENT($C121-1,$B$7)+1)))","v":""},113,null,null,null,null,null,"-",null,null," : "]
[null,{"$f":"IF($B$7=0,\"\",IF(OR($B$7=0,QUOTIENT($C122-1,$B$7)+1>MAX($K$6,Planning!$E$3)),\"\",IF(OR($C122>$C$7,MOD($C122-1,$B$7)>0),\"\",QUOTIENT($C122-1,$B$7)+1)))","v":""},114,null,null,null,null,null,"-",null,null," : "]
[null,{"$f":"IF($B$7=0,\"\",IF(OR($B$7=0,QUOTIENT($C123-1,$B$7)+1>MAX($K$6,Planning!$E$3)),\"\",IF(OR($C123>$C$7,MOD($C123-1,$B$7)>0),\"\",QUOTIENT($C123-1,$B$7)+1)))","v":""},115,null,null,null,null,null,"-",null,null," : "]
[null,{"$f":"IF($B$7=0,\"\",IF(OR($B$7=0,QUOTIENT($C124-1,$B$7)+1>MAX($K$6,Planning!$E$3)),\"\",IF(OR($C124>$C$7,MOD($C124-1,$B$7)>0),\"\",QUOTIENT($C124-1,$B$7)+1)))","v":""},116,null,null,null,null,null,"-",null,null," : "]
[null,{"$f":"IF($B$7=0,\"\",IF(OR($B$7=0,QUOTIENT($C125-1,$B$7)+1>MAX($K$6,Planning!$E$3)),\"\",IF(OR($C125>$C$7,MOD($C125-1,$B$7)>0),\"\",QUOTIENT($C125-1,$B$7)+1)))","v":""},117,null,null,null,null,null,"-",null,null," : "]
[null,{"$f":"IF($B$7=0,\"\",IF(OR($B$7=0,QUOTIENT($C126-1,$B$7)+1>MAX($K$6,Planning!$E$3)),\"\",IF(OR($C126>$C$7,MOD($C126-1,$B$7)>0),\"\",QUOTIENT($C126-1,$B$7)+1)))","v":""},118,null,null,null,null,null,"-",null,null," : "]
[null,{"$f":"IF($B$7=0,\"\",IF(OR($B$7=0,QUOTIENT($C127-1,$B$7)+1>MAX($K$6,Planning!$E$3)),\"\",IF(OR($C127>$C$7,MOD($C127-1,$B$7)>0),\"\",QUOTIENT($C127-1,$B$7)+1)))","v":""},119,null,null,null,null,null,"-",null,null," : "]
[null,{"$f":"IF($B$7=0,\"\",IF(OR($B$7=0,QUOTIENT($C128-1,$B$7)+1>MAX($K$6,Planning!$E$3)),\"\",IF(OR($C128>$C$7,MOD($C128-1,$B$7)>0),\"\",QUOTIENT($C128-1,$B$7)+1)))","v":""},120,null,null,null,null,null,"-",null,null," : "]
[null,{"$f":"IF($B$7=0,\"\",IF(OR($B$7=0,QUOTIENT($C129-1,$B$7)+1>MAX($K$6,Planning!$E$3)),\"\",IF(OR($C129>$C$7,MOD($C129-1,$B$7)>0),\"\",QUOTIENT($C129-1,$B$7)+1)))","v":""},121,null,null,null,null,null,"-",null,null," : "]
[null,{"$f":"IF($B$7=0,\"\",IF(OR($B$7=0,QUOTIENT($C130-1,$B$7)+1>MAX($K$6,Planning!$E$3)),\"\",IF(OR($C130>$C$7,MOD($C130-1,$B$7)>0),\"\",QUOTIENT($C130-1,$B$7)+1)))","v":""},122,null,null,null,null,null,"-",null,null," : "]
[null,{"$f":"IF($B$7=0,\"\",IF(OR($B$7=0,QUOTIENT($C131-1,$B$7)+1>MAX($K$6,Planning!$E$3)),\"\",IF(OR($C131>$C$7,MOD($C131-1,$B$7)>0),\"\",QUOTIENT($C131-1,$B$7)+1)))","v":""},123,null,null,null,null,null,"-",null,null," : "]
[null,{"$f":"IF($B$7=0,\"\",IF(OR($B$7=0,QUOTIENT($C132-1,$B$7)+1>MAX($K$6,Planning!$E$3)),\"\",IF(OR($C132>$C$7,MOD($C132-1,$B$7)>0),\"\",QUOTIENT($C132-1,$B$7)+1)))","v":""},124,null,null,null,null,null,"-",null,null," : "]
[null,{"$f":"IF($B$7=0,\"\",IF(OR($B$7=0,QUOTIENT($C133-1,$B$7)+1>MAX($K$6,Planning!$E$3)),\"\",IF(OR($C133>$C$7,MOD($C133-1,$B$7)>0),\"\",QUOTIENT($C133-1,$B$7)+1)))","v":""},125,null,null,null,null,null,"-",null,null," : "]
[null,{"$f":"IF($B$7=0,\"\",IF(OR($B$7=0,QUOTIENT($C134-1,$B$7)+1>MAX($K$6,Planning!$E$3)),\"\",IF(OR($C134>$C$7,MOD($C134-1,$B$7)>0),\"\",QUOTIENT($C134-1,$B$7)+1)))","v":""},126,null,null,null,null,null,"-",null,null," : "]
[null,{"$f":"IF($B$7=0,\"\",IF(OR($B$7=0,QUOTIENT($C135-1,$B$7)+1>MAX($K$6,Planning!$E$3)),\"\",IF(OR($C135>$C$7,MOD($C135-1,$B$7)>0),\"\",QUOTIENT($C135-1,$B$7)+1)))","v":""},127,null,null,null,null,null,"-",null,null," : "]
[null,{"$f":"IF($B$7=0,\"\",IF(OR($B$7=0,QUOTIENT($C136-1,$B$7)+1>MAX($K$6,Planning!$E$3)),\"\",IF(OR($C136>$C$7,MOD($C136-1,$B$7)>0),\"\",QUOTIENT($C136-1,$B$7)+1)))","v":""},128,null,null,null,null,null,"-",null,null," : "]
[null,{"$f":"IF($B$7=0,\"\",IF(OR($B$7=0,QUOTIENT($C137-1,$B$7)+1>MAX($K$6,Planning!$E$3)),\"\",IF(OR($C137>$C$7,MOD($C137-1,$B$7)>0),\"\",QUOTIENT($C137-1,$B$7)+1)))","v":""},129,null,null,null,null,null,"-",null,null," : "]
[null,{"$f":"IF($B$7=0,\"\",IF(OR($B$7=0,QUOTIENT($C138-1,$B$7)+1>MAX($K$6,Planning!$E$3)),\"\",IF(OR($C138>$C$7,MOD($C138-1,$B$7)>0),\"\",QUOTIENT($C138-1,$B$7)+1)))","v":""},130,null,null,null,null,null,"-",null,null," : "]
[null,{"$f":"IF($B$7=0,\"\",IF(OR($B$7=0,QUOTIENT($C139-1,$B$7)+1>MAX($K$6,Planning!$E$3)),\"\",IF(OR($C139>$C$7,MOD($C139-1,$B$7)>0),\"\",QUOTIENT($C139-1,$B$7)+1)))","v":""},131,null,null,null,null,null,"-",null,null," : "]
[null,{"$f":"IF($B$7=0,\"\",IF(OR($B$7=0,QUOTIENT($C140-1,$B$7)+1>MAX($K$6,Planning!$E$3)),\"\",IF(OR($C140>$C$7,MOD($C140-1,$B$7)>0),\"\",QUOTIENT($C140-1,$B$7)+1)))","v":""},132,null,null,null,null,null,"-",null,null," : "]
[null,{"$f":"IF($B$7=0,\"\",IF(OR($B$7=0,QUOTIENT($C141-1,$B$7)+1>MAX($K$6,Planning!$E$3)),\"\",IF(OR($C141>$C$7,MOD($C141-1,$B$7)>0),\"\",QUOTIENT($C141-1,$B$7)+1)))","v":""},133,null,null,null,null,null,"-",null,null," : "]
[null,{"$f":"IF($B$7=0,\"\",IF(OR($B$7=0,QUOTIENT($C142-1,$B$7)+1>MAX($K$6,Planning!$E$3)),\"\",IF(OR($C142>$C$7,MOD($C142-1,$B$7)>0),\"\",QUOTIENT($C142-1,$B$7)+1)))","v":""},134,null,null,null,null,null,"-",null,null," : "]
[null,{"$f":"IF($B$7=0,\"\",IF(OR($B$7=0,QUOTIENT($C143-1,$B$7)+1>MAX($K$6,Planning!$E$3)),\"\",IF(OR($C143>$C$7,MOD($C143-1,$B$7)>0),\"\",QUOTIENT($C143-1,$B$7)+1)))","v":""},135,null,null,null,null,null,"-",null,null," : "]
[null,{"$f":"IF($B$7=0,\"\",IF(OR($B$7=0,QUOTIENT($C144-1,$B$7)+1>MAX($K$6,Planning!$E$3)),\"\",IF(OR($C144>$C$7,MOD($C144-1,$B$7)>0),\"\",QUOTIENT($C144-1,$B$7)+1)))","v":""},136,null,null,null,null,null,"-",null,null," : "]
[null,{"$f":"IF($B$7=0,\"\",IF(OR($B$7=0,QUOTIENT($C145-1,$B$7)+1>MAX($K$6,Planning!$E$3)),\"\",IF(OR($C145>$C$7,MOD($C145-1,$B$7)>0),\"\",QUOTIENT($C145-1,$B$7)+1)))","v":""},137,null,null,null,null,null,"-",null,null," : "]
[null,{"$f":"IF($B$7=0,\"\",IF(OR($B$7=0,QUOTIENT($C146-1,$B$7)+1>MAX($K$6,Planning!$E$3)),\"\",IF(OR($C146>$C$7,MOD($C146-1,$B$7)>0),\"\",QUOTIENT($C146-1,$B$7)+1)))","v":""},138,null,null,null,null,null,"-",null,null," : "]
[null,{"$f":"IF($B$7=0,\"\",IF(OR($B$7=0,QUOTIENT($C147-1,$B$7)+1>MAX($K$6,Planning!$E$3)),\"\",IF(OR($C147>$C$7,MOD($C147-1,$B$7)>0),\"\",QUOTIENT($C147-1,$B$7)+1)))","v":""},139,null,null,null,null,null,"-",null,null," : "]
[null,{"$f":"IF($B$7=0,\"\",IF(OR($B$7=0,QUOTIENT($C148-1,$B$7)+1>MAX($K$6,Planning!$E$3)),\"\",IF(OR($C148>$C$7,MOD($C148-1,$B$7)>0),\"\",QUOTIENT($C148-1,$B$7)+1)))","v":""},140,null,null,null,null,null,"-",null,null," : "]
[null,{"$f":"IF($B$7=0,\"\",IF(OR($B$7=0,QUOTIENT($C149-1,$B$7)+1>MAX($K$6,Planning!$E$3)),\"\",IF(OR($C149>$C$7,MOD($C149-1,$B$7)>0),\"\",QUOTIENT($C149-1,$B$7)+1)))","v":""},141,null,null,null,null,null,"-",null,null," : "]
[null,{"$f":"IF($B$7=0,\"\",IF(OR($B$7=0,QUOTIENT($C150-1,$B$7)+1>MAX($K$6,Planning!$E$3)),\"\",IF(OR($C150>$C$7,MOD($C150-1,$B$7)>0),\"\",QUOTIENT($C150-1,$B$7)+1)))","v":""},142,null,null,null,null,null,"-",null,null," : "]
[null,{"$f":"IF($B$7=0,\"\",IF(OR($B$7=0,QUOTIENT($C151-1,$B$7)+1>MAX($K$6,Planning!$E$3)),\"\",IF(OR($C151>$C$7,MOD($C151-1,$B$7)>0),\"\",QUOTIENT($C151-1,$B$7)+1)))","v":""},143,null,null,null,null,null,"-",null,null," : "]
[null,{"$f":"IF($B$7=0,\"\",IF(OR($B$7=0,QUOTIENT($C152-1,$B$7)+1>MAX($K$6,Planning!$E$3)),\"\",IF(OR($C152>$C$7,MOD($C152-1,$B$7)>0),\"\",QUOTIENT($C152-1,$B$7)+1)))","v":""},144,null,null,null,null,null,"-",null,null," : "]
[null,{"$f":"IF($B$7=0,\"\",IF(OR($B$7=0,QUOTIENT($C153-1,$B$7)+1>MAX($K$6,Planning!$E$3)),\"\",IF(OR($C153>$C$7,MOD($C153-1,$B$7)>0),\"\",QUOTIENT($C153-1,$B$7)+1)))","v":""},145,null,null,null,null,null,"-",null,null," : "]
[null,{"$f":"IF($B$7=0,\"\",IF(OR($B$7=0,QUOTIENT($C154-1,$B$7)+1>MAX($K$6,Planning!$E$3)),\"\",IF(OR($C154>$C$7,MOD($C154-1,$B$7)>0),\"\",QUOTIENT($C154-1,$B$7)+1)))","v":""},146,null,null,null,null,null,"-",null,null," : "]
[null,{"$f":"IF($B$7=0,\"\",IF(OR($B$7=0,QUOTIENT($C155-1,$B$7)+1>MAX($K$6,Planning!$E$3)),\"\",IF(OR($C155>$C$7,MOD($C155-1,$B$7)>0),\"\",QUOTIENT($C155-1,$B$7)+1)))","v":""},147,null,null,null,null,null,"-",null,null," : "]
[null,{"$f":"IF($B$7=0,\"\",IF(OR($B$7=0,QUOTIENT($C156-1,$B$7)+1>MAX($K$6,Planning!$E$3)),\"\",IF(OR($C156>$C$7,MOD($C156-1,$B$7)>0),\"\",QUOTIENT($C156-1,$B$7)+1)))","v":""},148,null,null,null,null,null,"-",null,null," : "]
[null,{"$f":"IF($B$7=0,\"\",IF(OR($B$7=0,QUOTIENT($C157-1,$B$7)+1>MAX($K$6,Planning!$E$3)),\"\",IF(OR($C157>$C$7,MOD($C157-1,$B$7)>0),\"\",QUOTIENT($C157-1,$B$7)+1)))","v":""},149,null,null,null,null,null,"-",null,null," : "]
[null,{"$f":"IF($B$7=0,\"\",IF(OR($B$7=0,QUOTIENT($C158-1,$B$7)+1>MAX($K$6,Planning!$E$3)),\"\",IF(OR($C158>$C$7,MOD($C158-1,$B$7)>0),\"\",QUOTIENT($C158-1,$B$7)+1)))","v":""},150,null,null,null,null,null,"-",null,null," : "]
[null,{"$f":"IF($B$7=0,\"\",IF(OR($B$7=0,QUOTIENT($C159-1,$B$7)+1>MAX($K$6,Planning!$E$3)),\"\",IF(OR($C159>$C$7,MOD($C159-1,$B$7)>0),\"\",QUOTIENT($C159-1,$B$7)+1)))","v":""},151,null,null,null,null,null,"-",null,null," : "]
[null,{"$f":"IF($B$7=0,\"\",IF(OR($B$7=0,QUOTIENT($C160-1,$B$7)+1>MAX($K$6,Planning!$E$3)),\"\",IF(OR($C160>$C$7,MOD($C160-1,$B$7)>0),\"\",QUOTIENT($C160-1,$B$7)+1)))","v":""},152,null,null,null,null,null,"-",null,null," : "]
[null,{"$f":"IF($B$7=0,\"\",IF(OR($B$7=0,QUOTIENT($C161-1,$B$7)+1>MAX($K$6,Planning!$E$3)),\"\",IF(OR($C161>$C$7,MOD($C161-1,$B$7)>0),\"\",QUOTIENT($C161-1,$B$7)+1)))","v":""},153,null,null,null,null,null,"-",null,null," : "]
[null,{"$f":"IF($B$7=0,\"\",IF(OR($B$7=0,QUOTIENT($C162-1,$B$7)+1>MAX($K$6,Planning!$E$3)),\"\",IF(OR($C162>$C$7,MOD($C162-1,$B$7)>0),\"\",QUOTIENT($C162-1,$B$7)+1)))","v":""},154,null,null,null,null,null,"-",null,null," : "]
[null,{"$f":"IF($B$7=0,\"\",IF(OR($B$7=0,QUOTIENT($C163-1,$B$7)+1>MAX($K$6,Planning!$E$3)),\"\",IF(OR($C163>$C$7,MOD($C163-1,$B$7)>0),\"\",QUOTIENT($C163-1,$B$7)+1)))","v":""},155,null,null,null,null,null,"-",null,null," : "]
[null,{"$f":"IF($B$7=0,\"\",IF(OR($B$7=0,QUOTIENT($C164-1,$B$7)+1>MAX($K$6,Planning!$E$3)),\"\",IF(OR($C164>$C$7,MOD($C164-1,$B$7)>0),\"\",QUOTIENT($C164-1,$B$7)+1)))","v":""},156,null,null,null,null,null,"-",null,null," : "]
[null,{"$f":"IF($B$7=0,\"\",IF(OR($B$7=0,QUOTIENT($C165-1,$B$7)+1>MAX($K$6,Planning!$E$3)),\"\",IF(OR($C165>$C$7,MOD($C165-1,$B$7)>0),\"\",QUOTIENT($C165-1,$B$7)+1)))","v":""},157,null,null,null,null,null,"-",null,null," : "]
[null,{"$f":"IF($B$7=0,\"\",IF(OR($B$7=0,QUOTIENT($C166-1,$B$7)+1>MAX($K$6,Planning!$E$3)),\"\",IF(OR($C166>$C$7,MOD($C166-1,$B$7)>0),\"\",QUOTIENT($C166-1,$B$7)+1)))","v":""},158,null,null,null,null,null,"-",null,null," : "]
[null,{"$f":"IF($B$7=0,\"\",IF(OR($B$7=0,QUOTIENT($C167-1,$B$7)+1>MAX($K$6,Planning!$E$3)),\"\",IF(OR($C167>$C$7,MOD($C167-1,$B$7)>0),\"\",QUOTIENT($C167-1,$B$7)+1)))","v":""},159,null,null,null,null,null,"-",null,null," : "]
[null,{"$f":"IF($B$7=0,\"\",IF(OR($B$7=0,QUOTIENT($C168-1,$B$7)+1>MAX($K$6,Planning!$E$3)),\"\",IF(OR($C168>$C$7,MOD($C168-1,$B$7)>0),\"\",QUOTIENT($C168-1,$B$7)+1)))","v":""},160,null,null,null,null,null,"-",null,null," : "]
[null,{"$f":"IF($B$7=0,\"\",IF(OR($B$7=0,QUOTIENT($C169-1,$B$7)+1>MAX($K$6,Planning!$E$3)),\"\",IF(OR($C169>$C$7,MOD($C169-1,$B$7)>0),\"\",QUOTIENT($C169-1,$B$7)+1)))","v":""},161,null,null,null,null,null,"-",null,null," : "]
[null,{"$f":"IF($B$7=0,\"\",IF(OR($B$7=0,QUOTIENT($C170-1,$B$7)+1>MAX($K$6,Planning!$E$3)),\"\",IF(OR($C170>$C$7,MOD($C170-1,$B$7)>0),\"\",QUOTIENT($C170-1,$B$7)+1)))","v":""},162,null,null,null,null,null,"-",null,null," : "]
[null,{"$f":"IF($B$7=0,\"\",IF(OR($B$7=0,QUOTIENT($C171-1,$B$7)+1>MAX($K$6,Planning!$E$3)),\"\",IF(OR($C171>$C$7,MOD($C171-1,$B$7)>0),\"\",QUOTIENT($C171-1,$B$7)+1)))","v":""},163,null,null,null,null,null,"-",null,null," : "]
[null,{"$f":"IF($B$7=0,\"\",IF(OR($B$7=0,QUOTIENT($C172-1,$B$7)+1>MAX($K$6,Planning!$E$3)),\"\",IF(OR($C172>$C$7,MOD($C172-1,$B$7)>0),\"\",QUOTIENT($C172-1,$B$7)+1)))","v":""},164,null,null,null,null,null,"-",null,null," : "]
[null,{"$f":"IF($B$7=0,\"\",IF(OR($B$7=0,QUOTIENT($C173-1,$B$7)+1>MAX($K$6,Planning!$E$3)),\"\",IF(OR($C173>$C$7,MOD($C173-1,$B$7)>0),\"\",QUOTIENT($C173-1,$B$7)+1)))","v":""},165,null,null,null,null,null,"-",null,null," : "]
[null,{"$f":"IF($B$7=0,\"\",IF(OR($B$7=0,QUOTIENT($C174-1,$B$7)+1>MAX($K$6,Planning!$E$3)),\"\",IF(OR($C174>$C$7,MOD($C174-1,$B$7)>0),\"\",QUOTIENT($C174-1,$B$7)+1)))","v":""},166,null,null,null,null,null,"-",null,null," : "]
[null,{"$f":"IF($B$7=0,\"\",IF(OR($B$7=0,QUOTIENT($C175-1,$B$7)+1>MAX($K$6,Planning!$E$3)),\"\",IF(OR($C175>$C$7,MOD($C175-1,$B$7)>0),\"\",QUOTIENT($C175-1,$B$7)+1)))","v":""},167,null,null,null,null,null,"-",null,null," : "]
[null,{"$f":"IF($B$7=0,\"\",IF(OR($B$7=0,QUOTIENT($C176-1,$B$7)+1>MAX($K$6,Planning!$E$3)),\"\",IF(OR($C176>$C$7,MOD($C176-1,$B$7)>0),\"\",QUOTIENT($C176-1,$B$7)+1)))","v":""},168,null,null,null,null,null,"-",null,null," : "]
[null,{"$f":"IF($B$7=0,\"\",IF(OR($B$7=0,QUOTIENT($C177-1,$B$7)+1>MAX($K$6,Planning!$E$3)),\"\",IF(OR($C177>$C$7,MOD($C177-1,$B$7)>0),\"\",QUOTIENT($C177-1,$B$7)+1)))","v":""},169,null,null,null,null,null,"-",null,null," : "]
[null,{"$f":"IF($B$7=0,\"\",IF(OR($B$7=0,QUOTIENT($C178-1,$B$7)+1>MAX($K$6,Planning!$E$3)),\"\",IF(OR($C178>$C$7,MOD($C178-1,$B$7)>0),\"\",QUOTIENT($C178-1,$B$7)+1)))","v":""},170,null,null,null,null,null,"-",null,null," : "]
[null,{"$f":"IF($B$7=0,\"\",IF(OR($B$7=0,QUOTIENT($C179-1,$B$7)+1>MAX($K$6,Planning!$E$3)),\"\",IF(OR($C179>$C$7,MOD($C179-1,$B$7)>0),\"\",QUOTIENT($C179-1,$B$7)+1)))","v":""},171,null,null,null,null,null,"-",null,null," : "]
[null,{"$f":"IF($B$7=0,\"\",IF(OR($B$7=0,QUOTIENT($C180-1,$B$7)+1>MAX($K$6,Planning!$E$3)),\"\",IF(OR($C180>$C$7,MOD($C180-1,$B$7)>0),\"\",QUOTIENT($C180-1,$B$7)+1)))","v":""},172,null,null,null,null,null,"-",null,null," : "]
[null,{"$f":"IF($B$7=0,\"\",IF(OR($B$7=0,QUOTIENT($C181-1,$B$7)+1>MAX($K$6,Planning!$E$3)),\"\",IF(OR($C181>$C$7,MOD($C181-1,$B$7)>0),\"\",QUOTIENT($C181-1,$B$7)+1)))","v":""},173,null,null,null,null,null,"-",null,null," : "]
[null,{"$f":"IF($B$7=0,\"\",IF(OR($B$7=0,QUOTIENT($C182-1,$B$7)+1>MAX($K$6,Planning!$E$3)),\"\",IF(OR($C182>$C$7,MOD($C182-1,$B$7)>0),\"\",QUOTIENT($C182-1,$B$7)+1)))","v":""},174,null,null,null,null,null,"-",null,null," : "]
[null,{"$f":"IF($B$7=0,\"\",IF(OR($B$7=0,QUOTIENT($C183-1,$B$7)+1>MAX($K$6,Planning!$E$3)),\"\",IF(OR($C183>$C$7,MOD($C183-1,$B$7)>0),\"\",QUOTIENT($C183-1,$B$7)+1)))","v":""},175,null,null,null,null,null,"-",null,null," : "]
[null,{"$f":"IF($B$7=0,\"\",IF(OR($B$7=0,QUOTIENT($C184-1,$B$7)+1>MAX($K$6,Planning!$E$3)),\"\",IF(OR($C184>$C$7,MOD($C184-1,$B$7)>0),\"\",QUOTIENT($C184-1,$B$7)+1)))","v":""},176,null,null,null,null,null,"-",null,null," : "]
[null,{"$f":"IF($B$7=0,\"\",IF(OR($B$7=0,QUOTIENT($C185-1,$B$7)+1>MAX($K$6,Planning!$E$3)),\"\",IF(OR($C185>$C$7,MOD($C185-1,$B$7)>0),\"\",QUOTIENT($C185-1,$B$7)+1)))","v":""},177,null,null,null,null,null,"-",null,null," : "]
[null,{"$f":"IF($B$7=0,\"\",IF(OR($B$7=0,QUOTIENT($C186-1,$B$7)+1>MAX($K$6,Planning!$E$3)),\"\",IF(OR($C186>$C$7,MOD($C186-1,$B$7)>0),\"\",QUOTIENT($C186-1,$B$7)+1)))","v":""},178,null,null,null,null,null,"-",null,null," : "]
[null,{"$f":"IF($B$7=0,\"\",IF(OR($B$7=0,QUOTIENT($C187-1,$B$7)+1>MAX($K$6,Planning!$E$3)),\"\",IF(OR($C187>$C$7,MOD($C187-1,$B$7)>0),\"\",QUOTIENT($C187-1,$B$7)+1)))","v":""},179,null,null,null,null,null,"-",null,null," : "]
[null,{"$f":"IF($B$7=0,\"\",IF(OR($B$7=0,QUOTIENT($C188-1,$B$7)+1>MAX($K$6,Planning!$E$3)),\"\",IF(OR($C188>$C$7,MOD($C188-1,$B$7)>0),\"\",QUOTIENT($C188-1,$B$7)+1)))","v":""},180,null,null,null,null,null,"-",null,null," : "]
[null,{"$f":"IF($B$7=0,\"\",IF(OR($B$7=0,QUOTIENT($C189-1,$B$7)+1>MAX($K$6,Planning!$E$3)),\"\",IF(OR($C189>$C$7,MOD($C189-1,$B$7)>0),\"\",QUOTIENT($C189-1,$B$7)+1)))","v":""},181,null,null,null,null,null,"-",null,null," : "]
[null,{"$f":"IF($B$7=0,\"\",IF(OR($B$7=0,QUOTIENT($C190-1,$B$7)+1>MAX($K$6,Planning!$E$3)),\"\",IF(OR($C190>$C$7,MOD($C190-1,$B$7)>0),\"\",QUOTIENT($C190-1,$B$7)+1)))","v":""},182,null,null,null,null,null,"-",null,null," : "]
[null,{"$f":"IF($B$7=0,\"\",IF(OR($B$7=0,QUOTIENT($C191-1,$B$7)+1>MAX($K$6,Planning!$E$3)),\"\",IF(OR($C191>$C$7,MOD($C191-1,$B$7)>0),\"\",QUOTIENT($C191-1,$B$7)+1)))","v":""},183,null,null,null,null,null,"-",null,null," : "]
[null,{"$f":"IF($B$7=0,\"\",IF(OR($B$7=0,QUOTIENT($C192-1,$B$7)+1>MAX($K$6,Planning!$E$3)),\"\",IF(OR($C192>$C$7,MOD($C192-1,$B$7)>0),\"\",QUOTIENT($C192-1,$B$7)+1)))","v":""},184,null,null,null,null,null,"-",null,null," : "]
[null,{"$f":"IF($B$7=0,\"\",IF(OR($B$7=0,QUOTIENT($C193-1,$B$7)+1>MAX($K$6,Planning!$E$3)),\"\",IF(OR($C193>$C$7,MOD($C193-1,$B$7)>0),\"\",QUOTIENT($C193-1,$B$7)+1)))","v":""},185,null,null,null,null,null,"-",null,null," : "]
[null,{"$f":"IF($B$7=0,\"\",IF(OR($B$7=0,QUOTIENT($C194-1,$B$7)+1>MAX($K$6,Planning!$E$3)),\"\",IF(OR($C194>$C$7,MOD($C194-1,$B$7)>0),\"\",QUOTIENT($C194-1,$B$7)+1)))","v":""},186,null,null,null,null,null,"-",null,null," : "]
[null,{"$f":"IF($B$7=0,\"\",IF(OR($B$7=0,QUOTIENT($C195-1,$B$7)+1>MAX($K$6,Planning!$E$3)),\"\",IF(OR($C195>$C$7,MOD($C195-1,$B$7)>0),\"\",QUOTIENT($C195-1,$B$7)+1)))","v":""},187,null,null,null,null,null,"-",null,null," : "]
[null,{"$f":"IF($B$7=0,\"\",IF(OR($B$7=0,QUOTIENT($C196-1,$B$7)+1>MAX($K$6,Planning!$E$3)),\"\",IF(OR($C196>$C$7,MOD($C196-1,$B$7)>0),\"\",QUOTIENT($C196-1,$B$7)+1)))","v":""},188,null,null,null,null,null,"-",null,null," : "]
[null,{"$f":"IF($B$7=0,\"\",IF(OR($B$7=0,QUOTIENT($C197-1,$B$7)+1>MAX($K$6,Planning!$E$3)),\"\",IF(OR($C197>$C$7,MOD($C197-1,$B$7)>0),\"\",QUOTIENT($C197-1,$B$7)+1)))","v":""},189,null,null,null,null,null,"-",null,null," : "]
[null,{"$f":"IF($B$7=0,\"\",IF(OR($B$7=0,QUOTIENT($C198-1,$B$7)+1>MAX($K$6,Planning!$E$3)),\"\",IF(OR($C198>$C$7,MOD($C198-1,$B$7)>0),\"\",QUOTIENT($C198-1,$B$7)+1)))","v":""},190,null,null,null,null,null,"-",null,null," : "]
[null,{"$f":"IF($B$7=0,\"\",IF(OR($B$7=0,QUOTIENT($C199-1,$B$7)+1>MAX($K$6,Planning!$E$3)),\"\",IF(OR($C199>$C$7,MOD($C199-1,$B$7)>0),\"\",QUOTIENT($C199-1,$B$7)+1)))","v":""},191,null,null,null,null,null,"-",null,null," : "]
[null,{"$f":"IF($B$7=0,\"\",IF(OR($B$7=0,QUOTIENT($C200-1,$B$7)+1>MAX($K$6,Planning!$E$3)),\"\",IF(OR($C200>$C$7,MOD($C200-1,$B$7)>0),\"\",QUOTIENT($C200-1,$B$7)+1)))","v":""},192,null,null,null,null,null,"-",null,null," : "]
[null,{"$f":"IF($B$7=0,\"\",IF(OR($B$7=0,QUOTIENT($C201-1,$B$7)+1>MAX($K$6,Planning!$E$3)),\"\",IF(OR($C201>$C$7,MOD($C201-1,$B$7)>0),\"\",QUOTIENT($C201-1,$B$7)+1)))","v":""},193,null,null,null,null,null,"-",null,null," : "]
[null,{"$f":"IF($B$7=0,\"\",IF(OR($B$7=0,QUOTIENT($C202-1,$B$7)+1>MAX($K$6,Planning!$E$3)),\"\",IF(OR($C202>$C$7,MOD($C202-1,$B$7)>0),\"\",QUOTIENT($C202-1,$B$7)+1)))","v":""},194,null,null,null,null,null,"-",null,null," : "]
[null,{"$f":"IF($B$7=0,\"\",IF(OR($B$7=0,QUOTIENT($C203-1,$B$7)+1>MAX($K$6,Planning!$E$3)),\"\",IF(OR($C203>$C$7,MOD($C203-1,$B$7)>0),\"\",QUOTIENT($C203-1,$B$7)+1)))","v":""},195,null,null,null,null,null,"-",null,null," : "]
[null,{"$f":"IF($B$7=0,\"\",IF(OR($B$7=0,QUOTIENT($C204-1,$B$7)+1>MAX($K$6,Planning!$E$3)),\"\",IF(OR($C204>$C$7,MOD($C204-1,$B$7)>0),\"\",QUOTIENT($C204-1,$B$7)+1)))","v":""},196,null,null,null,null,null,"-",null,null," : "]
[null,{"$f":"IF($B$7=0,\"\",IF(OR($B$7=0,QUOTIENT($C205-1,$B$7)+1>MAX($K$6,Planning!$E$3)),\"\",IF(OR($C205>$C$7,MOD($C205-1,$B$7)>0),\"\",QUOTIENT($C205-1,$B$7)+1)))","v":""},197,null,null,null,null,null,"-",null,null," : "]
[null,{"$f":"IF($B$7=0,\"\",IF(OR($B$7=0,QUOTIENT($C206-1,$B$7)+1>MAX($K$6,Planning!$E$3)),\"\",IF(OR($C206>$C$7,MOD($C206-1,$B$7)>0),\"\",QUOTIENT($C206-1,$B$7)+1)))","v":""},198,null,null,null,null,null,"-",null,null," : "]
[null,{"$f":"IF($B$7=0,\"\",IF(OR($B$7=0,QUOTIENT($C207-1,$B$7)+1>MAX($K$6,Planning!$E$3)),\"\",IF(OR($C207>$C$7,MOD($C207-1,$B$7)>0),\"\",QUOTIENT($C207-1,$B$7)+1)))","v":""},199,null,null,null,null,null,"-",null,null," : "]
[null,{"$f":"IF($B$7=0,\"\",IF(OR($B$7=0,QUOTIENT($C208-1,$B$7)+1>MAX($K$6,Planning!$E$3)),\"\",IF(OR($C208>$C$7,MOD($C208-1,$B$7)>0),\"\",QUOTIENT($C208-1,$B$7)+1)))","v":""},200,null,null,null,null,null,"-",null,null," : "]
[null,{"$f":"IF($B$7=0,\"\",IF(OR($B$7=0,QUOTIENT($C209-1,$B$7)+1>MAX($K$6,Planning!$E$3)),\"\",IF(OR($C209>$C$7,MOD($C209-1,$B$7)>0),\"\",QUOTIENT($C209-1,$B$7)+1)))","v":""},201,null,null,null,null,null,"-",null,null," : "]
[null,{"$f":"IF($B$7=0,\"\",IF(OR($B$7=0,QUOTIENT($C210-1,$B$7)+1>MAX($K$6,Planning!$E$3)),\"\",IF(OR($C210>$C$7,MOD($C210-1,$B$7)>0),\"\",QUOTIENT($C210-1,$B$7)+1)))","v":""},202,null,null,null,null,null,"-",null,null," : "]
[null,{"$f":"IF($B$7=0,\"\",IF(OR($B$7=0,QUOTIENT($C211-1,$B$7)+1>MAX($K$6,Planning!$E$3)),\"\",IF(OR($C211>$C$7,MOD($C211-1,$B$7)>0),\"\",QUOTIENT($C211-1,$B$7)+1)))","v":""},203,null,null,null,null,null,"-",null,null," : "]
[null,{"$f":"IF($B$7=0,\"\",IF(OR($B$7=0,QUOTIENT($C212-1,$B$7)+1>MAX($K$6,Planning!$E$3)),\"\",IF(OR($C212>$C$7,MOD($C212-1,$B$7)>0),\"\",QUOTIENT($C212-1,$B$7)+1)))","v":""},204,null,null,null,null,null,"-",null,null," : "]
[null,{"$f":"IF($B$7=0,\"\",IF(OR($B$7=0,QUOTIENT($C213-1,$B$7)+1>MAX($K$6,Planning!$E$3)),\"\",IF(OR($C213>$C$7,MOD($C213-1,$B$7)>0),\"\",QUOTIENT($C213-1,$B$7)+1)))","v":""},205,null,null,null,null,null,"-",null,null," : "]
[null,{"$f":"IF($B$7=0,\"\",IF(OR($B$7=0,QUOTIENT($C214-1,$B$7)+1>MAX($K$6,Planning!$E$3)),\"\",IF(OR($C214>$C$7,MOD($C214-1,$B$7)>0),\"\",QUOTIENT($C214-1,$B$7)+1)))","v":""},206,null,null,null,null,null,"-",null,null," : "]
[null,{"$f":"IF($B$7=0,\"\",IF(OR($B$7=0,QUOTIENT($C215-1,$B$7)+1>MAX($K$6,Planning!$E$3)),\"\",IF(OR($C215>$C$7,MOD($C215-1,$B$7)>0),\"\",QUOTIENT($C215-1,$B$7)+1)))","v":""},207,null,null,null,null,null,"-",null,null," : "]
[null,{"$f":"IF($B$7=0,\"\",IF(OR($B$7=0,QUOTIENT($C216-1,$B$7)+1>MAX($K$6,Planning!$E$3)),\"\",IF(OR($C216>$C$7,MOD($C216-1,$B$7)>0),\"\",QUOTIENT($C216-1,$B$7)+1)))","v":""},208,null,null,null,null,null,"-",null,null," : "]
[null,{"$f":"IF($B$7=0,\"\",IF(OR($B$7=0,QUOTIENT($C217-1,$B$7)+1>MAX($K$6,Planning!$E$3)),\"\",IF(OR($C217>$C$7,MOD($C217-1,$B$7)>0),\"\",QUOTIENT($C217-1,$B$7)+1)))","v":""},209,null,null,null,null,null,"-",null,null," : "]
[null,{"$f":"IF($B$7=0,\"\",IF(OR($B$7=0,QUOTIENT($C218-1,$B$7)+1>MAX($K$6,Planning!$E$3)),\"\",IF(OR($C218>$C$7,MOD($C218-1,$B$7)>0),\"\",QUOTIENT($C218-1,$B$7)+1)))","v":""},210,null,null,null,null,null,"-",null,null," : "]
[null,{"$f":"IF($B$7=0,\"\",IF(OR($B$7=0,QUOTIENT($C219-1,$B$7)+1>MAX($K$6,Planning!$E$3)),\"\",IF(OR($C219>$C$7,MOD($C219-1,$B$7)>0),\"\",QUOTIENT($C219-1,$B$7)+1)))","v":""},211,null,null,null,null,null,"-",null,null," : "]
[null,{"$f":"IF($B$7=0,\"\",IF(OR($B$7=0,QUOTIENT($C220-1,$B$7)+1>MAX($K$6,Planning!$E$3)),\"\",IF(OR($C220>$C$7,MOD($C220-1,$B$7)>0),\"\",QUOTIENT($C220-1,$B$7)+1)))","v":""},212,null,null,null,null,null,"-",null,null," : "]
[null,{"$f":"IF($B$7=0,\"\",IF(OR($B$7=0,QUOTIENT($C221-1,$B$7)+1>MAX($K$6,Planning!$E$3)),\"\",IF(OR($C221>$C$7,MOD($C221-1,$B$7)>0),\"\",QUOTIENT($C221-1,$B$7)+1)))","v":""},213,null,null,null,null,null,"-",null,null," : "]
[null,{"$f":"IF($B$7=0,\"\",IF(OR($B$7=0,QUOTIENT($C222-1,$B$7)+1>MAX($K$6,Planning!$E$3)),\"\",IF(OR($C222>$C$7,MOD($C222-1,$B$7)>0),\"\",QUOTIENT($C222-1,$B$7)+1)))","v":""},214,null,null,null,null,null,"-",null,null," : "]
[null,{"$f":"IF($B$7=0,\"\",IF(OR($B$7=0,QUOTIENT($C223-1,$B$7)+1>MAX($K$6,Planning!$E$3)),\"\",IF(OR($C223>$C$7,MOD($C223-1,$B$7)>0),\"\",QUOTIENT($C223-1,$B$7)+1)))","v":""},215,null,null,null,null,null,"-",null,null," : "]
[null,{"$f":"IF($B$7=0,\"\",IF(OR($B$7=0,QUOTIENT($C224-1,$B$7)+1>MAX($K$6,Planning!$E$3)),\"\",IF(OR($C224>$C$7,MOD($C224-1,$B$7)>0),\"\",QUOTIENT($C224-1,$B$7)+1)))","v":""},216,null,null,null,null,null,"-",null,null," : "]
[null,{"$f":"IF($B$7=0,\"\",IF(OR($B$7=0,QUOTIENT($C225-1,$B$7)+1>MAX($K$6,Planning!$E$3)),\"\",IF(OR($C225>$C$7,MOD($C225-1,$B$7)>0),\"\",QUOTIENT($C225-1,$B$7)+1)))","v":""},217,null,null,null,null,null,"-",null,null," : "]
[null,{"$f":"IF($B$7=0,\"\",IF(OR($B$7=0,QUOTIENT($C226-1,$B$7)+1>MAX($K$6,Planning!$E$3)),\"\",IF(OR($C226>$C$7,MOD($C226-1,$B$7)>0),\"\",QUOTIENT($C226-1,$B$7)+1)))","v":""},218,null,null,null,null,null,"-",null,null," : "]
[null,{"$f":"IF($B$7=0,\"\",IF(OR($B$7=0,QUOTIENT($C227-1,$B$7)+1>MAX($K$6,Planning!$E$3)),\"\",IF(OR($C227>$C$7,MOD($C227-1,$B$7)>0),\"\",QUOTIENT($C227-1,$B$7)+1)))","v":""},219,null,null,null,null,null,"-",null,null," : "]
[null,{"$f":"IF($B$7=0,\"\",IF(OR($B$7=0,QUOTIENT($C228-1,$B$7)+1>MAX($K$6,Planning!$E$3)),\"\",IF(OR($C228>$C$7,MOD($C228-1,$B$7)>0),\"\",QUOTIENT($C228-1,$B$7)+1)))","v":""},220,null,null,null,null,null,"-",null,null," : "]
[null,{"$f":"IF($B$7=0,\"\",IF(OR($B$7=0,QUOTIENT($C229-1,$B$7)+1>MAX($K$6,Planning!$E$3)),\"\",IF(OR($C229>$C$7,MOD($C229-1,$B$7)>0),\"\",QUOTIENT($C229-1,$B$7)+1)))","v":""},221,null,null,null,null,null,"-",null,null," : "]
[null,{"$f":"IF($B$7=0,\"\",IF(OR($B$7=0,QUOTIENT($C230-1,$B$7)+1>MAX($K$6,Planning!$E$3)),\"\",IF(OR($C230>$C$7,MOD($C230-1,$B$7)>0),\"\",QUOTIENT($C230-1,$B$7)+1)))","v":""},222,null,null,null,null,null,"-",null,null," : "]
[null,{"$f":"IF($B$7=0,\"\",IF(OR($B$7=0,QUOTIENT($C231-1,$B$7)+1>MAX($K$6,Planning!$E$3)),\"\",IF(OR($C231>$C$7,MOD($C231-1,$B$7)>0),\"\",QUOTIENT($C231-1,$B$7)+1)))","v":""},223,null,null,null,null,null,"-",null,null," : "]
[null,{"$f":"IF($B$7=0,\"\",IF(OR($B$7=0,QUOTIENT($C232-1,$B$7)+1>MAX($K$6,Planning!$E$3)),\"\",IF(OR($C232>$C$7,MOD($C232-1,$B$7)>0),\"\",QUOTIENT($C232-1,$B$7)+1)))","v":""},224,null,null,null,null,null,"-",null,null," : "]
[null,{"$f":"IF($B$7=0,\"\",IF(OR($B$7=0,QUOTIENT($C233-1,$B$7)+1>MAX($K$6,Planning!$E$3)),\"\",IF(OR($C233>$C$7,MOD($C233-1,$B$7)>0),\"\",QUOTIENT($C233-1,$B$7)+1)))","v":""},225,null,null,null,null,null,"-",null,null," : "]
[null,{"$f":"IF($B$7=0,\"\",IF(OR($B$7=0,QUOTIENT($C234-1,$B$7)+1>MAX($K$6,Planning!$E$3)),\"\",IF(OR($C234>$C$7,MOD($C234-1,$B$7)>0),\"\",QUOTIENT($C234-1,$B$7)+1)))","v":""},226,null,null,null,null,null,"-",null,null," : "]
[null,{"$f":"IF($B$7=0,\"\",IF(OR($B$7=0,QUOTIENT($C235-1,$B$7)+1>MAX($K$6,Planning!$E$3)),\"\",IF(OR($C235>$C$7,MOD($C235-1,$B$7)>0),\"\",QUOTIENT($C235-1,$B$7)+1)))","v":""},227,null,null,null,null,null,"-",null,null," : "]
[null,{"$f":"IF($B$7=0,\"\",IF(OR($B$7=0,QUOTIENT($C236-1,$B$7)+1>MAX($K$6,Planning!$E$3)),\"\",IF(OR($C236>$C$7,MOD($C236-1,$B$7)>0),\"\",QUOTIENT($C236-1,$B$7)+1)))","v":""},228,null,null,null,null,null,"-",null,null," : "]
[null,{"$f":"IF($B$7=0,\"\",IF(OR($B$7=0,QUOTIENT($C237-1,$B$7)+1>MAX($K$6,Planning!$E$3)),\"\",IF(OR($C237>$C$7,MOD($C237-1,$B$7)>0),\"\",QUOTIENT($C237-1,$B$7)+1)))","v":""},229,null,null,null,null,null,"-",null,null," : "]
[null,{"$f":"IF($B$7=0,\"\",IF(OR($B$7=0,QUOTIENT($C238-1,$B$7)+1>MAX($K$6,Planning!$E$3)),\"\",IF(OR($C238>$C$7,MOD($C238-1,$B$7)>0),\"\",QUOTIENT($C238-1,$B$7)+1)))","v":""},230,null,null,null,null,null,"-",null,null," : "]
[null,{"$f":"IF($B$7=0,\"\",IF(OR($B$7=0,QUOTIENT($C239-1,$B$7)+1>MAX($K$6,Planning!$E$3)),\"\",IF(OR($C239>$C$7,MOD($C239-1,$B$7)>0),\"\",QUOTIENT($C239-1,$B$7)+1)))","v":""},231,null,null,null,null,null,"-",null,null," : "]
[null,{"$f":"IF($B$7=0,\"\",IF(OR($B$7=0,QUOTIENT($C240-1,$B$7)+1>MAX($K$6,Planning!$E$3)),\"\",IF(OR($C240>$C$7,MOD($C240-1,$B$7)>0),\"\",QUOTIENT($C240-1,$B$7)+1)))","v":""},232,null,null,null,null,null,"-",null,null," : "]
[null,{"$f":"IF($B$7=0,\"\",IF(OR($B$7=0,QUOTIENT($C241-1,$B$7)+1>MAX($K$6,Planning!$E$3)),\"\",IF(OR($C241>$C$7,MOD($C241-1,$B$7)>0),\"\",QUOTIENT($C241-1,$B$7)+1)))","v":""},233,null,null,null,null,null,"-",null,null," : "]
[null,{"$f":"IF($B$7=0,\"\",IF(OR($B$7=0,QUOTIENT($C242-1,$B$7)+1>MAX($K$6,Planning!$E$3)),\"\",IF(OR($C242>$C$7,MOD($C242-1,$B$7)>0),\"\",QUOTIENT($C242-1,$B$7)+1)))","v":""},234,null,null,null,null,null,"-",null,null," : "]
[null,{"$f":"IF($B$7=0,\"\",IF(OR($B$7=0,QUOTIENT($C243-1,$B$7)+1>MAX($K$6,Planning!$E$3)),\"\",IF(OR($C243>$C$7,MOD($C243-1,$B$7)>0),\"\",QUOTIENT($C243-1,$B$7)+1)))","v":""},235,null,null,null,null,null,"-",null,null," : "]
[null,{"$f":"IF($B$7=0,\"\",IF(OR($B$7=0,QUOTIENT($C244-1,$B$7)+1>MAX($K$6,Planning!$E$3)),\"\",IF(OR($C244>$C$7,MOD($C244-1,$B$7)>0),\"\",QUOTIENT($C244-1,$B$7)+1)))","v":""},236,null,null,null,null,null,"-",null,null," : "]
[null,{"$f":"IF($B$7=0,\"\",IF(OR($B$7=0,QUOTIENT($C245-1,$B$7)+1>MAX($K$6,Planning!$E$3)),\"\",IF(OR($C245>$C$7,MOD($C245-1,$B$7)>0),\"\",QUOTIENT($C245-1,$B$7)+1)))","v":""},237,null,null,null,null,null,"-",null,null," : "]
[null,{"$f":"IF($B$7=0,\"\",IF(OR($B$7=0,QUOTIENT($C246-1,$B$7)+1>MAX($K$6,Planning!$E$3)),\"\",IF(OR($C246>$C$7,MOD($C246-1,$B$7)>0),\"\",QUOTIENT($C246-1,$B$7)+1)))","v":""},238,null,null,null,null,null,"-",null,null," : "]
[null,{"$f":"IF($B$7=0,\"\",IF(OR($B$7=0,QUOTIENT($C247-1,$B$7)+1>MAX($K$6,Planning!$E$3)),\"\",IF(OR($C247>$C$7,MOD($C247-1,$B$7)>0),\"\",QUOTIENT($C247-1,$B$7)+1)))","v":""},239,null,null,null,null,null,"-",null,null," : "]
[null,{"$f":"IF($B$7=0,\"\",IF(OR($B$7=0,QUOTIENT($C248-1,$B$7)+1>MAX($K$6,Planning!$E$3)),\"\",IF(OR($C248>$C$7,MOD($C248-1,$B$7)>0),\"\",QUOTIENT($C248-1,$B$7)+1)))","v":""},240,null,null,null,null,null,"-",null,null," : "]
[null,{"$f":"IF($B$7=0,\"\",IF(OR($B$7=0,QUOTIENT($C249-1,$B$7)+1>MAX($K$6,Planning!$E$3)),\"\",IF(OR($C249>$C$7,MOD($C249-1,$B$7)>0),\"\",QUOTIENT($C249-1,$B$7)+1)))","v":""},241,null,null,null,null,null,"-",null,null," : "]
[null,{"$f":"IF($B$7=0,\"\",IF(OR($B$7=0,QUOTIENT($C250-1,$B$7)+1>MAX($K$6,Planning!$E$3)),\"\",IF(OR($C250>$C$7,MOD($C250-1,$B$7)>0),\"\",QUOTIENT($C250-1,$B$7)+1)))","v":""},242,null,null,null,null,null,"-",null,null," : "]
[null,{"$f":"IF($B$7=0,\"\",IF(OR($B$7=0,QUOTIENT($C251-1,$B$7)+1>MAX($K$6,Planning!$E$3)),\"\",IF(OR($C251>$C$7,MOD($C251-1,$B$7)>0),\"\",QUOTIENT($C251-1,$B$7)+1)))","v":""},243,null,null,null,null,null,"-",null,null," : "]
[null,{"$f":"IF($B$7=0,\"\",IF(OR($B$7=0,QUOTIENT($C252-1,$B$7)+1>MAX($K$6,Planning!$E$3)),\"\",IF(OR($C252>$C$7,MOD($C252-1,$B$7)>0),\"\",QUOTIENT($C252-1,$B$7)+1)))","v":""},244,null,null,null,null,null,"-",null,null," : "]
[null,{"$f":"IF($B$7=0,\"\",IF(OR($B$7=0,QUOTIENT($C253-1,$B$7)+1>MAX($K$6,Planning!$E$3)),\"\",IF(OR($C253>$C$7,MOD($C253-1,$B$7)>0),\"\",QUOTIENT($C253-1,$B$7)+1)))","v":""},245,null,null,null,null,null,"-",null,null," : "]
[null,{"$f":"IF($B$7=0,\"\",IF(OR($B$7=0,QUOTIENT($C254-1,$B$7)+1>MAX($K$6,Planning!$E$3)),\"\",IF(OR($C254>$C$7,MOD($C254-1,$B$7)>0),\"\",QUOTIENT($C254-1,$B$7)+1)))","v":""},246,null,null,null,null,null,"-",null,null," : "]
[null,{"$f":"IF($B$7=0,\"\",IF(OR($B$7=0,QUOTIENT($C255-1,$B$7)+1>MAX($K$6,Planning!$E$3)),\"\",IF(OR($C255>$C$7,MOD($C255-1,$B$7)>0),\"\",QUOTIENT($C255-1,$B$7)+1)))","v":""},247,null,null,null,null,null,"-",null,null," : "]
[null,{"$f":"IF($B$7=0,\"\",IF(OR($B$7=0,QUOTIENT($C256-1,$B$7)+1>MAX($K$6,Planning!$E$3)),\"\",IF(OR($C256>$C$7,MOD($C256-1,$B$7)>0),\"\",QUOTIENT($C256-1,$B$7)+1)))","v":""},248,null,null,null,null,null,"-",null,null," : "]
[null,{"$f":"IF($B$7=0,\"\",IF(OR($B$7=0,QUOTIENT($C257-1,$B$7)+1>MAX($K$6,Planning!$E$3)),\"\",IF(OR($C257>$C$7,MOD($C257-1,$B$7)>0),\"\",QUOTIENT($C257-1,$B$7)+1)))","v":""},249,null,null,null,null,null,"-",null,null," : "]
[null,{"$f":"IF($B$7=0,\"\",IF(OR($B$7=0,QUOTIENT($C258-1,$B$7)+1>MAX($K$6,Planning!$E$3)),\"\",IF(OR($C258>$C$7,MOD($C258-1,$B$7)>0),\"\",QUOTIENT($C258-1,$B$7)+1)))","v":""},250,null,null,null,null,null,"-",null,null," : "]
[null,{"$f":"IF($B$7=0,\"\",IF(OR($B$7=0,QUOTIENT($C259-1,$B$7)+1>MAX($K$6,Planning!$E$3)),\"\",IF(OR($C259>$C$7,MOD($C259-1,$B$7)>0),\"\",QUOTIENT($C259-1,$B$7)+1)))","v":""},251,null,null,null,null,null,"-",null,null," : "]
[null,{"$f":"IF($B$7=0,\"\",IF(OR($B$7=0,QUOTIENT($C260-1,$B$7)+1>MAX($K$6,Planning!$E$3)),\"\",IF(OR($C260>$C$7,MOD($C260-1,$B$7)>0),\"\",QUOTIENT($C260-1,$B$7)+1)))","v":""},252,null,null,null,null,null,"-",null,null," : "]
[null,{"$f":"IF($B$7=0,\"\",IF(OR($B$7=0,QUOTIENT($C261-1,$B$7)+1>MAX($K$6,Planning!$E$3)),\"\",IF(OR($C261>$C$7,MOD($C261-1,$B$7)>0),\"\",QUOTIENT($C261-1,$B$7)+1)))","v":""},253,null,null,null,null,null,"-",null,null," : "]
[null,{"$f":"IF($B$7=0,\"\",IF(OR($B$7=0,QUOTIENT($C262-1,$B$7)+1>MAX($K$6,Planning!$E$3)),\"\",IF(OR($C262>$C$7,MOD($C262-1,$B$7)>0),\"\",QUOTIENT($C262-1,$B$7)+1)))","v":""},254,null,null,null,null,null,"-",null,null," : "]
[null,{"$f":"IF($B$7=0,\"\",IF(OR($B$7=0,QUOTIENT($C263-1,$B$7)+1>MAX($K$6,Planning!$E$3)),\"\",IF(OR($C263>$C$7,MOD($C263-1,$B$7)>0),\"\",QUOTIENT($C263-1,$B$7)+1)))","v":""},255,null,null,null,null,null,"-",null,null," : "]
[null,{"$f":"IF($B$7=0,\"\",IF(OR($B$7=0,QUOTIENT($C264-1,$B$7)+1>MAX($K$6,Planning!$E$3)),\"\",IF(OR($C264>$C$7,MOD($C264-1,$B$7)>0),\"\",QUOTIENT($C264-1,$B$7)+1)))","v":""},256,null,null,null,null,null,"-",null,null," : "]
[null,{"$f":"IF($B$7=0,\"\",IF(OR($B$7=0,QUOTIENT($C265-1,$B$7)+1>MAX($K$6,Planning!$E$3)),\"\",IF(OR($C265>$C$7,MOD($C265-1,$B$7)>0),\"\",QUOTIENT($C265-1,$B$7)+1)))","v":""},257,null,null,null,null,null,"-",null,null," : "]
[null,{"$f":"IF($B$7=0,\"\",IF(OR($B$7=0,QUOTIENT($C266-1,$B$7)+1>MAX($K$6,Planning!$E$3)),\"\",IF(OR($C266>$C$7,MOD($C266-1,$B$7)>0),\"\",QUOTIENT($C266-1,$B$7)+1)))","v":""},258,null,null,null,null,null,"-",null,null," : "]
[null,{"$f":"IF($B$7=0,\"\",IF(OR($B$7=0,QUOTIENT($C267-1,$B$7)+1>MAX($K$6,Planning!$E$3)),\"\",IF(OR($C267>$C$7,MOD($C267-1,$B$7)>0),\"\",QUOTIENT($C267-1,$B$7)+1)))","v":""},259,null,null,null,null,null,"-",null,null," : "]
[null,{"$f":"IF($B$7=0,\"\",IF(OR($B$7=0,QUOTIENT($C268-1,$B$7)+1>MAX($K$6,Planning!$E$3)),\"\",IF(OR($C268>$C$7,MOD($C268-1,$B$7)>0),\"\",QUOTIENT($C268-1,$B$7)+1)))","v":""},260,null,null,null,null,null,"-",null,null," : "]
[null,{"$f":"IF($B$7=0,\"\",IF(OR($B$7=0,QUOTIENT($C269-1,$B$7)+1>MAX($K$6,Planning!$E$3)),\"\",IF(OR($C269>$C$7,MOD($C269-1,$B$7)>0),\"\",QUOTIENT($C269-1,$B$7)+1)))","v":""},261,null,null,null,null,null,"-",null,null," : "]
[null,{"$f":"IF($B$7=0,\"\",IF(OR($B$7=0,QUOTIENT($C270-1,$B$7)+1>MAX($K$6,Planning!$E$3)),\"\",IF(OR($C270>$C$7,MOD($C270-1,$B$7)>0),\"\",QUOTIENT($C270-1,$B$7)+1)))","v":""},262,null,null,null,null,null,"-",null,null," : "]
[null,{"$f":"IF($B$7=0,\"\",IF(OR($B$7=0,QUOTIENT($C271-1,$B$7)+1>MAX($K$6,Planning!$E$3)),\"\",IF(OR($C271>$C$7,MOD($C271-1,$B$7)>0),\"\",QUOTIENT($C271-1,$B$7)+1)))","v":""},263,null,null,null,null,null,"-",null,null," : "]
[null,{"$f":"IF($B$7=0,\"\",IF(OR($B$7=0,QUOTIENT($C272-1,$B$7)+1>MAX($K$6,Planning!$E$3)),\"\",IF(OR($C272>$C$7,MOD($C272-1,$B$7)>0),\"\",QUOTIENT($C272-1,$B$7)+1)))","v":""},264,null,null,null,null,null,"-",null,null," : "]
[null,{"$f":"IF($B$7=0,\"\",IF(OR($B$7=0,QUOTIENT($C273-1,$B$7)+1>MAX($K$6,Planning!$E$3)),\"\",IF(OR($C273>$C$7,MOD($C273-1,$B$7)>0),\"\",QUOTIENT($C273-1,$B$7)+1)))","v":""},265,null,null,null,null,null,"-",null,null," : "]
[null,{"$f":"IF($B$7=0,\"\",IF(OR($B$7=0,QUOTIENT($C274-1,$B$7)+1>MAX($K$6,Planning!$E$3)),\"\",IF(OR($C274>$C$7,MOD($C274-1,$B$7)>0),\"\",QUOTIENT($C274-1,$B$7)+1)))","v":""},266,null,null,null,null,null,"-",null,null," : "]
[null,{"$f":"IF($B$7=0,\"\",IF(OR($B$7=0,QUOTIENT($C275-1,$B$7)+1>MAX($K$6,Planning!$E$3)),\"\",IF(OR($C275>$C$7,MOD($C275-1,$B$7)>0),\"\",QUOTIENT($C275-1,$B$7)+1)))","v":""},267,null,null,null,null,null,"-",null,null," : "]
[null,{"$f":"IF($B$7=0,\"\",IF(OR($B$7=0,QUOTIENT($C276-1,$B$7)+1>MAX($K$6,Planning!$E$3)),\"\",IF(OR($C276>$C$7,MOD($C276-1,$B$7)>0),\"\",QUOTIENT($C276-1,$B$7)+1)))","v":""},268,null,null,null,null,null,"-",null,null," : "]
[null,{"$f":"IF($B$7=0,\"\",IF(OR($B$7=0,QUOTIENT($C277-1,$B$7)+1>MAX($K$6,Planning!$E$3)),\"\",IF(OR($C277>$C$7,MOD($C277-1,$B$7)>0),\"\",QUOTIENT($C277-1,$B$7)+1)))","v":""},269,null,null,null,null,null,"-",null,null," : "]
[null,{"$f":"IF($B$7=0,\"\",IF(OR($B$7=0,QUOTIENT($C278-1,$B$7)+1>MAX($K$6,Planning!$E$3)),\"\",IF(OR($C278>$C$7,MOD($C278-1,$B$7)>0),\"\",QUOTIENT($C278-1,$B$7)+1)))","v":""},270,null,null,null,null,null,"-",null,null," : "]
[null,{"$f":"IF($B$7=0,\"\",IF(OR($B$7=0,QUOTIENT($C279-1,$B$7)+1>MAX($K$6,Planning!$E$3)),\"\",IF(OR($C279>$C$7,MOD($C279-1,$B$7)>0),\"\",QUOTIENT($C279-1,$B$7)+1)))","v":""},271,null,null,null,null,null,"-",null,null," : "]
[null,{"$f":"IF($B$7=0,\"\",IF(OR($B$7=0,QUOTIENT($C280-1,$B$7)+1>MAX($K$6,Planning!$E$3)),\"\",IF(OR($C280>$C$7,MOD($C280-1,$B$7)>0),\"\",QUOTIENT($C280-1,$B$7)+1)))","v":""},272,null,null,null,null,null,"-",null,null," : "]
[null,{"$f":"IF($B$7=0,\"\",IF(OR($B$7=0,QUOTIENT($C281-1,$B$7)+1>MAX($K$6,Planning!$E$3)),\"\",IF(OR($C281>$C$7,MOD($C281-1,$B$7)>0),\"\",QUOTIENT($C281-1,$B$7)+1)))","v":""},273,null,null,null,null,null,"-",null,null," : "]
[null,{"$f":"IF($B$7=0,\"\",IF(OR($B$7=0,QUOTIENT($C282-1,$B$7)+1>MAX($K$6,Planning!$E$3)),\"\",IF(OR($C282>$C$7,MOD($C282-1,$B$7)>0),\"\",QUOTIENT($C282-1,$B$7)+1)))","v":""},274,null,null,null,null,null,"-",null,null," : "]
[null,{"$f":"IF($B$7=0,\"\",IF(OR($B$7=0,QUOTIENT($C283-1,$B$7)+1>MAX($K$6,Planning!$E$3)),\"\",IF(OR($C283>$C$7,MOD($C283-1,$B$7)>0),\"\",QUOTIENT($C283-1,$B$7)+1)))","v":""},275,null,null,null,null,null,"-",null,null," : "]
[null,{"$f":"IF($B$7=0,\"\",IF(OR($B$7=0,QUOTIENT($C284-1,$B$7)+1>MAX($K$6,Planning!$E$3)),\"\",IF(OR($C284>$C$7,MOD($C284-1,$B$7)>0),\"\",QUOTIENT($C284-1,$B$7)+1)))","v":""},276,null,null,null,null,null,"-",null,null," : "]
[null,{"$f":"IF($B$7=0,\"\",IF(OR($B$7=0,QUOTIENT($C285-1,$B$7)+1>MAX($K$6,Planning!$E$3)),\"\",IF(OR($C285>$C$7,MOD($C285-1,$B$7)>0),\"\",QUOTIENT($C285-1,$B$7)+1)))","v":""},277,null,null,null,null,null,"-",null,null," : "]
[null,{"$f":"IF($B$7=0,\"\",IF(OR($B$7=0,QUOTIENT($C286-1,$B$7)+1>MAX($K$6,Planning!$E$3)),\"\",IF(OR($C286>$C$7,MOD($C286-1,$B$7)>0),\"\",QUOTIENT($C286-1,$B$7)+1)))","v":""},278,null,null,null,null,null,"-",null,null," : "]
[null,{"$f":"IF($B$7=0,\"\",IF(OR($B$7=0,QUOTIENT($C287-1,$B$7)+1>MAX($K$6,Planning!$E$3)),\"\",IF(OR($C287>$C$7,MOD($C287-1,$B$7)>0),\"\",QUOTIENT($C287-1,$B$7)+1)))","v":""},279,null,null,null,null,null,"-",null,null," : "]
[null,{"$f":"IF($B$7=0,\"\",IF(OR($B$7=0,QUOTIENT($C288-1,$B$7)+1>MAX($K$6,Planning!$E$3)),\"\",IF(OR($C288>$C$7,MOD($C288-1,$B$7)>0),\"\",QUOTIENT($C288-1,$B$7)+1)))","v":""},280,null,null,null,null,null,"-",null,null," : "]
[null,{"$f":"IF($B$7=0,\"\",IF(OR($B$7=0,QUOTIENT($C289-1,$B$7)+1>MAX($K$6,Planning!$E$3)),\"\",IF(OR($C289>$C$7,MOD($C289-1,$B$7)>0),\"\",QUOTIENT($C289-1,$B$7)+1)))","v":""},281,null,null,null,null,null,"-",null,null," : "]
[null,{"$f":"IF($B$7=0,\"\",IF(OR($B$7=0,QUOTIENT($C290-1,$B$7)+1>MAX($K$6,Planning!$E$3)),\"\",IF(OR($C290>$C$7,MOD($C290-1,$B$7)>0),\"\",QUOTIENT($C290-1,$B$7)+1)))","v":""},282,null,null,null,null,null,"-",null,null," : "]
[null,{"$f":"IF($B$7=0,\"\",IF(OR($B$7=0,QUOTIENT($C291-1,$B$7)+1>MAX($K$6,Planning!$E$3)),\"\",IF(OR($C291>$C$7,MOD($C291-1,$B$7)>0),\"\",QUOTIENT($C291-1,$B$7)+1)))","v":""},283,null,null,null,null,null,"-",null,null," : "]
[null,{"$f":"IF($B$7=0,\"\",IF(OR($B$7=0,QUOTIENT($C292-1,$B$7)+1>MAX($K$6,Planning!$E$3)),\"\",IF(OR($C292>$C$7,MOD($C292-1,$B$7)>0),\"\",QUOTIENT($C292-1,$B$7)+1)))","v":""},284,null,null,null,null,null,"-",null,null," : "]
[null,{"$f":"IF($B$7=0,\"\",IF(OR($B$7=0,QUOTIENT($C293-1,$B$7)+1>MAX($K$6,Planning!$E$3)),\"\",IF(OR($C293>$C$7,MOD($C293-1,$B$7)>0),\"\",QUOTIENT($C293-1,$B$7)+1)))","v":""},285,null,null,null,null,null,"-",null,null," : "]
[null,{"$f":"IF($B$7=0,\"\",IF(OR($B$7=0,QUOTIENT($C294-1,$B$7)+1>MAX($K$6,Planning!$E$3)),\"\",IF(OR($C294>$C$7,MOD($C294-1,$B$7)>0),\"\",QUOTIENT($C294-1,$B$7)+1)))","v":""},286,null,null,null,null,null,"-",null,null," : "]
[null,{"$f":"IF($B$7=0,\"\",IF(OR($B$7=0,QUOTIENT($C295-1,$B$7)+1>MAX($K$6,Planning!$E$3)),\"\",IF(OR($C295>$C$7,MOD($C295-1,$B$7)>0),\"\",QUOTIENT($C295-1,$B$7)+1)))","v":""},287,null,null,null,null,null,"-",null,null," : "]
[null,{"$f":"IF($B$7=0,\"\",IF(OR($B$7=0,QUOTIENT($C296-1,$B$7)+1>MAX($K$6,Planning!$E$3)),\"\",IF(OR($C296>$C$7,MOD($C296-1,$B$7)>0),\"\",QUOTIENT($C296-1,$B$7)+1)))","v":""},288,null,null,null,null,null,"-",null,null," : "]
[null,{"$f":"IF($B$7=0,\"\",IF(OR($B$7=0,QUOTIENT($C297-1,$B$7)+1>MAX($K$6,Planning!$E$3)),\"\",IF(OR($C297>$C$7,MOD($C297-1,$B$7)>0),\"\",QUOTIENT($C297-1,$B$7)+1)))","v":""},289,null,null,null,null,null,"-",null,null," : "]
[null,{"$f":"IF($B$7=0,\"\",IF(OR($B$7=0,QUOTIENT($C298-1,$B$7)+1>MAX($K$6,Planning!$E$3)),\"\",IF(OR($C298>$C$7,MOD($C298-1,$B$7)>0),\"\",QUOTIENT($C298-1,$B$7)+1)))","v":""},290,null,null,null,null,null,"-",null,null," : "]
[null,{"$f":"IF($B$7=0,\"\",IF(OR($B$7=0,QUOTIENT($C299-1,$B$7)+1>MAX($K$6,Planning!$E$3)),\"\",IF(OR($C299>$C$7,MOD($C299-1,$B$7)>0),\"\",QUOTIENT($C299-1,$B$7)+1)))","v":""},291,null,null,null,null,null,"-",null,null," : "]
[null,{"$f":"IF($B$7=0,\"\",IF(OR($B$7=0,QUOTIENT($C300-1,$B$7)+1>MAX($K$6,Planning!$E$3)),\"\",IF(OR($C300>$C$7,MOD($C300-1,$B$7)>0),\"\",QUOTIENT($C300-1,$B$7)+1)))","v":""},292,null,null,null,null,null,"-",null,null," : "]
[null,{"$f":"IF($B$7=0,\"\",IF(OR($B$7=0,QUOTIENT($C301-1,$B$7)+1>MAX($K$6,Planning!$E$3)),\"\",IF(OR($C301>$C$7,MOD($C301-1,$B$7)>0),\"\",QUOTIENT($C301-1,$B$7)+1)))","v":""},293,null,null,null,null,null,"-",null,null," : "]
[null,{"$f":"IF($B$7=0,\"\",IF(OR($B$7=0,QUOTIENT($C302-1,$B$7)+1>MAX($K$6,Planning!$E$3)),\"\",IF(OR($C302>$C$7,MOD($C302-1,$B$7)>0),\"\",QUOTIENT($C302-1,$B$7)+1)))","v":""},294,null,null,null,null,null,"-",null,null," : "]
[null,{"$f":"IF($B$7=0,\"\",IF(OR($B$7=0,QUOTIENT($C303-1,$B$7)+1>MAX($K$6,Planning!$E$3)),\"\",IF(OR($C303>$C$7,MOD($C303-1,$B$7)>0),\"\",QUOTIENT($C303-1,$B$7)+1)))","v":""},295,null,null,null,null,null,"-",null,null," : "]
[null,{"$f":"IF($B$7=0,\"\",IF(OR($B$7=0,QUOTIENT($C304-1,$B$7)+1>MAX($K$6,Planning!$E$3)),\"\",IF(OR($C304>$C$7,MOD($C304-1,$B$7)>0),\"\",QUOTIENT($C304-1,$B$7)+1)))","v":""},296,null,null,null,null,null,"-",null,null," : "]
[null,{"$f":"IF($B$7=0,\"\",IF(OR($B$7=0,QUOTIENT($C305-1,$B$7)+1>MAX($K$6,Planning!$E$3)),\"\",IF(OR($C305>$C$7,MOD($C305-1,$B$7)>0),\"\",QUOTIENT($C305-1,$B$7)+1)))","v":""},297,null,null,null,null,null,"-",null,null," : "]
[null,{"$f":"IF($B$7=0,\"\",IF(OR($B$7=0,QUOTIENT($C306-1,$B$7)+1>MAX($K$6,Planning!$E$3)),\"\",IF(OR($C306>$C$7,MOD($C306-1,$B$7)>0),\"\",QUOTIENT($C306-1,$B$7)+1)))","v":""},298,null,null,null,null,null,"-",null,null," : "]
[null,{"$f":"IF($B$7=0,\"\",IF(OR($B$7=0,QUOTIENT($C307-1,$B$7)+1>MAX($K$6,Planning!$E$3)),\"\",IF(OR($C307>$C$7,MOD($C307-1,$B$7)>0),\"\",QUOTIENT($C307-1,$B$7)+1)))","v":""},299,null,null,null,null,null,"-",null,null," : "]
[null,{"$f":"IF($B$7=0,\"\",IF(OR($B$7=0,QUOTIENT($C308-1,$B$7)+1>MAX($K$6,Planning!$E$3)),\"\",IF(OR($C308>$C$7,MOD($C308-1,$B$7)>0),\"\",QUOTIENT($C308-1,$B$7)+1)))","v":""},300,null,null,null,null,null,"-",null,null," : "]
[null,{"$f":"IF($B$7=0,\"\",IF(OR($B$7=0,QUOTIENT($C309-1,$B$7)+1>MAX($K$6,Planning!$E$3)),\"\",IF(OR($C309>$C$7,MOD($C309-1,$B$7)>0),\"\",QUOTIENT($C309-1,$B$7)+1)))","v":""},301,null,null,null,null,null,"-",null,null," : "]
[null,{"$f":"IF($B$7=0,\"\",IF(OR($B$7=0,QUOTIENT($C310-1,$B$7)+1>MAX($K$6,Planning!$E$3)),\"\",IF(OR($C310>$C$7,MOD($C310-1,$B$7)>0),\"\",QUOTIENT($C310-1,$B$7)+1)))","v":""},302,null,null,null,null,null,"-",null,null," : "]
[null,{"$f":"IF($B$7=0,\"\",IF(OR($B$7=0,QUOTIENT($C311-1,$B$7)+1>MAX($K$6,Planning!$E$3)),\"\",IF(OR($C311>$C$7,MOD($C311-1,$B$7)>0),\"\",QUOTIENT($C311-1,$B$7)+1)))","v":""},303,null,null,null,null,null,"-",null,null," : "]
[null,{"$f":"IF($B$7=0,\"\",IF(OR($B$7=0,QUOTIENT($C312-1,$B$7)+1>MAX($K$6,Planning!$E$3)),\"\",IF(OR($C312>$C$7,MOD($C312-1,$B$7)>0),\"\",QUOTIENT($C312-1,$B$7)+1)))","v":""},304,null,null,null,null,null,"-",null,null," : "]
[null,{"$f":"IF($B$7=0,\"\",IF(OR($B$7=0,QUOTIENT($C313-1,$B$7)+1>MAX($K$6,Planning!$E$3)),\"\",IF(OR($C313>$C$7,MOD($C313-1,$B$7)>0),\"\",QUOTIENT($C313-1,$B$7)+1)))","v":""},305,null,null,null,null,null,"-",null,null," : "]
[null,{"$f":"IF($B$7=0,\"\",IF(OR($B$7=0,QUOTIENT($C314-1,$B$7)+1>MAX($K$6,Planning!$E$3)),\"\",IF(OR($C314>$C$7,MOD($C314-1,$B$7)>0),\"\",QUOTIENT($C314-1,$B$7)+1)))","v":""},306,null,null,null,null,null,"-",null,null," : "]
[null,{"$f":"IF($B$7=0,\"\",IF(OR($B$7=0,QUOTIENT($C315-1,$B$7)+1>MAX($K$6,Planning!$E$3)),\"\",IF(OR($C315>$C$7,MOD($C315-1,$B$7)>0),\"\",QUOTIENT($C315-1,$B$7)+1)))","v":""},307,null,null,null,null,null,"-",null,null," : "]
[null,{"$f":"IF($B$7=0,\"\",IF(OR($B$7=0,QUOTIENT($C316-1,$B$7)+1>MAX($K$6,Planning!$E$3)),\"\",IF(OR($C316>$C$7,MOD($C316-1,$B$7)>0),\"\",QUOTIENT($C316-1,$B$7)+1)))","v":""},308,null,null,null,null,null,"-",null,null," : "]
[null,{"$f":"IF($B$7=0,\"\",IF(OR($B$7=0,QUOTIENT($C317-1,$B$7)+1>MAX($K$6,Planning!$E$3)),\"\",IF(OR($C317>$C$7,MOD($C317-1,$B$7)>0),\"\",QUOTIENT($C317-1,$B$7)+1)))","v":""},309,null,null,null,null,null,"-",null,null," : "]
[null,{"$f":"IF($B$7=0,\"\",IF(OR($B$7=0,QUOTIENT($C318-1,$B$7)+1>MAX($K$6,Planning!$E$3)),\"\",IF(OR($C318>$C$7,MOD($C318-1,$B$7)>0),\"\",QUOTIENT($C318-1,$B$7)+1)))","v":""},310,null,null,null,null,null,"-",null,null," : "]
[null,{"$f":"IF($B$7=0,\"\",IF(OR($B$7=0,QUOTIENT($C319-1,$B$7)+1>MAX($K$6,Planning!$E$3)),\"\",IF(OR($C319>$C$7,MOD($C319-1,$B$7)>0),\"\",QUOTIENT($C319-1,$B$7)+1)))","v":""},311,null,null,null,null,null,"-",null,null," : "]
[null,{"$f":"IF($B$7=0,\"\",IF(OR($B$7=0,QUOTIENT($C320-1,$B$7)+1>MAX($K$6,Planning!$E$3)),\"\",IF(OR($C320>$C$7,MOD($C320-1,$B$7)>0),\"\",QUOTIENT($C320-1,$B$7)+1)))","v":""},312,null,null,null,null,null,"-",null,null," : "]
[null,{"$f":"IF($B$7=0,\"\",IF(OR($B$7=0,QUOTIENT($C321-1,$B$7)+1>MAX($K$6,Planning!$E$3)),\"\",IF(OR($C321>$C$7,MOD($C321-1,$B$7)>0),\"\",QUOTIENT($C321-1,$B$7)+1)))","v":""},313,null,null,null,null,null,"-",null,null," : "]
[null,{"$f":"IF($B$7=0,\"\",IF(OR($B$7=0,QUOTIENT($C322-1,$B$7)+1>MAX($K$6,Planning!$E$3)),\"\",IF(OR($C322>$C$7,MOD($C322-1,$B$7)>0),\"\",QUOTIENT($C322-1,$B$7)+1)))","v":""},314,null,null,null,null,null,"-",null,null," : "]
[null,{"$f":"IF($B$7=0,\"\",IF(OR($B$7=0,QUOTIENT($C323-1,$B$7)+1>MAX($K$6,Planning!$E$3)),\"\",IF(OR($C323>$C$7,MOD($C323-1,$B$7)>0),\"\",QUOTIENT($C323-1,$B$7)+1)))","v":""},315,null,null,null,null,null,"-",null,null," : "]
[null,{"$f":"IF($B$7=0,\"\",IF(OR($B$7=0,QUOTIENT($C324-1,$B$7)+1>MAX($K$6,Planning!$E$3)),\"\",IF(OR($C324>$C$7,MOD($C324-1,$B$7)>0),\"\",QUOTIENT($C324-1,$B$7)+1)))","v":""},316,null,null,null,null,null,"-",null,null," : "]
[null,{"$f":"IF($B$7=0,\"\",IF(OR($B$7=0,QUOTIENT($C325-1,$B$7)+1>MAX($K$6,Planning!$E$3)),\"\",IF(OR($C325>$C$7,MOD($C325-1,$B$7)>0),\"\",QUOTIENT($C325-1,$B$7)+1)))","v":""},317,null,null,null,null,null,"-",null,null," : "]
[null,{"$f":"IF($B$7=0,\"\",IF(OR($B$7=0,QUOTIENT($C326-1,$B$7)+1>MAX($K$6,Planning!$E$3)),\"\",IF(OR($C326>$C$7,MOD($C326-1,$B$7)>0),\"\",QUOTIENT($C326-1,$B$7)+1)))","v":""},318,null,null,null,null,null,"-",null,null," : "]
[null,{"$f":"IF($B$7=0,\"\",IF(OR($B$7=0,QUOTIENT($C327-1,$B$7)+1>MAX($K$6,Planning!$E$3)),\"\",IF(OR($C327>$C$7,MOD($C327-1,$B$7)>0),\"\",QUOTIENT($C327-1,$B$7)+1)))","v":""},319,null,null,null,null,null,"-",null,null," : "]
[null,{"$f":"IF($B$7=0,\"\",IF(OR($B$7=0,QUOTIENT($C328-1,$B$7)+1>MAX($K$6,Planning!$E$3)),\"\",IF(OR($C328>$C$7,MOD($C328-1,$B$7)>0),\"\",QUOTIENT($C328-1,$B$7)+1)))","v":""},320,null,null,null,null,null,"-",null,null," : "]
[null,{"$f":"IF($B$7=0,\"\",IF(OR($B$7=0,QUOTIENT($C329-1,$B$7)+1>MAX($K$6,Planning!$E$3)),\"\",IF(OR($C329>$C$7,MOD($C329-1,$B$7)>0),\"\",QUOTIENT($C329-1,$B$7)+1)))","v":""},321,null,null,null,null,null,"-",null,null," : "]
[null,{"$f":"IF($B$7=0,\"\",IF(OR($B$7=0,QUOTIENT($C330-1,$B$7)+1>MAX($K$6,Planning!$E$3)),\"\",IF(OR($C330>$C$7,MOD($C330-1,$B$7)>0),\"\",QUOTIENT($C330-1,$B$7)+1)))","v":""},322,null,null,null,null,null,"-",null,null," : "]
[null,{"$f":"IF($B$7=0,\"\",IF(OR($B$7=0,QUOTIENT($C331-1,$B$7)+1>MAX($K$6,Planning!$E$3)),\"\",IF(OR($C331>$C$7,MOD($C331-1,$B$7)>0),\"\",QUOTIENT($C331-1,$B$7)+1)))","v":""},323,null,null,null,null,null,"-",null,null," : "]
[null,{"$f":"IF($B$7=0,\"\",IF(OR($B$7=0,QUOTIENT($C332-1,$B$7)+1>MAX($K$6,Planning!$E$3)),\"\",IF(OR($C332>$C$7,MOD($C332-1,$B$7)>0),\"\",QUOTIENT($C332-1,$B$7)+1)))","v":""},324,null,null,null,null,null,"-",null,null," : "]
[null,{"$f":"IF($B$7=0,\"\",IF(OR($B$7=0,QUOTIENT($C333-1,$B$7)+1>MAX($K$6,Planning!$E$3)),\"\",IF(OR($C333>$C$7,MOD($C333-1,$B$7)>0),\"\",QUOTIENT($C333-1,$B$7)+1)))","v":""},325,null,null,null,null,null,"-",null,null," : "]
[null,{"$f":"IF($B$7=0,\"\",IF(OR($B$7=0,QUOTIENT($C334-1,$B$7)+1>MAX($K$6,Planning!$E$3)),\"\",IF(OR($C334>$C$7,MOD($C334-1,$B$7)>0),\"\",QUOTIENT($C334-1,$B$7)+1)))","v":""},326,null,null,null,null,null,"-",null,null," : "]
[null,{"$f":"IF($B$7=0,\"\",IF(OR($B$7=0,QUOTIENT($C335-1,$B$7)+1>MAX($K$6,Planning!$E$3)),\"\",IF(OR($C335>$C$7,MOD($C335-1,$B$7)>0),\"\",QUOTIENT($C335-1,$B$7)+1)))","v":""},327,null,null,null,null,null,"-",null,null," : "]
[null,{"$f":"IF($B$7=0,\"\",IF(OR($B$7=0,QUOTIENT($C336-1,$B$7)+1>MAX($K$6,Planning!$E$3)),\"\",IF(OR($C336>$C$7,MOD($C336-1,$B$7)>0),\"\",QUOTIENT($C336-1,$B$7)+1)))","v":""},328,null,null,null,null,null,"-",null,null," : "]
[null,{"$f":"IF($B$7=0,\"\",IF(OR($B$7=0,QUOTIENT($C337-1,$B$7)+1>MAX($K$6,Planning!$E$3)),\"\",IF(OR($C337>$C$7,MOD($C337-1,$B$7)>0),\"\",QUOTIENT($C337-1,$B$7)+1)))","v":""},329,null,null,null,null,null,"-",null,null," : "]
[null,{"$f":"IF($B$7=0,\"\",IF(OR($B$7=0,QUOTIENT($C338-1,$B$7)+1>MAX($K$6,Planning!$E$3)),\"\",IF(OR($C338>$C$7,MOD($C338-1,$B$7)>0),\"\",QUOTIENT($C338-1,$B$7)+1)))","v":""},330,null,null,null,null,null,"-",null,null," : "]
[null,{"$f":"IF($B$7=0,\"\",IF(OR($B$7=0,QUOTIENT($C339-1,$B$7)+1>MAX($K$6,Planning!$E$3)),\"\",IF(OR($C339>$C$7,MOD($C339-1,$B$7)>0),\"\",QUOTIENT($C339-1,$B$7)+1)))","v":""},331,null,null,null,null,null,"-",null,null," : "]
[null,{"$f":"IF($B$7=0,\"\",IF(OR($B$7=0,QUOTIENT($C340-1,$B$7)+1>MAX($K$6,Planning!$E$3)),\"\",IF(OR($C340>$C$7,MOD($C340-1,$B$7)>0),\"\",QUOTIENT($C340-1,$B$7)+1)))","v":""},332,null,null,null,null,null,"-",null,null," : "]
[null,{"$f":"IF($B$7=0,\"\",IF(OR($B$7=0,QUOTIENT($C341-1,$B$7)+1>MAX($K$6,Planning!$E$3)),\"\",IF(OR($C341>$C$7,MOD($C341-1,$B$7)>0),\"\",QUOTIENT($C341-1,$B$7)+1)))","v":""},333,null,null,null,null,null,"-",null,null," : "]
[null,{"$f":"IF($B$7=0,\"\",IF(OR($B$7=0,QUOTIENT($C342-1,$B$7)+1>MAX($K$6,Planning!$E$3)),\"\",IF(OR($C342>$C$7,MOD($C342-1,$B$7)>0),\"\",QUOTIENT($C342-1,$B$7)+1)))","v":""},334,null,null,null,null,null,"-",null,null," : "]
[null,{"$f":"IF($B$7=0,\"\",IF(OR($B$7=0,QUOTIENT($C343-1,$B$7)+1>MAX($K$6,Planning!$E$3)),\"\",IF(OR($C343>$C$7,MOD($C343-1,$B$7)>0),\"\",QUOTIENT($C343-1,$B$7)+1)))","v":""},335,null,null,null,null,null,"-",null,null," : "]
[null,{"$f":"IF($B$7=0,\"\",IF(OR($B$7=0,QUOTIENT($C344-1,$B$7)+1>MAX($K$6,Planning!$E$3)),\"\",IF(OR($C344>$C$7,MOD($C344-1,$B$7)>0),\"\",QUOTIENT($C344-1,$B$7)+1)))","v":""},336,null,null,null,null,null,"-",null,null," : "]
[null,{"$f":"IF($B$7=0,\"\",IF(OR($B$7=0,QUOTIENT($C345-1,$B$7)+1>MAX($K$6,Planning!$E$3)),\"\",IF(OR($C345>$C$7,MOD($C345-1,$B$7)>0),\"\",QUOTIENT($C345-1,$B$7)+1)))","v":""},337,null,null,null,null,null,"-",null,null," : "]
[null,{"$f":"IF($B$7=0,\"\",IF(OR($B$7=0,QUOTIENT($C346-1,$B$7)+1>MAX($K$6,Planning!$E$3)),\"\",IF(OR($C346>$C$7,MOD($C346-1,$B$7)>0),\"\",QUOTIENT($C346-1,$B$7)+1)))","v":""},338,null,null,null,null,null,"-",null,null," : "]
[null,{"$f":"IF($B$7=0,\"\",IF(OR($B$7=0,QUOTIENT($C347-1,$B$7)+1>MAX($K$6,Planning!$E$3)),\"\",IF(OR($C347>$C$7,MOD($C347-1,$B$7)>0),\"\",QUOTIENT($C347-1,$B$7)+1)))","v":""},339,null,null,null,null,null,"-",null,null," : "]
[null,{"$f":"IF($B$7=0,\"\",IF(OR($B$7=0,QUOTIENT($C348-1,$B$7)+1>MAX($K$6,Planning!$E$3)),\"\",IF(OR($C348>$C$7,MOD($C348-1,$B$7)>0),\"\",QUOTIENT($C348-1,$B$7)+1)))","v":""},340,null,null,null,null,null,"-",null,null," : "]
[null,{"$f":"IF($B$7=0,\"\",IF(OR($B$7=0,QUOTIENT($C349-1,$B$7)+1>MAX($K$6,Planning!$E$3)),\"\",IF(OR($C349>$C$7,MOD($C349-1,$B$7)>0),\"\",QUOTIENT($C349-1,$B$7)+1)))","v":""},341,null,null,null,null,null,"-",null,null," : "]
[null,{"$f":"IF($B$7=0,\"\",IF(OR($B$7=0,QUOTIENT($C350-1,$B$7)+1>MAX($K$6,Planning!$E$3)),\"\",IF(OR($C350>$C$7,MOD($C350-1,$B$7)>0),\"\",QUOTIENT($C350-1,$B$7)+1)))","v":""},342,null,null,null,null,null,"-",null,null," : "]
[null,{"$f":"IF($B$7=0,\"\",IF(OR($B$7=0,QUOTIENT($C351-1,$B$7)+1>MAX($K$6,Planning!$E$3)),\"\",IF(OR($C351>$C$7,MOD($C351-1,$B$7)>0),\"\",QUOTIENT($C351-1,$B$7)+1)))","v":""},343,null,null,null,null,null,"-",null,null," : "]
[null,{"$f":"IF($B$7=0,\"\",IF(OR($B$7=0,QUOTIENT($C352-1,$B$7)+1>MAX($K$6,Planning!$E$3)),\"\",IF(OR($C352>$C$7,MOD($C352-1,$B$7)>0),\"\",QUOTIENT($C352-1,$B$7)+1)))","v":""},344,null,null,null,null,null,"-",null,null," : "]
[null,{"$f":"IF($B$7=0,\"\",IF(OR($B$7=0,QUOTIENT($C353-1,$B$7)+1>MAX($K$6,Planning!$E$3)),\"\",IF(OR($C353>$C$7,MOD($C353-1,$B$7)>0),\"\",QUOTIENT($C353-1,$B$7)+1)))","v":""},345,null,null,null,null,null,"-",null,null," : "]
[null,{"$f":"IF($B$7=0,\"\",IF(OR($B$7=0,QUOTIENT($C354-1,$B$7)+1>MAX($K$6,Planning!$E$3)),\"\",IF(OR($C354>$C$7,MOD($C354-1,$B$7)>0),\"\",QUOTIENT($C354-1,$B$7)+1)))","v":""},346,null,null,null,null,null,"-",null,null," : "]
[null,{"$f":"IF($B$7=0,\"\",IF(OR($B$7=0,QUOTIENT($C355-1,$B$7)+1>MAX($K$6,Planning!$E$3)),\"\",IF(OR($C355>$C$7,MOD($C355-1,$B$7)>0),\"\",QUOTIENT($C355-1,$B$7)+1)))","v":""},347,null,null,null,null,null,"-",null,null," : "]
[null,{"$f":"IF($B$7=0,\"\",IF(OR($B$7=0,QUOTIENT($C356-1,$B$7)+1>MAX($K$6,Planning!$E$3)),\"\",IF(OR($C356>$C$7,MOD($C356-1,$B$7)>0),\"\",QUOTIENT($C356-1,$B$7)+1)))","v":""},348,null,null,null,null,null,"-",null,null," : "]
[null,{"$f":"IF($B$7=0,\"\",IF(OR($B$7=0,QUOTIENT($C357-1,$B$7)+1>MAX($K$6,Planning!$E$3)),\"\",IF(OR($C357>$C$7,MOD($C357-1,$B$7)>0),\"\",QUOTIENT($C357-1,$B$7)+1)))","v":""},349,null,null,null,null,null,"-",null,null," : "]
[null,{"$f":"IF($B$7=0,\"\",IF(OR($B$7=0,QUOTIENT($C358-1,$B$7)+1>MAX($K$6,Planning!$E$3)),\"\",IF(OR($C358>$C$7,MOD($C358-1,$B$7)>0),\"\",QUOTIENT($C358-1,$B$7)+1)))","v":""},350,null,null,null,null,null,"-",null,null," : "]
[null,{"$f":"IF($B$7=0,\"\",IF(OR($B$7=0,QUOTIENT($C359-1,$B$7)+1>MAX($K$6,Planning!$E$3)),\"\",IF(OR($C359>$C$7,MOD($C359-1,$B$7)>0),\"\",QUOTIENT($C359-1,$B$7)+1)))","v":""},351,null,null,null,null,null,"-",null,null," : "]
[null,{"$f":"IF($B$7=0,\"\",IF(OR($B$7=0,QUOTIENT($C360-1,$B$7)+1>MAX($K$6,Planning!$E$3)),\"\",IF(OR($C360>$C$7,MOD($C360-1,$B$7)>0),\"\",QUOTIENT($C360-1,$B$7)+1)))","v":""},352,null,null,null,null,null,"-",null,null," : "]
[null,{"$f":"IF($B$7=0,\"\",IF(OR($B$7=0,QUOTIENT($C361-1,$B$7)+1>MAX($K$6,Planning!$E$3)),\"\",IF(OR($C361>$C$7,MOD($C361-1,$B$7)>0),\"\",QUOTIENT($C361-1,$B$7)+1)))","v":""},353,null,null,null,null,null,"-",null,null," : "]
[null,{"$f":"IF($B$7=0,\"\",IF(OR($B$7=0,QUOTIENT($C362-1,$B$7)+1>MAX($K$6,Planning!$E$3)),\"\",IF(OR($C362>$C$7,MOD($C362-1,$B$7)>0),\"\",QUOTIENT($C362-1,$B$7)+1)))","v":""},354,null,null,null,null,null,"-",null,null," : "]
[null,{"$f":"IF($B$7=0,\"\",IF(OR($B$7=0,QUOTIENT($C363-1,$B$7)+1>MAX($K$6,Planning!$E$3)),\"\",IF(OR($C363>$C$7,MOD($C363-1,$B$7)>0),\"\",QUOTIENT($C363-1,$B$7)+1)))","v":""},355,null,null,null,null,null,"-",null,null," : "]
[null,{"$f":"IF($B$7=0,\"\",IF(OR($B$7=0,QUOTIENT($C364-1,$B$7)+1>MAX($K$6,Planning!$E$3)),\"\",IF(OR($C364>$C$7,MOD($C364-1,$B$7)>0),\"\",QUOTIENT($C364-1,$B$7)+1)))","v":""},356,null,null,null,null,null,"-",null,null," : "]
[null,{"$f":"IF($B$7=0,\"\",IF(OR($B$7=0,QUOTIENT($C365-1,$B$7)+1>MAX($K$6,Planning!$E$3)),\"\",IF(OR($C365>$C$7,MOD($C365-1,$B$7)>0),\"\",QUOTIENT($C365-1,$B$7)+1)))","v":""},357,null,null,null,null,null,"-",null,null," : "]
[null,{"$f":"IF($B$7=0,\"\",IF(OR($B$7=0,QUOTIENT($C366-1,$B$7)+1>MAX($K$6,Planning!$E$3)),\"\",IF(OR($C366>$C$7,MOD($C366-1,$B$7)>0),\"\",QUOTIENT($C366-1,$B$7)+1)))","v":""},358,null,null,null,null,null,"-",null,null," : "]
[null,{"$f":"IF($B$7=0,\"\",IF(OR($B$7=0,QUOTIENT($C367-1,$B$7)+1>MAX($K$6,Planning!$E$3)),\"\",IF(OR($C367>$C$7,MOD($C367-1,$B$7)>0),\"\",QUOTIENT($C367-1,$B$7)+1)))","v":""},359,null,null,null,null,null,"-",null,null," : "]
[null,{"$f":"IF($B$7=0,\"\",IF(OR($B$7=0,QUOTIENT($C368-1,$B$7)+1>MAX($K$6,Planning!$E$3)),\"\",IF(OR($C368>$C$7,MOD($C368-1,$B$7)>0),\"\",QUOTIENT($C368-1,$B$7)+1)))","v":""},360,null,null,null,null,null,"-",null,null," : "]
[null,{"$f":"IF($B$7=0,\"\",IF(OR($B$7=0,QUOTIENT($C369-1,$B$7)+1>MAX($K$6,Planning!$E$3)),\"\",IF(OR($C369>$C$7,MOD($C369-1,$B$7)>0),\"\",QUOTIENT($C369-1,$B$7)+1)))","v":""},361,null,null,null,null,null,"-",null,null," : "]
[null,{"$f":"IF($B$7=0,\"\",IF(OR($B$7=0,QUOTIENT($C370-1,$B$7)+1>MAX($K$6,Planning!$E$3)),\"\",IF(OR($C370>$C$7,MOD($C370-1,$B$7)>0),\"\",QUOTIENT($C370-1,$B$7)+1)))","v":""},362,null,null,null,null,null,"-",null,null," : "]
[null,{"$f":"IF($B$7=0,\"\",IF(OR($B$7=0,QUOTIENT($C371-1,$B$7)+1>MAX($K$6,Planning!$E$3)),\"\",IF(OR($C371>$C$7,MOD($C371-1,$B$7)>0),\"\",QUOTIENT($C371-1,$B$7)+1)))","v":""},363,null,null,null,null,null,"-",null,null," : "]
[null,{"$f":"IF($B$7=0,\"\",IF(OR($B$7=0,QUOTIENT($C372-1,$B$7)+1>MAX($K$6,Planning!$E$3)),\"\",IF(OR($C372>$C$7,MOD($C372-1,$B$7)>0),\"\",QUOTIENT($C372-1,$B$7)+1)))","v":""},364,null,null,null,null,null,"-",null,null," : "]
[null,{"$f":"IF($B$7=0,\"\",IF(OR($B$7=0,QUOTIENT($C373-1,$B$7)+1>MAX($K$6,Planning!$E$3)),\"\",IF(OR($C373>$C$7,MOD($C373-1,$B$7)>0),\"\",QUOTIENT($C373-1,$B$7)+1)))","v":""},365,null,null,null,null,null,"-",null,null," : "]
[null,{"$f":"IF($B$7=0,\"\",IF(OR($B$7=0,QUOTIENT($C374-1,$B$7)+1>MAX($K$6,Planning!$E$3)),\"\",IF(OR($C374>$C$7,MOD($C374-1,$B$7)>0),\"\",QUOTIENT($C374-1,$B$7)+1)))","v":""},366,null,null,null,null,null,"-",null,null," : "]
[null,{"$f":"IF($B$7=0,\"\",IF(OR($B$7=0,QUOTIENT($C375-1,$B$7)+1>MAX($K$6,Planning!$E$3)),\"\",IF(OR($C375>$C$7,MOD($C375-1,$B$7)>0),\"\",QUOTIENT($C375-1,$B$7)+1)))","v":""},367,null,null,null,null,null,"-",null,null," : "]
[null,{"$f":"IF($B$7=0,\"\",IF(OR($B$7=0,QUOTIENT($C376-1,$B$7)+1>MAX($K$6,Planning!$E$3)),\"\",IF(OR($C376>$C$7,MOD($C376-1,$B$7)>0),\"\",QUOTIENT($C376-1,$B$7)+1)))","v":""},368,null,null,null,null,null,"-",null,null," : "]
[null,{"$f":"IF($B$7=0,\"\",IF(OR($B$7=0,QUOTIENT($C377-1,$B$7)+1>MAX($K$6,Planning!$E$3)),\"\",IF(OR($C377>$C$7,MOD($C377-1,$B$7)>0),\"\",QUOTIENT($C377-1,$B$7)+1)))","v":""},369,null,null,null,null,null,"-",null,null," : "]
[null,{"$f":"IF($B$7=0,\"\",IF(OR($B$7=0,QUOTIENT($C378-1,$B$7)+1>MAX($K$6,Planning!$E$3)),\"\",IF(OR($C378>$C$7,MOD($C378-1,$B$7)>0),\"\",QUOTIENT($C378-1,$B$7)+1)))","v":""},370,null,null,null,null,null,"-",null,null," : "]
[null,{"$f":"IF($B$7=0,\"\",IF(OR($B$7=0,QUOTIENT($C379-1,$B$7)+1>MAX($K$6,Planning!$E$3)),\"\",IF(OR($C379>$C$7,MOD($C379-1,$B$7)>0),\"\",QUOTIENT($C379-1,$B$7)+1)))","v":""},371,null,null,null,null,null,"-",null,null," : "]
[null,{"$f":"IF($B$7=0,\"\",IF(OR($B$7=0,QUOTIENT($C380-1,$B$7)+1>MAX($K$6,Planning!$E$3)),\"\",IF(OR($C380>$C$7,MOD($C380-1,$B$7)>0),\"\",QUOTIENT($C380-1,$B$7)+1)))","v":""},372,null,null,null,null,null,"-",null,null," : "]
[null,{"$f":"IF($B$7=0,\"\",IF(OR($B$7=0,QUOTIENT($C381-1,$B$7)+1>MAX($K$6,Planning!$E$3)),\"\",IF(OR($C381>$C$7,MOD($C381-1,$B$7)>0),\"\",QUOTIENT($C381-1,$B$7)+1)))","v":""},373,null,null,null,null,null,"-",null,null," : "]
[null,{"$f":"IF($B$7=0,\"\",IF(OR($B$7=0,QUOTIENT($C382-1,$B$7)+1>MAX($K$6,Planning!$E$3)),\"\",IF(OR($C382>$C$7,MOD($C382-1,$B$7)>0),\"\",QUOTIENT($C382-1,$B$7)+1)))","v":""},374,null,null,null,null,null,"-",null,null," : "]
[null,{"$f":"IF($B$7=0,\"\",IF(OR($B$7=0,QUOTIENT($C383-1,$B$7)+1>MAX($K$6,Planning!$E$3)),\"\",IF(OR($C383>$C$7,MOD($C383-1,$B$7)>0),\"\",QUOTIENT($C383-1,$B$7)+1)))","v":""},375,null,null,null,null,null,"-",null,null," : "]
[null,{"$f":"IF($B$7=0,\"\",IF(OR($B$7=0,QUOTIENT($C384-1,$B$7)+1>MAX($K$6,Planning!$E$3)),\"\",IF(OR($C384>$C$7,MOD($C384-1,$B$7)>0),\"\",QUOTIENT($C384-1,$B$7)+1)))","v":""},376,null,null,null,null,null,"-",null,null," : "]
[null,{"$f":"IF($B$7=0,\"\",IF(OR($B$7=0,QUOTIENT($C385-1,$B$7)+1>MAX($K$6,Planning!$E$3)),\"\",IF(OR($C385>$C$7,MOD($C385-1,$B$7)>0),\"\",QUOTIENT($C385-1,$B$7)+1)))","v":""},377,null,null,null,null,null,"-",null,null," : "]
[null,{"$f":"IF($B$7=0,\"\",IF(OR($B$7=0,QUOTIENT($C386-1,$B$7)+1>MAX($K$6,Planning!$E$3)),\"\",IF(OR($C386>$C$7,MOD($C386-1,$B$7)>0),\"\",QUOTIENT($C386-1,$B$7)+1)))","v":""},378,null,null,null,null,null,"-",null,null," : "]
[null,{"$f":"IF($B$7=0,\"\",IF(OR($B$7=0,QUOTIENT($C387-1,$B$7)+1>MAX($K$6,Planning!$E$3)),\"\",IF(OR($C387>$C$7,MOD($C387-1,$B$7)>0),\"\",QUOTIENT($C387-1,$B$7)+1)))","v":""},379,null,null,null,null,null,"-",null,null," : "]
[null,{"$f":"IF($B$7=0,\"\",IF(OR($B$7=0,QUOTIENT($C388-1,$B$7)+1>MAX($K$6,Planning!$E$3)),\"\",IF(OR($C388>$C$7,MOD($C388-1,$B$7)>0),\"\",QUOTIENT($C388-1,$B$7)+1)))","v":""},380,null,null,null,null,null,"-",null,null," : "]
[null,{"$f":"IF($B$7=0,\"\",IF(OR($B$7=0,QUOTIENT($C389-1,$B$7)+1>MAX($K$6,Planning!$E$3)),\"\",IF(OR($C389>$C$7,MOD($C389-1,$B$7)>0),\"\",QUOTIENT($C389-1,$B$7)+1)))","v":""},381,null,null,null,null,null,"-",null,null," : "]
[null,{"$f":"IF($B$7=0,\"\",IF(OR($B$7=0,QUOTIENT($C390-1,$B$7)+1>MAX($K$6,Planning!$E$3)),\"\",IF(OR($C390>$C$7,MOD($C390-1,$B$7)>0),\"\",QUOTIENT($C390-1,$B$7)+1)))","v":""},382,null,null,null,null,null,"-",null,null," : "]
[null,{"$f":"IF($B$7=0,\"\",IF(OR($B$7=0,QUOTIENT($C391-1,$B$7)+1>MAX($K$6,Planning!$E$3)),\"\",IF(OR($C391>$C$7,MOD($C391-1,$B$7)>0),\"\",QUOTIENT($C391-1,$B$7)+1)))","v":""},383,null,null,null,null,null,"-",null,null," : "]
[null,{"$f":"IF($B$7=0,\"\",IF(OR($B$7=0,QUOTIENT($C392-1,$B$7)+1>MAX($K$6,Planning!$E$3)),\"\",IF(OR($C392>$C$7,MOD($C392-1,$B$7)>0),\"\",QUOTIENT($C392-1,$B$7)+1)))","v":""},384,null,null,null,null,null,"-",null,null," : "]
[null,{"$f":"IF($B$7=0,\"\",IF(OR($B$7=0,QUOTIENT($C393-1,$B$7)+1>MAX($K$6,Planning!$E$3)),\"\",IF(OR($C393>$C$7,MOD($C393-1,$B$7)>0),\"\",QUOTIENT($C393-1,$B$7)+1)))","v":""},385,null,null,null,null,null,"-",null,null," : "]
[null,{"$f":"IF($B$7=0,\"\",IF(OR($B$7=0,QUOTIENT($C394-1,$B$7)+1>MAX($K$6,Planning!$E$3)),\"\",IF(OR($C394>$C$7,MOD($C394-1,$B$7)>0),\"\",QUOTIENT($C394-1,$B$7)+1)))","v":""},386,null,null,null,null,null,"-",null,null," : "]
[null,{"$f":"IF($B$7=0,\"\",IF(OR($B$7=0,QUOTIENT($C395-1,$B$7)+1>MAX($K$6,Planning!$E$3)),\"\",IF(OR($C395>$C$7,MOD($C395-1,$B$7)>0),\"\",QUOTIENT($C395-1,$B$7)+1)))","v":""},387,null,null,null,null,null,"-",null,null," : "]
[null,{"$f":"IF($B$7=0,\"\",IF(OR($B$7=0,QUOTIENT($C396-1,$B$7)+1>MAX($K$6,Planning!$E$3)),\"\",IF(OR($C396>$C$7,MOD($C396-1,$B$7)>0),\"\",QUOTIENT($C396-1,$B$7)+1)))","v":""},388,null,null,null,null,null,"-",null,null," : "]
[null,{"$f":"IF($B$7=0,\"\",IF(OR($B$7=0,QUOTIENT($C397-1,$B$7)+1>MAX($K$6,Planning!$E$3)),\"\",IF(OR($C397>$C$7,MOD($C397-1,$B$7)>0),\"\",QUOTIENT($C397-1,$B$7)+1)))","v":""},389,null,null,null,null,null,"-",null,null," : "]
[null,{"$f":"IF($B$7=0,\"\",IF(OR($B$7=0,QUOTIENT($C398-1,$B$7)+1>MAX($K$6,Planning!$E$3)),\"\",IF(OR($C398>$C$7,MOD($C398-1,$B$7)>0),\"\",QUOTIENT($C398-1,$B$7)+1)))","v":""},390,null,null,null,null,null,"-",null,null," : "]
[null,{"$f":"IF($B$7=0,\"\",IF(OR($B$7=0,QUOTIENT($C399-1,$B$7)+1>MAX($K$6,Planning!$E$3)),\"\",IF(OR($C399>$C$7,MOD($C399-1,$B$7)>0),\"\",QUOTIENT($C399-1,$B$7)+1)))","v":""},391,null,null,null,null,null,"-",null,null," : "]
[null,{"$f":"IF($B$7=0,\"\",IF(OR($B$7=0,QUOTIENT($C400-1,$B$7)+1>MAX($K$6,Planning!$E$3)),\"\",IF(OR($C400>$C$7,MOD($C400-1,$B$7)>0),\"\",QUOTIENT($C400-1,$B$7)+1)))","v":""},392,null,null,null,null,null,"-",null,null," : "]
[null,{"$f":"IF($B$7=0,\"\",IF(OR($B$7=0,QUOTIENT($C401-1,$B$7)+1>MAX($K$6,Planning!$E$3)),\"\",IF(OR($C401>$C$7,MOD($C401-1,$B$7)>0),\"\",QUOTIENT($C401-1,$B$7)+1)))","v":""},393,null,null,null,null,null,"-",null,null," : "]
[null,{"$f":"IF($B$7=0,\"\",IF(OR($B$7=0,QUOTIENT($C402-1,$B$7)+1>MAX($K$6,Planning!$E$3)),\"\",IF(OR($C402>$C$7,MOD($C402-1,$B$7)>0),\"\",QUOTIENT($C402-1,$B$7)+1)))","v":""},394,null,null,null,null,null,"-",null,null," : "]
[null,{"$f":"IF($B$7=0,\"\",IF(OR($B$7=0,QUOTIENT($C403-1,$B$7)+1>MAX($K$6,Planning!$E$3)),\"\",IF(OR($C403>$C$7,MOD($C403-1,$B$7)>0),\"\",QUOTIENT($C403-1,$B$7)+1)))","v":""},395,null,null,null,null,null,"-",null,null," : "]
[null,{"$f":"IF($B$7=0,\"\",IF(OR($B$7=0,QUOTIENT($C404-1,$B$7)+1>MAX($K$6,Planning!$E$3)),\"\",IF(OR($C404>$C$7,MOD($C404-1,$B$7)>0),\"\",QUOTIENT($C404-1,$B$7)+1)))","v":""},396,null,null,null,null,null,"-",null,null," : "]
[null,{"$f":"IF($B$7=0,\"\",IF(OR($B$7=0,QUOTIENT($C405-1,$B$7)+1>MAX($K$6,Planning!$E$3)),\"\",IF(OR($C405>$C$7,MOD($C405-1,$B$7)>0),\"\",QUOTIENT($C405-1,$B$7)+1)))","v":""},397,null,null,null,null,null,"-",null,null," : "]
[null,{"$f":"IF($B$7=0,\"\",IF(OR($B$7=0,QUOTIENT($C406-1,$B$7)+1>MAX($K$6,Planning!$E$3)),\"\",IF(OR($C406>$C$7,MOD($C406-1,$B$7)>0),\"\",QUOTIENT($C406-1,$B$7)+1)))","v":""},398,null,null,null,null,null,"-",null,null," : "]
[null,{"$f":"IF($B$7=0,\"\",IF(OR($B$7=0,QUOTIENT($C407-1,$B$7)+1>MAX($K$6,Planning!$E$3)),\"\",IF(OR($C407>$C$7,MOD($C407-1,$B$7)>0),\"\",QUOTIENT($C407-1,$B$7)+1)))","v":""},399,null,null,null,null,null,"-",null,null," : "]
[null,{"$f":"IF($B$7=0,\"\",IF(OR($B$7=0,QUOTIENT($C408-1,$B$7)+1>MAX($K$6,Planning!$E$3)),\"\",IF(OR($C408>$C$7,MOD($C408-1,$B$7)>0),\"\",QUOTIENT($C408-1,$B$7)+1)))","v":""},400,null,null,null,null,null,"-",null,null," : "]
[null,{"$f":"IF($B$7=0,\"\",IF(OR($B$7=0,QUOTIENT($C409-1,$B$7)+1>MAX($K$6,Planning!$E$3)),\"\",IF(OR($C409>$C$7,MOD($C409-1,$B$7)>0),\"\",QUOTIENT($C409-1,$B$7)+1)))","v":""},401,null,null,null,null,null,"-",null,null," : "]
[null,{"$f":"IF($B$7=0,\"\",IF(OR($B$7=0,QUOTIENT($C410-1,$B$7)+1>MAX($K$6,Planning!$E$3)),\"\",IF(OR($C410>$C$7,MOD($C410-1,$B$7)>0),\"\",QUOTIENT($C410-1,$B$7)+1)))","v":""},402,null,null,null,null,null,"-",null,null," : "]
[null,{"$f":"IF($B$7=0,\"\",IF(OR($B$7=0,QUOTIENT($C411-1,$B$7)+1>MAX($K$6,Planning!$E$3)),\"\",IF(OR($C411>$C$7,MOD($C411-1,$B$7)>0),\"\",QUOTIENT($C411-1,$B$7)+1)))","v":""},403,null,null,null,null,null,"-",null,null," : "]
[null,{"$f":"IF($B$7=0,\"\",IF(OR($B$7=0,QUOTIENT($C412-1,$B$7)+1>MAX($K$6,Planning!$E$3)),\"\",IF(OR($C412>$C$7,MOD($C412-1,$B$7)>0),\"\",QUOTIENT($C412-1,$B$7)+1)))","v":""},404,null,null,null,null,null,"-",null,null," : "]
[null,{"$f":"IF($B$7=0,\"\",IF(OR($B$7=0,QUOTIENT($C413-1,$B$7)+1>MAX($K$6,Planning!$E$3)),\"\",IF(OR($C413>$C$7,MOD($C413-1,$B$7)>0),\"\",QUOTIENT($C413-1,$B$7)+1)))","v":""},405,null,null,null,null,null,"-",null,null," : "]
[null,{"$f":"IF($B$7=0,\"\",IF(OR($B$7=0,QUOTIENT($C414-1,$B$7)+1>MAX($K$6,Planning!$E$3)),\"\",IF(OR($C414>$C$7,MOD($C414-1,$B$7)>0),\"\",QUOTIENT($C414-1,$B$7)+1)))","v":""},406,null,null,null,null,null,"-",null,null," : "]
[null,{"$f":"IF($B$7=0,\"\",IF(OR($B$7=0,QUOTIENT($C415-1,$B$7)+1>MAX($K$6,Planning!$E$3)),\"\",IF(OR($C415>$C$7,MOD($C415-1,$B$7)>0),\"\",QUOTIENT($C415-1,$B$7)+1)))","v":""},407,null,null,null,null,null,"-",null,null," : "]
[null,{"$f":"IF($B$7=0,\"\",IF(OR($B$7=0,QUOTIENT($C416-1,$B$7)+1>MAX($K$6,Planning!$E$3)),\"\",IF(OR($C416>$C$7,MOD($C416-1,$B$7)>0),\"\",QUOTIENT($C416-1,$B$7)+1)))","v":""},408,null,null,null,null,null,"-",null,null," : "]
[null,{"$f":"IF($B$7=0,\"\",IF(OR($B$7=0,QUOTIENT($C417-1,$B$7)+1>MAX($K$6,Planning!$E$3)),\"\",IF(OR($C417>$C$7,MOD($C417-1,$B$7)>0),\"\",QUOTIENT($C417-1,$B$7)+1)))","v":""},409,null,null,null,null,null,"-",null,null," : "]
[null,{"$f":"IF($B$7=0,\"\",IF(OR($B$7=0,QUOTIENT($C418-1,$B$7)+1>MAX($K$6,Planning!$E$3)),\"\",IF(OR($C418>$C$7,MOD($C418-1,$B$7)>0),\"\",QUOTIENT($C418-1,$B$7)+1)))","v":""},410,null,null,null,null,null,"-",null,null," : "]
[null,{"$f":"IF($B$7=0,\"\",IF(OR($B$7=0,QUOTIENT($C419-1,$B$7)+1>MAX($K$6,Planning!$E$3)),\"\",IF(OR($C419>$C$7,MOD($C419-1,$B$7)>0),\"\",QUOTIENT($C419-1,$B$7)+1)))","v":""},411,null,null,null,null,null,"-",null,null," : "]
[null,{"$f":"IF($B$7=0,\"\",IF(OR($B$7=0,QUOTIENT($C420-1,$B$7)+1>MAX($K$6,Planning!$E$3)),\"\",IF(OR($C420>$C$7,MOD($C420-1,$B$7)>0),\"\",QUOTIENT($C420-1,$B$7)+1)))","v":""},412,null,null,null,null,null,"-",null,null," : "]
[null,{"$f":"IF($B$7=0,\"\",IF(OR($B$7=0,QUOTIENT($C421-1,$B$7)+1>MAX($K$6,Planning!$E$3)),\"\",IF(OR($C421>$C$7,MOD($C421-1,$B$7)>0),\"\",QUOTIENT($C421-1,$B$7)+1)))","v":""},413,null,null,null,null,null,"-",null,null," : "]
[null,{"$f":"IF($B$7=0,\"\",IF(OR($B$7=0,QUOTIENT($C422-1,$B$7)+1>MAX($K$6,Planning!$E$3)),\"\",IF(OR($C422>$C$7,MOD($C422-1,$B$7)>0),\"\",QUOTIENT($C422-1,$B$7)+1)))","v":""},414,null,null,null,null,null,"-",null,null," : "]
[null,{"$f":"IF($B$7=0,\"\",IF(OR($B$7=0,QUOTIENT($C423-1,$B$7)+1>MAX($K$6,Planning!$E$3)),\"\",IF(OR($C423>$C$7,MOD($C423-1,$B$7)>0),\"\",QUOTIENT($C423-1,$B$7)+1)))","v":""},415,null,null,null,null,null,"-",null,null," : "]
[null,{"$f":"IF($B$7=0,\"\",IF(OR($B$7=0,QUOTIENT($C424-1,$B$7)+1>MAX($K$6,Planning!$E$3)),\"\",IF(OR($C424>$C$7,MOD($C424-1,$B$7)>0),\"\",QUOTIENT($C424-1,$B$7)+1)))","v":""},416,null,null,null,null,null,"-",null,null," : "]
[null,{"$f":"IF($B$7=0,\"\",IF(OR($B$7=0,QUOTIENT($C425-1,$B$7)+1>MAX($K$6,Planning!$E$3)),\"\",IF(OR($C425>$C$7,MOD($C425-1,$B$7)>0),\"\",QUOTIENT($C425-1,$B$7)+1)))","v":""},417,null,null,null,null,null,"-",null,null," : "]
[null,{"$f":"IF($B$7=0,\"\",IF(OR($B$7=0,QUOTIENT($C426-1,$B$7)+1>MAX($K$6,Planning!$E$3)),\"\",IF(OR($C426>$C$7,MOD($C426-1,$B$7)>0),\"\",QUOTIENT($C426-1,$B$7)+1)))","v":""},418,null,null,null,null,null,"-",null,null," : "]
[null,{"$f":"IF($B$7=0,\"\",IF(OR($B$7=0,QUOTIENT($C427-1,$B$7)+1>MAX($K$6,Planning!$E$3)),\"\",IF(OR($C427>$C$7,MOD($C427-1,$B$7)>0),\"\",QUOTIENT($C427-1,$B$7)+1)))","v":""},419,null,null,null,null,null,"-",null,null," : "]
[null,{"$f":"IF($B$7=0,\"\",IF(OR($B$7=0,QUOTIENT($C428-1,$B$7)+1>MAX($K$6,Planning!$E$3)),\"\",IF(OR($C428>$C$7,MOD($C428-1,$B$7)>0),\"\",QUOTIENT($C428-1,$B$7)+1)))","v":""},420,null,null,null,null,null,"-",null,null," : "]
[null,{"$f":"IF($B$7=0,\"\",IF(OR($B$7=0,QUOTIENT($C429-1,$B$7)+1>MAX($K$6,Planning!$E$3)),\"\",IF(OR($C429>$C$7,MOD($C429-1,$B$7)>0),\"\",QUOTIENT($C429-1,$B$7)+1)))","v":""},421,null,null,null,null,null,"-",null,null," : "]
[null,{"$f":"IF($B$7=0,\"\",IF(OR($B$7=0,QUOTIENT($C430-1,$B$7)+1>MAX($K$6,Planning!$E$3)),\"\",IF(OR($C430>$C$7,MOD($C430-1,$B$7)>0),\"\",QUOTIENT($C430-1,$B$7)+1)))","v":""},422,null,null,null,null,null,"-",null,null," : "]
[null,{"$f":"IF($B$7=0,\"\",IF(OR($B$7=0,QUOTIENT($C431-1,$B$7)+1>MAX($K$6,Planning!$E$3)),\"\",IF(OR($C431>$C$7,MOD($C431-1,$B$7)>0),\"\",QUOTIENT($C431-1,$B$7)+1)))","v":""},423,null,null,null,null,null,"-",null,null," : "]
[null,{"$f":"IF($B$7=0,\"\",IF(OR($B$7=0,QUOTIENT($C432-1,$B$7)+1>MAX($K$6,Planning!$E$3)),\"\",IF(OR($C432>$C$7,MOD($C432-1,$B$7)>0),\"\",QUOTIENT($C432-1,$B$7)+1)))","v":""},424,null,null,null,null,null,"-",null,null," : "]
[null,{"$f":"IF($B$7=0,\"\",IF(OR($B$7=0,QUOTIENT($C433-1,$B$7)+1>MAX($K$6,Planning!$E$3)),\"\",IF(OR($C433>$C$7,MOD($C433-1,$B$7)>0),\"\",QUOTIENT($C433-1,$B$7)+1)))","v":""},425,null,null,null,null,null,"-",null,null," : "]
[null,{"$f":"IF($B$7=0,\"\",IF(OR($B$7=0,QUOTIENT($C434-1,$B$7)+1>MAX($K$6,Planning!$E$3)),\"\",IF(OR($C434>$C$7,MOD($C434-1,$B$7)>0),\"\",QUOTIENT($C434-1,$B$7)+1)))","v":""},426,null,null,null,null,null,"-",null,null," : "]
[null,{"$f":"IF($B$7=0,\"\",IF(OR($B$7=0,QUOTIENT($C435-1,$B$7)+1>MAX($K$6,Planning!$E$3)),\"\",IF(OR($C435>$C$7,MOD($C435-1,$B$7)>0),\"\",QUOTIENT($C435-1,$B$7)+1)))","v":""},427,null,null,null,null,null,"-",null,null," : "]
[null,{"$f":"IF($B$7=0,\"\",IF(OR($B$7=0,QUOTIENT($C436-1,$B$7)+1>MAX($K$6,Planning!$E$3)),\"\",IF(OR($C436>$C$7,MOD($C436-1,$B$7)>0),\"\",QUOTIENT($C436-1,$B$7)+1)))","v":""},428,null,null,null,null,null,"-",null,null," : "]
[null,{"$f":"IF($B$7=0,\"\",IF(OR($B$7=0,QUOTIENT($C437-1,$B$7)+1>MAX($K$6,Planning!$E$3)),\"\",IF(OR($C437>$C$7,MOD($C437-1,$B$7)>0),\"\",QUOTIENT($C437-1,$B$7)+1)))","v":""},429,null,null,null,null,null,"-",null,null," : "]
[null,{"$f":"IF($B$7=0,\"\",IF(OR($B$7=0,QUOTIENT($C438-1,$B$7)+1>MAX($K$6,Planning!$E$3)),\"\",IF(OR($C438>$C$7,MOD($C438-1,$B$7)>0),\"\",QUOTIENT($C438-1,$B$7)+1)))","v":""},430,null,null,null,null,null,"-",null,null," : "]
[null,{"$f":"IF($B$7=0,\"\",IF(OR($B$7=0,QUOTIENT($C439-1,$B$7)+1>MAX($K$6,Planning!$E$3)),\"\",IF(OR($C439>$C$7,MOD($C439-1,$B$7)>0),\"\",QUOTIENT($C439-1,$B$7)+1)))","v":""},431,null,null,null,null,null,"-",null,null," : "]
[null,{"$f":"IF($B$7=0,\"\",IF(OR($B$7=0,QUOTIENT($C440-1,$B$7)+1>MAX($K$6,Planning!$E$3)),\"\",IF(OR($C440>$C$7,MOD($C440-1,$B$7)>0),\"\",QUOTIENT($C440-1,$B$7)+1)))","v":""},432,null,null,null,null,null,"-",null,null," : "]
[null,{"$f":"IF($B$7=0,\"\",IF(OR($B$7=0,QUOTIENT($C441-1,$B$7)+1>MAX($K$6,Planning!$E$3)),\"\",IF(OR($C441>$C$7,MOD($C441-1,$B$7)>0),\"\",QUOTIENT($C441-1,$B$7)+1)))","v":""},433,null,null,null,null,null,"-",null,null," : "]
[null,{"$f":"IF($B$7=0,\"\",IF(OR($B$7=0,QUOTIENT($C442-1,$B$7)+1>MAX($K$6,Planning!$E$3)),\"\",IF(OR($C442>$C$7,MOD($C442-1,$B$7)>0),\"\",QUOTIENT($C442-1,$B$7)+1)))","v":""},434,null,null,null,null,null,"-",null,null," : "]
[null,{"$f":"IF($B$7=0,\"\",IF(OR($B$7=0,QUOTIENT($C443-1,$B$7)+1>MAX($K$6,Planning!$E$3)),\"\",IF(OR($C443>$C$7,MOD($C443-1,$B$7)>0),\"\",QUOTIENT($C443-1,$B$7)+1)))","v":""},435,null,null,null,null,null,"-",null,null," : "]
[null,{"$f":"IF($B$7=0,\"\",IF(OR($B$7=0,QUOTIENT($C444-1,$B$7)+1>MAX($K$6,Planning!$E$3)),\"\",IF(OR($C444>$C$7,MOD($C444-1,$B$7)>0),\"\",QUOTIENT($C444-1,$B$7)+1)))","v":""},436,null,null,null,null,null,"-",null,null," : "]
[null,{"$f":"IF($B$7=0,\"\",IF(OR($B$7=0,QUOTIENT($C445-1,$B$7)+1>MAX($K$6,Planning!$E$3)),\"\",IF(OR($C445>$C$7,MOD($C445-1,$B$7)>0),\"\",QUOTIENT($C445-1,$B$7)+1)))","v":""},437,null,null,null,null,null,"-",null,null," : "]
[null,{"$f":"IF($B$7=0,\"\",IF(OR($B$7=0,QUOTIENT($C446-1,$B$7)+1>MAX($K$6,Planning!$E$3)),\"\",IF(OR($C446>$C$7,MOD($C446-1,$B$7)>0),\"\",QUOTIENT($C446-1,$B$7)+1)))","v":""},438,null,null,null,null,null,"-",null,null," : "]
[null,{"$f":"IF($B$7=0,\"\",IF(OR($B$7=0,QUOTIENT($C447-1,$B$7)+1>MAX($K$6,Planning!$E$3)),\"\",IF(OR($C447>$C$7,MOD($C447-1,$B$7)>0),\"\",QUOTIENT($C447-1,$B$7)+1)))","v":""},439,null,null,null,null,null,"-",null,null," : "]
[null,{"$f":"IF($B$7=0,\"\",IF(OR($B$7=0,QUOTIENT($C448-1,$B$7)+1>MAX($K$6,Planning!$E$3)),\"\",IF(OR($C448>$C$7,MOD($C448-1,$B$7)>0),\"\",QUOTIENT($C448-1,$B$7)+1)))","v":""},440,null,null,null,null,null,"-",null,null," : "]
[null,{"$f":"IF($B$7=0,\"\",IF(OR($B$7=0,QUOTIENT($C449-1,$B$7)+1>MAX($K$6,Planning!$E$3)),\"\",IF(OR($C449>$C$7,MOD($C449-1,$B$7)>0),\"\",QUOTIENT($C449-1,$B$7)+1)))","v":""},441,null,null,null,null,null,"-",null,null," : "]
[null,{"$f":"IF($B$7=0,\"\",IF(OR($B$7=0,QUOTIENT($C450-1,$B$7)+1>MAX($K$6,Planning!$E$3)),\"\",IF(OR($C450>$C$7,MOD($C450-1,$B$7)>0),\"\",QUOTIENT($C450-1,$B$7)+1)))","v":""},442,null,null,null,null,null,"-",null,null," : "]
[null,{"$f":"IF($B$7=0,\"\",IF(OR($B$7=0,QUOTIENT($C451-1,$B$7)+1>MAX($K$6,Planning!$E$3)),\"\",IF(OR($C451>$C$7,MOD($C451-1,$B$7)>0),\"\",QUOTIENT($C451-1,$B$7)+1)))","v":""},443,null,null,null,null,null,"-",null,null," : "]
[null,{"$f":"IF($B$7=0,\"\",IF(OR($B$7=0,QUOTIENT($C452-1,$B$7)+1>MAX($K$6,Planning!$E$3)),\"\",IF(OR($C452>$C$7,MOD($C452-1,$B$7)>0),\"\",QUOTIENT($C452-1,$B$7)+1)))","v":""},444,null,null,null,null,null,"-",null,null," : "]
[null,{"$f":"IF($B$7=0,\"\",IF(OR($B$7=0,QUOTIENT($C453-1,$B$7)+1>MAX($K$6,Planning!$E$3)),\"\",IF(OR($C453>$C$7,MOD($C453-1,$B$7)>0),\"\",QUOTIENT($C453-1,$B$7)+1)))","v":""},445,null,null,null,null,null,"-",null,null," : "]
[null,{"$f":"IF($B$7=0,\"\",IF(OR($B$7=0,QUOTIENT($C454-1,$B$7)+1>MAX($K$6,Planning!$E$3)),\"\",IF(OR($C454>$C$7,MOD($C454-1,$B$7)>0),\"\",QUOTIENT($C454-1,$B$7)+1)))","v":""},446,null,null,null,null,null,"-",null,null," : "]
[null,{"$f":"IF($B$7=0,\"\",IF(OR($B$7=0,QUOTIENT($C455-1,$B$7)+1>MAX($K$6,Planning!$E$3)),\"\",IF(OR($C455>$C$7,MOD($C455-1,$B$7)>0),\"\",QUOTIENT($C455-1,$B$7)+1)))","v":""},447,null,null,null,null,null,"-",null,null," : "]
[null,{"$f":"IF($B$7=0,\"\",IF(OR($B$7=0,QUOTIENT($C456-1,$B$7)+1>MAX($K$6,Planning!$E$3)),\"\",IF(OR($C456>$C$7,MOD($C456-1,$B$7)>0),\"\",QUOTIENT($C456-1,$B$7)+1)))","v":""},448,null,null,null,null,null,"-",null,null," : "]
[null,{"$f":"IF($B$7=0,\"\",IF(OR($B$7=0,QUOTIENT($C457-1,$B$7)+1>MAX($K$6,Planning!$E$3)),\"\",IF(OR($C457>$C$7,MOD($C457-1,$B$7)>0),\"\",QUOTIENT($C457-1,$B$7)+1)))","v":""},449,null,null,null,null,null,"-",null,null," : "]
[null,{"$f":"IF($B$7=0,\"\",IF(OR($B$7=0,QUOTIENT($C458-1,$B$7)+1>MAX($K$6,Planning!$E$3)),\"\",IF(OR($C458>$C$7,MOD($C458-1,$B$7)>0),\"\",QUOTIENT($C458-1,$B$7)+1)))","v":""},450,null,null,null,null,null,"-",null,null," : "]
[null,{"$f":"IF($B$7=0,\"\",IF(OR($B$7=0,QUOTIENT($C459-1,$B$7)+1>MAX($K$6,Planning!$E$3)),\"\",IF(OR($C459>$C$7,MOD($C459-1,$B$7)>0),\"\",QUOTIENT($C459-1,$B$7)+1)))","v":""},451,null,null,null,null,null,"-",null,null," : "]
[null,{"$f":"IF($B$7=0,\"\",IF(OR($B$7=0,QUOTIENT($C460-1,$B$7)+1>MAX($K$6,Planning!$E$3)),\"\",IF(OR($C460>$C$7,MOD($C460-1,$B$7)>0),\"\",QUOTIENT($C460-1,$B$7)+1)))","v":""},452,null,null,null,null,null,"-",null,null," : "]
[null,{"$f":"IF($B$7=0,\"\",IF(OR($B$7=0,QUOTIENT($C461-1,$B$7)+1>MAX($K$6,Planning!$E$3)),\"\",IF(OR($C461>$C$7,MOD($C461-1,$B$7)>0),\"\",QUOTIENT($C461-1,$B$7)+1)))","v":""},453,null,null,null,null,null,"-",null,null," : "]
[null,{"$f":"IF($B$7=0,\"\",IF(OR($B$7=0,QUOTIENT($C462-1,$B$7)+1>MAX($K$6,Planning!$E$3)),\"\",IF(OR($C462>$C$7,MOD($C462-1,$B$7)>0),\"\",QUOTIENT($C462-1,$B$7)+1)))","v":""},454,null,null,null,null,null,"-",null,null," : "]
[null,{"$f":"IF($B$7=0,\"\",IF(OR($B$7=0,QUOTIENT($C463-1,$B$7)+1>MAX($K$6,Planning!$E$3)),\"\",IF(OR($C463>$C$7,MOD($C463-1,$B$7)>0),\"\",QUOTIENT($C463-1,$B$7)+1)))","v":""},455,null,null,null,null,null,"-",null,null," : "]
[null,{"$f":"IF($B$7=0,\"\",IF(OR($B$7=0,QUOTIENT($C464-1,$B$7)+1>MAX($K$6,Planning!$E$3)),\"\",IF(OR($C464>$C$7,MOD($C464-1,$B$7)>0),\"\",QUOTIENT($C464-1,$B$7)+1)))","v":""},456,null,null,null,null,null,"-",null,null," : "]
[null,{"$f":"IF($B$7=0,\"\",IF(OR($B$7=0,QUOTIENT($C465-1,$B$7)+1>MAX($K$6,Planning!$E$3)),\"\",IF(OR($C465>$C$7,MOD($C465-1,$B$7)>0),\"\",QUOTIENT($C465-1,$B$7)+1)))","v":""},457,null,null,null,null,null,"-",null,null," : "]
[null,{"$f":"IF($B$7=0,\"\",IF(OR($B$7=0,QUOTIENT($C466-1,$B$7)+1>MAX($K$6,Planning!$E$3)),\"\",IF(OR($C466>$C$7,MOD($C466-1,$B$7)>0),\"\",QUOTIENT($C466-1,$B$7)+1)))","v":""},458,null,null,null,null,null,"-",null,null," : "]
[null,{"$f":"IF($B$7=0,\"\",IF(OR($B$7=0,QUOTIENT($C467-1,$B$7)+1>MAX($K$6,Planning!$E$3)),\"\",IF(OR($C467>$C$7,MOD($C467-1,$B$7)>0),\"\",QUOTIENT($C467-1,$B$7)+1)))","v":""},459,null,null,null,null,null,"-",null,null," : "]
[null,{"$f":"IF($B$7=0,\"\",IF(OR($B$7=0,QUOTIENT($C468-1,$B$7)+1>MAX($K$6,Planning!$E$3)),\"\",IF(OR($C468>$C$7,MOD($C468-1,$B$7)>0),\"\",QUOTIENT($C468-1,$B$7)+1)))","v":""},460,null,null,null,null,null,"-",null,null," : "]
[null,{"$f":"IF($B$7=0,\"\",IF(OR($B$7=0,QUOTIENT($C469-1,$B$7)+1>MAX($K$6,Planning!$E$3)),\"\",IF(OR($C469>$C$7,MOD($C469-1,$B$7)>0),\"\",QUOTIENT($C469-1,$B$7)+1)))","v":""},461,null,null,null,null,null,"-",null,null," : "]
[null,{"$f":"IF($B$7=0,\"\",IF(OR($B$7=0,QUOTIENT($C470-1,$B$7)+1>MAX($K$6,Planning!$E$3)),\"\",IF(OR($C470>$C$7,MOD($C470-1,$B$7)>0),\"\",QUOTIENT($C470-1,$B$7)+1)))","v":""},462,null,null,null,null,null,"-",null,null," : "]
[null,{"$f":"IF($B$7=0,\"\",IF(OR($B$7=0,QUOTIENT($C471-1,$B$7)+1>MAX($K$6,Planning!$E$3)),\"\",IF(OR($C471>$C$7,MOD($C471-1,$B$7)>0),\"\",QUOTIENT($C471-1,$B$7)+1)))","v":""},463,null,null,null,null,null,"-",null,null," : "]
[null,{"$f":"IF($B$7=0,\"\",IF(OR($B$7=0,QUOTIENT($C472-1,$B$7)+1>MAX($K$6,Planning!$E$3)),\"\",IF(OR($C472>$C$7,MOD($C472-1,$B$7)>0),\"\",QUOTIENT($C472-1,$B$7)+1)))","v":""},464,null,null,null,null,null,"-",null,null," : "]
[null,{"$f":"IF($B$7=0,\"\",IF(OR($B$7=0,QUOTIENT($C473-1,$B$7)+1>MAX($K$6,Planning!$E$3)),\"\",IF(OR($C473>$C$7,MOD($C473-1,$B$7)>0),\"\",QUOTIENT($C473-1,$B$7)+1)))","v":""},465,null,null,null,null,null,"-",null,null," : "]
[null,{"$f":"IF($B$7=0,\"\",IF(OR($B$7=0,QUOTIENT($C474-1,$B$7)+1>MAX($K$6,Planning!$E$3)),\"\",IF(OR($C474>$C$7,MOD($C474-1,$B$7)>0),\"\",QUOTIENT($C474-1,$B$7)+1)))","v":""},466,null,null,null,null,null,"-",null,null," : "]
[null,{"$f":"IF($B$7=0,\"\",IF(OR($B$7=0,QUOTIENT($C475-1,$B$7)+1>MAX($K$6,Planning!$E$3)),\"\",IF(OR($C475>$C$7,MOD($C475-1,$B$7)>0),\"\",QUOTIENT($C475-1,$B$7)+1)))","v":""},467,null,null,null,null,null,"-",null,null," : "]
[null,{"$f":"IF($B$7=0,\"\",IF(OR($B$7=0,QUOTIENT($C476-1,$B$7)+1>MAX($K$6,Planning!$E$3)),\"\",IF(OR($C476>$C$7,MOD($C476-1,$B$7)>0),\"\",QUOTIENT($C476-1,$B$7)+1)))","v":""},468,null,null,null,null,null,"-",null,null," : "]
[null,{"$f":"IF($B$7=0,\"\",IF(OR($B$7=0,QUOTIENT($C477-1,$B$7)+1>MAX($K$6,Planning!$E$3)),\"\",IF(OR($C477>$C$7,MOD($C477-1,$B$7)>0),\"\",QUOTIENT($C477-1,$B$7)+1)))","v":""},469,null,null,null,null,null,"-",null,null," : "]
[null,{"$f":"IF($B$7=0,\"\",IF(OR($B$7=0,QUOTIENT($C478-1,$B$7)+1>MAX($K$6,Planning!$E$3)),\"\",IF(OR($C478>$C$7,MOD($C478-1,$B$7)>0),\"\",QUOTIENT($C478-1,$B$7)+1)))","v":""},470,null,null,null,null,null,"-",null,null," : "]
[null,{"$f":"IF($B$7=0,\"\",IF(OR($B$7=0,QUOTIENT($C479-1,$B$7)+1>MAX($K$6,Planning!$E$3)),\"\",IF(OR($C479>$C$7,MOD($C479-1,$B$7)>0),\"\",QUOTIENT($C479-1,$B$7)+1)))","v":""},471,null,null,null,null,null,"-",null,null," : "]
[null,{"$f":"IF($B$7=0,\"\",IF(OR($B$7=0,QUOTIENT($C480-1,$B$7)+1>MAX($K$6,Planning!$E$3)),\"\",IF(OR($C480>$C$7,MOD($C480-1,$B$7)>0),\"\",QUOTIENT($C480-1,$B$7)+1)))","v":""},472,null,null,null,null,null,"-",null,null," : "]
[null,{"$f":"IF($B$7=0,\"\",IF(OR($B$7=0,QUOTIENT($C481-1,$B$7)+1>MAX($K$6,Planning!$E$3)),\"\",IF(OR($C481>$C$7,MOD($C481-1,$B$7)>0),\"\",QUOTIENT($C481-1,$B$7)+1)))","v":""},473,null,null,null,null,null,"-",null,null," : "]
[null,{"$f":"IF($B$7=0,\"\",IF(OR($B$7=0,QUOTIENT($C482-1,$B$7)+1>MAX($K$6,Planning!$E$3)),\"\",IF(OR($C482>$C$7,MOD($C482-1,$B$7)>0),\"\",QUOTIENT($C482-1,$B$7)+1)))","v":""},474,null,null,null,null,null,"-",null,null," : "]
[null,{"$f":"IF($B$7=0,\"\",IF(OR($B$7=0,QUOTIENT($C483-1,$B$7)+1>MAX($K$6,Planning!$E$3)),\"\",IF(OR($C483>$C$7,MOD($C483-1,$B$7)>0),\"\",QUOTIENT($C483-1,$B$7)+1)))","v":""},475,null,null,null,null,null,"-",null,null," : "]
[null,{"$f":"IF($B$7=0,\"\",IF(OR($B$7=0,QUOTIENT($C484-1,$B$7)+1>MAX($K$6,Planning!$E$3)),\"\",IF(OR($C484>$C$7,MOD($C484-1,$B$7)>0),\"\",QUOTIENT($C484-1,$B$7)+1)))","v":""},476,null,null,null,null,null,"-",null,null," : "]
[null,{"$f":"IF($B$7=0,\"\",IF(OR($B$7=0,QUOTIENT($C485-1,$B$7)+1>MAX($K$6,Planning!$E$3)),\"\",IF(OR($C485>$C$7,MOD($C485-1,$B$7)>0),\"\",QUOTIENT($C485-1,$B$7)+1)))","v":""},477,null,null,null,null,null,"-",null,null," : "]
[null,{"$f":"IF($B$7=0,\"\",IF(OR($B$7=0,QUOTIENT($C486-1,$B$7)+1>MAX($K$6,Planning!$E$3)),\"\",IF(OR($C486>$C$7,MOD($C486-1,$B$7)>0),\"\",QUOTIENT($C486-1,$B$7)+1)))","v":""},478,null,null,null,null,null,"-",null,null," : "]
[null,{"$f":"IF($B$7=0,\"\",IF(OR($B$7=0,QUOTIENT($C487-1,$B$7)+1>MAX($K$6,Planning!$E$3)),\"\",IF(OR($C487>$C$7,MOD($C487-1,$B$7)>0),\"\",QUOTIENT($C487-1,$B$7)+1)))","v":""},479,null,null,null,null,null,"-",null,null," : "]
[null,{"$f":"IF($B$7=0,\"\",IF(OR($B$7=0,QUOTIENT($C488-1,$B$7)+1>MAX($K$6,Planning!$E$3)),\"\",IF(OR($C488>$C$7,MOD($C488-1,$B$7)>0),\"\",QUOTIENT($C488-1,$B$7)+1)))","v":""},480,null,null,null,null,null,"-",null,null," : "]
[null,{"$f":"IF($B$7=0,\"\",IF(OR($B$7=0,QUOTIENT($C489-1,$B$7)+1>MAX($K$6,Planning!$E$3)),\"\",IF(OR($C489>$C$7,MOD($C489-1,$B$7)>0),\"\",QUOTIENT($C489-1,$B$7)+1)))","v":""},481,null,null,null,null,null,"-",null,null," : "]
[null,{"$f":"IF($B$7=0,\"\",IF(OR($B$7=0,QUOTIENT($C490-1,$B$7)+1>MAX($K$6,Planning!$E$3)),\"\",IF(OR($C490>$C$7,MOD($C490-1,$B$7)>0),\"\",QUOTIENT($C490-1,$B$7)+1)))","v":""},482,null,null,null,null,null,"-",null,null," : "]
[null,{"$f":"IF($B$7=0,\"\",IF(OR($B$7=0,QUOTIENT($C491-1,$B$7)+1>MAX($K$6,Planning!$E$3)),\"\",IF(OR($C491>$C$7,MOD($C491-1,$B$7)>0),\"\",QUOTIENT($C491-1,$B$7)+1)))","v":""},483,null,null,null,null,null,"-",null,null," : "]
[null,{"$f":"IF($B$7=0,\"\",IF(OR($B$7=0,QUOTIENT($C492-1,$B$7)+1>MAX($K$6,Planning!$E$3)),\"\",IF(OR($C492>$C$7,MOD($C492-1,$B$7)>0),\"\",QUOTIENT($C492-1,$B$7)+1)))","v":""},484,null,null,null,null,null,"-",null,null," : "]
[null,{"$f":"IF($B$7=0,\"\",IF(OR($B$7=0,QUOTIENT($C493-1,$B$7)+1>MAX($K$6,Planning!$E$3)),\"\",IF(OR($C493>$C$7,MOD($C493-1,$B$7)>0),\"\",QUOTIENT($C493-1,$B$7)+1)))","v":""},485,null,null,null,null,null,"-",null,null," : "]
[null,{"$f":"IF($B$7=0,\"\",IF(OR($B$7=0,QUOTIENT($C494-1,$B$7)+1>MAX($K$6,Planning!$E$3)),\"\",IF(OR($C494>$C$7,MOD($C494-1,$B$7)>0),\"\",QUOTIENT($C494-1,$B$7)+1)))","v":""},486,null,null,null,null,null,"-",null,null," : "]
[null,{"$f":"IF($B$7=0,\"\",IF(OR($B$7=0,QUOTIENT($C495-1,$B$7)+1>MAX($K$6,Planning!$E$3)),\"\",IF(OR($C495>$C$7,MOD($C495-1,$B$7)>0),\"\",QUOTIENT($C495-1,$B$7)+1)))","v":""},487,null,null,null,null,null,"-",null,null," : "]
[null,{"$f":"IF($B$7=0,\"\",IF(OR($B$7=0,QUOTIENT($C496-1,$B$7)+1>MAX($K$6,Planning!$E$3)),\"\",IF(OR($C496>$C$7,MOD($C496-1,$B$7)>0),\"\",QUOTIENT($C496-1,$B$7)+1)))","v":""},488,null,null,null,null,null,"-",null,null," : "]
[null,{"$f":"IF($B$7=0,\"\",IF(OR($B$7=0,QUOTIENT($C497-1,$B$7)+1>MAX($K$6,Planning!$E$3)),\"\",IF(OR($C497>$C$7,MOD($C497-1,$B$7)>0),\"\",QUOTIENT($C497-1,$B$7)+1)))","v":""},489,null,null,null,null,null,"-",null,null," : "]
[null,{"$f":"IF($B$7=0,\"\",IF(OR($B$7=0,QUOTIENT($C498-1,$B$7)+1>MAX($K$6,Planning!$E$3)),\"\",IF(OR($C498>$C$7,MOD($C498-1,$B$7)>0),\"\",QUOTIENT($C498-1,$B$7)+1)))","v":""},490,null,null,null,null,null,"-",null,null," : "]
[null,{"$f":"IF($B$7=0,\"\",IF(OR($B$7=0,QUOTIENT($C499-1,$B$7)+1>MAX($K$6,Planning!$E$3)),\"\",IF(OR($C499>$C$7,MOD($C499-1,$B$7)>0),\"\",QUOTIENT($C499-1,$B$7)+1)))","v":""},491,null,null,null,null,null,"-",null,null," : "]
[null,{"$f":"IF($B$7=0,\"\",IF(OR($B$7=0,QUOTIENT($C500-1,$B$7)+1>MAX($K$6,Planning!$E$3)),\"\",IF(OR($C500>$C$7,MOD($C500-1,$B$7)>0),\"\",QUOTIENT($C500-1,$B$7)+1)))","v":""},492,null,null,null,null,null,"-",null,null," : "]
[null,{"$f":"IF($B$7=0,\"\",IF(OR($B$7=0,QUOTIENT($C501-1,$B$7)+1>MAX($K$6,Planning!$E$3)),\"\",IF(OR($C501>$C$7,MOD($C501-1,$B$7)>0),\"\",QUOTIENT($C501-1,$B$7)+1)))","v":""},493,null,null,null,null,null,"-",null,null," : "]
[null,{"$f":"IF($B$7=0,\"\",IF(OR($B$7=0,QUOTIENT($C502-1,$B$7)+1>MAX($K$6,Planning!$E$3)),\"\",IF(OR($C502>$C$7,MOD($C502-1,$B$7)>0),\"\",QUOTIENT($C502-1,$B$7)+1)))","v":""},494,null,null,null,null,null,"-",null,null," : "]
[null,{"$f":"IF($B$7=0,\"\",IF(OR($B$7=0,QUOTIENT($C503-1,$B$7)+1>MAX($K$6,Planning!$E$3)),\"\",IF(OR($C503>$C$7,MOD($C503-1,$B$7)>0),\"\",QUOTIENT($C503-1,$B$7)+1)))","v":""},495,null,null,null,null,null,"-",null,null," : "]
[null,{"$f":"IF($B$7=0,\"\",IF(OR($B$7=0,QUOTIENT($C504-1,$B$7)+1>MAX($K$6,Planning!$E$3)),\"\",IF(OR($C504>$C$7,MOD($C504-1,$B$7)>0),\"\",QUOTIENT($C504-1,$B$7)+1)))","v":""},496,null,null,null,null,null,"-",null,null," : "]
[null,{"$f":"IF($B$7=0,\"\",IF(OR($B$7=0,QUOTIENT($C505-1,$B$7)+1>MAX($K$6,Planning!$E$3)),\"\",IF(OR($C505>$C$7,MOD($C505-1,$B$7)>0),\"\",QUOTIENT($C505-1,$B$7)+1)))","v":""},497,null,null,null,null,null,"-",null,null," : "]
[null,{"$f":"IF($B$7=0,\"\",IF(OR($B$7=0,QUOTIENT($C506-1,$B$7)+1>MAX($K$6,Planning!$E$3)),\"\",IF(OR($C506>$C$7,MOD($C506-1,$B$7)>0),\"\",QUOTIENT($C506-1,$B$7)+1)))","v":""},498,null,null,null,null,null,"-",null,null," : "]
[null,{"$f":"IF($B$7=0,\"\",IF(OR($B$7=0,QUOTIENT($C507-1,$B$7)+1>MAX($K$6,Planning!$E$3)),\"\",IF(OR($C507>$C$7,MOD($C507-1,$B$7)>0),\"\",QUOTIENT($C507-1,$B$7)+1)))","v":""},499,null,null,null,null,null,"-",null,null," : "]
[null,{"$f":"IF($B$7=0,\"\",IF(OR($B$7=0,QUOTIENT($C508-1,$B$7)+1>MAX($K$6,Planning!$E$3)),\"\",IF(OR($C508>$C$7,MOD($C508-1,$B$7)>0),\"\",QUOTIENT($C508-1,$B$7)+1)))","v":""},500,null,null,null,null,null,"-",null,null," : "]
[null,{"$f":"IF($B$7=0,\"\",IF(OR($B$7=0,QUOTIENT($C509-1,$B$7)+1>MAX($K$6,Planning!$E$3)),\"\",IF(OR($C509>$C$7,MOD($C509-1,$B$7)>0),\"\",QUOTIENT($C509-1,$B$7)+1)))","v":""},501,null,null,null,null,null,"-",null,null," : "]
[null,{"$f":"IF($B$7=0,\"\",IF(OR($B$7=0,QUOTIENT($C510-1,$B$7)+1>MAX($K$6,Planning!$E$3)),\"\",IF(OR($C510>$C$7,MOD($C510-1,$B$7)>0),\"\",QUOTIENT($C510-1,$B$7)+1)))","v":""},502,null,null,null,null,null,"-",null,null," : "]
[null,{"$f":"IF($B$7=0,\"\",IF(OR($B$7=0,QUOTIENT($C511-1,$B$7)+1>MAX($K$6,Planning!$E$3)),\"\",IF(OR($C511>$C$7,MOD($C511-1,$B$7)>0),\"\",QUOTIENT($C511-1,$B$7)+1)))","v":""},503,null,null,null,null,null,"-",null,null," : "]
[null,{"$f":"IF($B$7=0,\"\",IF(OR($B$7=0,QUOTIENT($C512-1,$B$7)+1>MAX($K$6,Planning!$E$3)),\"\",IF(OR($C512>$C$7,MOD($C512-1,$B$7)>0),\"\",QUOTIENT($C512-1,$B$7)+1)))","v":""},504,null,null,null,null,null,"-",null,null," : "]
[null,{"$f":"IF($B$7=0,\"\",IF(OR($B$7=0,QUOTIENT($C513-1,$B$7)+1>MAX($K$6,Planning!$E$3)),\"\",IF(OR($C513>$C$7,MOD($C513-1,$B$7)>0),\"\",QUOTIENT($C513-1,$B$7)+1)))","v":""},505,null,null,null,null,null,"-",null,null," : "]
[null,{"$f":"IF($B$7=0,\"\",IF(OR($B$7=0,QUOTIENT($C514-1,$B$7)+1>MAX($K$6,Planning!$E$3)),\"\",IF(OR($C514>$C$7,MOD($C514-1,$B$7)>0),\"\",QUOTIENT($C514-1,$B$7)+1)))","v":""},506,null,null,null,null,null,"-",null,null," : "]
[null,{"$f":"IF($B$7=0,\"\",IF(OR($B$7=0,QUOTIENT($C515-1,$B$7)+1>MAX($K$6,Planning!$E$3)),\"\",IF(OR($C515>$C$7,MOD($C515-1,$B$7)>0),\"\",QUOTIENT($C515-1,$B$7)+1)))","v":""},507,null,null,null,null,null,"-",null,null," : "]
[null,{"$f":"IF($B$7=0,\"\",IF(OR($B$7=0,QUOTIENT($C516-1,$B$7)+1>MAX($K$6,Planning!$E$3)),\"\",IF(OR($C516>$C$7,MOD($C516-1,$B$7)>0),\"\",QUOTIENT($C516-1,$B$7)+1)))","v":""},508,null,null,null,null,null,"-",null,null," : "]
[null,{"$f":"IF($B$7=0,\"\",IF(OR($B$7=0,QUOTIENT($C517-1,$B$7)+1>MAX($K$6,Planning!$E$3)),\"\",IF(OR($C517>$C$7,MOD($C517-1,$B$7)>0),\"\",QUOTIENT($C517-1,$B$7)+1)))","v":""},509,null,null,null,null,null,"-",null,null," : "]
[null,{"$f":"IF($B$7=0,\"\",IF(OR($B$7=0,QUOTIENT($C518-1,$B$7)+1>MAX($K$6,Planning!$E$3)),\"\",IF(OR($C518>$C$7,MOD($C518-1,$B$7)>0),\"\",QUOTIENT($C518-1,$B$7)+1)))","v":""},510,null,null,null,null,null,"-",null,null," : "]
[null,{"$f":"IF($B$7=0,\"\",IF(OR($B$7=0,QUOTIENT($C519-1,$B$7)+1>MAX($K$6,Planning!$E$3)),\"\",IF(OR($C519>$C$7,MOD($C519-1,$B$7)>0),\"\",QUOTIENT($C519-1,$B$7)+1)))","v":""},511,null,null,null,null,null,"-",null,null," : "]
[null,{"$f":"IF($B$7=0,\"\",IF(OR($B$7=0,QUOTIENT($C520-1,$B$7)+1>MAX($K$6,Planning!$E$3)),\"\",IF(OR($C520>$C$7,MOD($C520-1,$B$7)>0),\"\",QUOTIENT($C520-1,$B$7)+1)))","v":""},512,null,null,null,null,null,"-",null,null," : "]
[null,{"$f":"IF($B$7=0,\"\",IF(OR($B$7=0,QUOTIENT($C521-1,$B$7)+1>MAX($K$6,Planning!$E$3)),\"\",IF(OR($C521>$C$7,MOD($C521-1,$B$7)>0),\"\",QUOTIENT($C521-1,$B$7)+1)))","v":""},513,null,null,null,null,null,"-",null,null," : "]
[null,{"$f":"IF($B$7=0,\"\",IF(OR($B$7=0,QUOTIENT($C522-1,$B$7)+1>MAX($K$6,Planning!$E$3)),\"\",IF(OR($C522>$C$7,MOD($C522-1,$B$7)>0),\"\",QUOTIENT($C522-1,$B$7)+1)))","v":""},514,null,null,null,null,null,"-",null,null," : "]
[null,{"$f":"IF($B$7=0,\"\",IF(OR($B$7=0,QUOTIENT($C523-1,$B$7)+1>MAX($K$6,Planning!$E$3)),\"\",IF(OR($C523>$C$7,MOD($C523-1,$B$7)>0),\"\",QUOTIENT($C523-1,$B$7)+1)))","v":""},515,null,null,null,null,null,"-",null,null," : "]
[null,{"$f":"IF($B$7=0,\"\",IF(OR($B$7=0,QUOTIENT($C524-1,$B$7)+1>MAX($K$6,Planning!$E$3)),\"\",IF(OR($C524>$C$7,MOD($C524-1,$B$7)>0),\"\",QUOTIENT($C524-1,$B$7)+1)))","v":""},516,null,null,null,null,null,"-",null,null," : "]
[null,{"$f":"IF($B$7=0,\"\",IF(OR($B$7=0,QUOTIENT($C525-1,$B$7)+1>MAX($K$6,Planning!$E$3)),\"\",IF(OR($C525>$C$7,MOD($C525-1,$B$7)>0),\"\",QUOTIENT($C525-1,$B$7)+1)))","v":""},517,null,null,null,null,null,"-",null,null," : "]
[null,{"$f":"IF($B$7=0,\"\",IF(OR($B$7=0,QUOTIENT($C526-1,$B$7)+1>MAX($K$6,Planning!$E$3)),\"\",IF(OR($C526>$C$7,MOD($C526-1,$B$7)>0),\"\",QUOTIENT($C526-1,$B$7)+1)))","v":""},518,null,null,null,null,null,"-",null,null," : "]
[null,{"$f":"IF($B$7=0,\"\",IF(OR($B$7=0,QUOTIENT($C527-1,$B$7)+1>MAX($K$6,Planning!$E$3)),\"\",IF(OR($C527>$C$7,MOD($C527-1,$B$7)>0),\"\",QUOTIENT($C527-1,$B$7)+1)))","v":""},519,null,null,null,null,null,"-",null,null," : "]
[null,{"$f":"IF($B$7=0,\"\",IF(OR($B$7=0,QUOTIENT($C528-1,$B$7)+1>MAX($K$6,Planning!$E$3)),\"\",IF(OR($C528>$C$7,MOD($C528-1,$B$7)>0),\"\",QUOTIENT($C528-1,$B$7)+1)))","v":""},520,null,null,null,null,null,"-",null,null," : "]
[null,{"$f":"IF($B$7=0,\"\",IF(OR($B$7=0,QUOTIENT($C529-1,$B$7)+1>MAX($K$6,Planning!$E$3)),\"\",IF(OR($C529>$C$7,MOD($C529-1,$B$7)>0),\"\",QUOTIENT($C529-1,$B$7)+1)))","v":""},521,null,null,null,null,null,"-",null,null," : "]
[null,{"$f":"IF($B$7=0,\"\",IF(OR($B$7=0,QUOTIENT($C530-1,$B$7)+1>MAX($K$6,Planning!$E$3)),\"\",IF(OR($C530>$C$7,MOD($C530-1,$B$7)>0),\"\",QUOTIENT($C530-1,$B$7)+1)))","v":""},522,null,null,null,null,null,"-",null,null," : "]
[null,{"$f":"IF($B$7=0,\"\",IF(OR($B$7=0,QUOTIENT($C531-1,$B$7)+1>MAX($K$6,Planning!$E$3)),\"\",IF(OR($C531>$C$7,MOD($C531-1,$B$7)>0),\"\",QUOTIENT($C531-1,$B$7)+1)))","v":""},523,null,null,null,null,null,"-",null,null," : "]
[null,{"$f":"IF($B$7=0,\"\",IF(OR($B$7=0,QUOTIENT($C532-1,$B$7)+1>MAX($K$6,Planning!$E$3)),\"\",IF(OR($C532>$C$7,MOD($C532-1,$B$7)>0),\"\",QUOTIENT($C532-1,$B$7)+1)))","v":""},524,null,null,null,null,null,"-",null,null," : "]
[null,{"$f":"IF($B$7=0,\"\",IF(OR($B$7=0,QUOTIENT($C533-1,$B$7)+1>MAX($K$6,Planning!$E$3)),\"\",IF(OR($C533>$C$7,MOD($C533-1,$B$7)>0),\"\",QUOTIENT($C533-1,$B$7)+1)))","v":""},525,null,null,null,null,null,"-",null,null," : "]
[null,{"$f":"IF($B$7=0,\"\",IF(OR($B$7=0,QUOTIENT($C534-1,$B$7)+1>MAX($K$6,Planning!$E$3)),\"\",IF(OR($C534>$C$7,MOD($C534-1,$B$7)>0),\"\",QUOTIENT($C534-1,$B$7)+1)))","v":""},526,null,null,null,null,null,"-",null,null," : "]
[null,{"$f":"IF($B$7=0,\"\",IF(OR($B$7=0,QUOTIENT($C535-1,$B$7)+1>MAX($K$6,Planning!$E$3)),\"\",IF(OR($C535>$C$7,MOD($C535-1,$B$7)>0),\"\",QUOTIENT($C535-1,$B$7)+1)))","v":""},527,null,null,null,null,null,"-",null,null," : "]
[null,{"$f":"IF($B$7=0,\"\",IF(OR($B$7=0,QUOTIENT($C536-1,$B$7)+1>MAX($K$6,Planning!$E$3)),\"\",IF(OR($C536>$C$7,MOD($C536-1,$B$7)>0),\"\",QUOTIENT($C536-1,$B$7)+1)))","v":""},528,null,null,null,null,null,"-",null,null," : "]
[null,{"$f":"IF($B$7=0,\"\",IF(OR($B$7=0,QUOTIENT($C537-1,$B$7)+1>MAX($K$6,Planning!$E$3)),\"\",IF(OR($C537>$C$7,MOD($C537-1,$B$7)>0),\"\",QUOTIENT($C537-1,$B$7)+1)))","v":""},529,null,null,null,null,null,"-",null,null," : "]
[null,{"$f":"IF($B$7=0,\"\",IF(OR($B$7=0,QUOTIENT($C538-1,$B$7)+1>MAX($K$6,Planning!$E$3)),\"\",IF(OR($C538>$C$7,MOD($C538-1,$B$7)>0),\"\",QUOTIENT($C538-1,$B$7)+1)))","v":""},530,null,null,null,null,null,"-",null,null," : "]
[null,{"$f":"IF($B$7=0,\"\",IF(OR($B$7=0,QUOTIENT($C539-1,$B$7)+1>MAX($K$6,Planning!$E$3)),\"\",IF(OR($C539>$C$7,MOD($C539-1,$B$7)>0),\"\",QUOTIENT($C539-1,$B$7)+1)))","v":""},531,null,null,null,null,null,"-",null,null," : "]
[null,{"$f":"IF($B$7=0,\"\",IF(OR($B$7=0,QUOTIENT($C540-1,$B$7)+1>MAX($K$6,Planning!$E$3)),\"\",IF(OR($C540>$C$7,MOD($C540-1,$B$7)>0),\"\",QUOTIENT($C540-1,$B$7)+1)))","v":""},532,null,null,null,null,null,"-",null,null," : "]
[null,{"$f":"IF($B$7=0,\"\",IF(OR($B$7=0,QUOTIENT($C541-1,$B$7)+1>MAX($K$6,Planning!$E$3)),\"\",IF(OR($C541>$C$7,MOD($C541-1,$B$7)>0),\"\",QUOTIENT($C541-1,$B$7)+1)))","v":""},533,null,null,null,null,null,"-",null,null," : "]
[null,{"$f":"IF($B$7=0,\"\",IF(OR($B$7=0,QUOTIENT($C542-1,$B$7)+1>MAX($K$6,Planning!$E$3)),\"\",IF(OR($C542>$C$7,MOD($C542-1,$B$7)>0),\"\",QUOTIENT($C542-1,$B$7)+1)))","v":""},534,null,null,null,null,null,"-",null,null," : "]
[null,{"$f":"IF($B$7=0,\"\",IF(OR($B$7=0,QUOTIENT($C543-1,$B$7)+1>MAX($K$6,Planning!$E$3)),\"\",IF(OR($C543>$C$7,MOD($C543-1,$B$7)>0),\"\",QUOTIENT($C543-1,$B$7)+1)))","v":""},535,null,null,null,null,null,"-",null,null," : "]
[null,{"$f":"IF($B$7=0,\"\",IF(OR($B$7=0,QUOTIENT($C544-1,$B$7)+1>MAX($K$6,Planning!$E$3)),\"\",IF(OR($C544>$C$7,MOD($C544-1,$B$7)>0),\"\",QUOTIENT($C544-1,$B$7)+1)))","v":""},536,null,null,null,null,null,"-",null,null," : "]
[null,{"$f":"IF($B$7=0,\"\",IF(OR($B$7=0,QUOTIENT($C545-1,$B$7)+1>MAX($K$6,Planning!$E$3)),\"\",IF(OR($C545>$C$7,MOD($C545-1,$B$7)>0),\"\",QUOTIENT($C545-1,$B$7)+1)))","v":""},537,null,null,null,null,null,"-",null,null," : "]
[null,{"$f":"IF($B$7=0,\"\",IF(OR($B$7=0,QUOTIENT($C546-1,$B$7)+1>MAX($K$6,Planning!$E$3)),\"\",IF(OR($C546>$C$7,MOD($C546-1,$B$7)>0),\"\",QUOTIENT($C546-1,$B$7)+1)))","v":""},538,null,null,null,null,null,"-",null,null," : "]
[null,{"$f":"IF($B$7=0,\"\",IF(OR($B$7=0,QUOTIENT($C547-1,$B$7)+1>MAX($K$6,Planning!$E$3)),\"\",IF(OR($C547>$C$7,MOD($C547-1,$B$7)>0),\"\",QUOTIENT($C547-1,$B$7)+1)))","v":""},539,null,null,null,null,null,"-",null,null," : "]
[null,{"$f":"IF($B$7=0,\"\",IF(OR($B$7=0,QUOTIENT($C548-1,$B$7)+1>MAX($K$6,Planning!$E$3)),\"\",IF(OR($C548>$C$7,MOD($C548-1,$B$7)>0),\"\",QUOTIENT($C548-1,$B$7)+1)))","v":""},540,null,null,null,null,null,"-",null,null," : "]
[null,{"$f":"IF($B$7=0,\"\",IF(OR($B$7=0,QUOTIENT($C549-1,$B$7)+1>MAX($K$6,Planning!$E$3)),\"\",IF(OR($C549>$C$7,MOD($C549-1,$B$7)>0),\"\",QUOTIENT($C549-1,$B$7)+1)))","v":""},541,null,null,null,null,null,"-",null,null," : "]
[null,{"$f":"IF($B$7=0,\"\",IF(OR($B$7=0,QUOTIENT($C550-1,$B$7)+1>MAX($K$6,Planning!$E$3)),\"\",IF(OR($C550>$C$7,MOD($C550-1,$B$7)>0),\"\",QUOTIENT($C550-1,$B$7)+1)))","v":""},542,null,null,null,null,null,"-",null,null," : "]
[null,{"$f":"IF($B$7=0,\"\",IF(OR($B$7=0,QUOTIENT($C551-1,$B$7)+1>MAX($K$6,Planning!$E$3)),\"\",IF(OR($C551>$C$7,MOD($C551-1,$B$7)>0),\"\",QUOTIENT($C551-1,$B$7)+1)))","v":""},543,null,null,null,null,null,"-",null,null," : "]
[null,{"$f":"IF($B$7=0,\"\",IF(OR($B$7=0,QUOTIENT($C552-1,$B$7)+1>MAX($K$6,Planning!$E$3)),\"\",IF(OR($C552>$C$7,MOD($C552-1,$B$7)>0),\"\",QUOTIENT($C552-1,$B$7)+1)))","v":""},544,null,null,null,null,null,"-",null,null," : "]
[null,{"$f":"IF($B$7=0,\"\",IF(OR($B$7=0,QUOTIENT($C553-1,$B$7)+1>MAX($K$6,Planning!$E$3)),\"\",IF(OR($C553>$C$7,MOD($C553-1,$B$7)>0),\"\",QUOTIENT($C553-1,$B$7)+1)))","v":""},545,null,null,null,null,null,"-",null,null," : "]
[null,{"$f":"IF($B$7=0,\"\",IF(OR($B$7=0,QUOTIENT($C554-1,$B$7)+1>MAX($K$6,Planning!$E$3)),\"\",IF(OR($C554>$C$7,MOD($C554-1,$B$7)>0),\"\",QUOTIENT($C554-1,$B$7)+1)))","v":""},546,null,null,null,null,null,"-",null,null," : "]
[null,{"$f":"IF($B$7=0,\"\",IF(OR($B$7=0,QUOTIENT($C555-1,$B$7)+1>MAX($K$6,Planning!$E$3)),\"\",IF(OR($C555>$C$7,MOD($C555-1,$B$7)>0),\"\",QUOTIENT($C555-1,$B$7)+1)))","v":""},547,null,null,null,null,null,"-",null,null," : "]
[null,{"$f":"IF($B$7=0,\"\",IF(OR($B$7=0,QUOTIENT($C556-1,$B$7)+1>MAX($K$6,Planning!$E$3)),\"\",IF(OR($C556>$C$7,MOD($C556-1,$B$7)>0),\"\",QUOTIENT($C556-1,$B$7)+1)))","v":""},548,null,null,null,null,null,"-",null,null," : "]
[null,{"$f":"IF($B$7=0,\"\",IF(OR($B$7=0,QUOTIENT($C557-1,$B$7)+1>MAX($K$6,Planning!$E$3)),\"\",IF(OR($C557>$C$7,MOD($C557-1,$B$7)>0),\"\",QUOTIENT($C557-1,$B$7)+1)))","v":""},549,null,null,null,null,null,"-",null,null," : "]
[null,{"$f":"IF($B$7=0,\"\",IF(OR($B$7=0,QUOTIENT($C558-1,$B$7)+1>MAX($K$6,Planning!$E$3)),\"\",IF(OR($C558>$C$7,MOD($C558-1,$B$7)>0),\"\",QUOTIENT($C558-1,$B$7)+1)))","v":""},550,null,null,null,null,null,"-",null,null," : "]
[null,{"$f":"IF($B$7=0,\"\",IF(OR($B$7=0,QUOTIENT($C559-1,$B$7)+1>MAX($K$6,Planning!$E$3)),\"\",IF(OR($C559>$C$7,MOD($C559-1,$B$7)>0),\"\",QUOTIENT($C559-1,$B$7)+1)))","v":""},551,null,null,null,null,null,"-",null,null," : "]
[null,{"$f":"IF($B$7=0,\"\",IF(OR($B$7=0,QUOTIENT($C560-1,$B$7)+1>MAX($K$6,Planning!$E$3)),\"\",IF(OR($C560>$C$7,MOD($C560-1,$B$7)>0),\"\",QUOTIENT($C560-1,$B$7)+1)))","v":""},552,null,null,null,null,null,"-",null,null," : "]
[null,{"$f":"IF($B$7=0,\"\",IF(OR($B$7=0,QUOTIENT($C561-1,$B$7)+1>MAX($K$6,Planning!$E$3)),\"\",IF(OR($C561>$C$7,MOD($C561-1,$B$7)>0),\"\",QUOTIENT($C561-1,$B$7)+1)))","v":""},553,null,null,null,null,null,"-",null,null," : "]
[null,{"$f":"IF($B$7=0,\"\",IF(OR($B$7=0,QUOTIENT($C562-1,$B$7)+1>MAX($K$6,Planning!$E$3)),\"\",IF(OR($C562>$C$7,MOD($C562-1,$B$7)>0),\"\",QUOTIENT($C562-1,$B$7)+1)))","v":""},554,null,null,null,null,null,"-",null,null," : "]
[null,{"$f":"IF($B$7=0,\"\",IF(OR($B$7=0,QUOTIENT($C563-1,$B$7)+1>MAX($K$6,Planning!$E$3)),\"\",IF(OR($C563>$C$7,MOD($C563-1,$B$7)>0),\"\",QUOTIENT($C563-1,$B$7)+1)))","v":""},555,null,null,null,null,null,"-",null,null," : "]
[null,{"$f":"IF($B$7=0,\"\",IF(OR($B$7=0,QUOTIENT($C564-1,$B$7)+1>MAX($K$6,Planning!$E$3)),\"\",IF(OR($C564>$C$7,MOD($C564-1,$B$7)>0),\"\",QUOTIENT($C564-1,$B$7)+1)))","v":""},556,null,null,null,null,null,"-",null,null," : "]
[null,{"$f":"IF($B$7=0,\"\",IF(OR($B$7=0,QUOTIENT($C565-1,$B$7)+1>MAX($K$6,Planning!$E$3)),\"\",IF(OR($C565>$C$7,MOD($C565-1,$B$7)>0),\"\",QUOTIENT($C565-1,$B$7)+1)))","v":""},557,null,null,null,null,null,"-",null,null," : "]
[null,{"$f":"IF($B$7=0,\"\",IF(OR($B$7=0,QUOTIENT($C566-1,$B$7)+1>MAX($K$6,Planning!$E$3)),\"\",IF(OR($C566>$C$7,MOD($C566-1,$B$7)>0),\"\",QUOTIENT($C566-1,$B$7)+1)))","v":""},558,null,null,null,null,null,"-",null,null," : "]
[null,{"$f":"IF($B$7=0,\"\",IF(OR($B$7=0,QUOTIENT($C567-1,$B$7)+1>MAX($K$6,Planning!$E$3)),\"\",IF(OR($C567>$C$7,MOD($C567-1,$B$7)>0),\"\",QUOTIENT($C567-1,$B$7)+1)))","v":""},559,null,null,null,null,null,"-",null,null," : "]
[null,{"$f":"IF($B$7=0,\"\",IF(OR($B$7=0,QUOTIENT($C568-1,$B$7)+1>MAX($K$6,Planning!$E$3)),\"\",IF(OR($C568>$C$7,MOD($C568-1,$B$7)>0),\"\",QUOTIENT($C568-1,$B$7)+1)))","v":""},560,null,null,null,null,null,"-",null,null," : "]
[null,{"$f":"IF($B$7=0,\"\",IF(OR($B$7=0,QUOTIENT($C569-1,$B$7)+1>MAX($K$6,Planning!$E$3)),\"\",IF(OR($C569>$C$7,MOD($C569-1,$B$7)>0),\"\",QUOTIENT($C569-1,$B$7)+1)))","v":""},561,null,null,null,null,null,"-",null,null," : "]
[null,{"$f":"IF($B$7=0,\"\",IF(OR($B$7=0,QUOTIENT($C570-1,$B$7)+1>MAX($K$6,Planning!$E$3)),\"\",IF(OR($C570>$C$7,MOD($C570-1,$B$7)>0),\"\",QUOTIENT($C570-1,$B$7)+1)))","v":""},562,null,null,null,null,null,"-",null,null," : "]
[null,{"$f":"IF($B$7=0,\"\",IF(OR($B$7=0,QUOTIENT($C571-1,$B$7)+1>MAX($K$6,Planning!$E$3)),\"\",IF(OR($C571>$C$7,MOD($C571-1,$B$7)>0),\"\",QUOTIENT($C571-1,$B$7)+1)))","v":""},563,null,null,null,null,null,"-",null,null," : "]
[null,{"$f":"IF($B$7=0,\"\",IF(OR($B$7=0,QUOTIENT($C572-1,$B$7)+1>MAX($K$6,Planning!$E$3)),\"\",IF(OR($C572>$C$7,MOD($C572-1,$B$7)>0),\"\",QUOTIENT($C572-1,$B$7)+1)))","v":""},564,null,null,null,null,null,"-",null,null," : "]
[null,{"$f":"IF($B$7=0,\"\",IF(OR($B$7=0,QUOTIENT($C573-1,$B$7)+1>MAX($K$6,Planning!$E$3)),\"\",IF(OR($C573>$C$7,MOD($C573-1,$B$7)>0),\"\",QUOTIENT($C573-1,$B$7)+1)))","v":""},565,null,null,null,null,null,"-",null,null," : "]
[null,{"$f":"IF($B$7=0,\"\",IF(OR($B$7=0,QUOTIENT($C574-1,$B$7)+1>MAX($K$6,Planning!$E$3)),\"\",IF(OR($C574>$C$7,MOD($C574-1,$B$7)>0),\"\",QUOTIENT($C574-1,$B$7)+1)))","v":""},566,null,null,null,null,null,"-",null,null," : "]
[null,{"$f":"IF($B$7=0,\"\",IF(OR($B$7=0,QUOTIENT($C575-1,$B$7)+1>MAX($K$6,Planning!$E$3)),\"\",IF(OR($C575>$C$7,MOD($C575-1,$B$7)>0),\"\",QUOTIENT($C575-1,$B$7)+1)))","v":""},567,null,null,null,null,null,"-",null,null," : "]
[null,{"$f":"IF($B$7=0,\"\",IF(OR($B$7=0,QUOTIENT($C576-1,$B$7)+1>MAX($K$6,Planning!$E$3)),\"\",IF(OR($C576>$C$7,MOD($C576-1,$B$7)>0),\"\",QUOTIENT($C576-1,$B$7)+1)))","v":""},568,null,null,null,null,null,"-",null,null," : "]
[null,{"$f":"IF($B$7=0,\"\",IF(OR($B$7=0,QUOTIENT($C577-1,$B$7)+1>MAX($K$6,Planning!$E$3)),\"\",IF(OR($C577>$C$7,MOD($C577-1,$B$7)>0),\"\",QUOTIENT($C577-1,$B$7)+1)))","v":""},569,null,null,null,null,null,"-",null,null," : "]
[null,{"$f":"IF($B$7=0,\"\",IF(OR($B$7=0,QUOTIENT($C578-1,$B$7)+1>MAX($K$6,Planning!$E$3)),\"\",IF(OR($C578>$C$7,MOD($C578-1,$B$7)>0),\"\",QUOTIENT($C578-1,$B$7)+1)))","v":""},570,null,null,null,null,null,"-",null,null," : "]
[null,{"$f":"IF($B$7=0,\"\",IF(OR($B$7=0,QUOTIENT($C579-1,$B$7)+1>MAX($K$6,Planning!$E$3)),\"\",IF(OR($C579>$C$7,MOD($C579-1,$B$7)>0),\"\",QUOTIENT($C579-1,$B$7)+1)))","v":""},571,null,null,null,null,null,"-",null,null," : "]
[null,{"$f":"IF($B$7=0,\"\",IF(OR($B$7=0,QUOTIENT($C580-1,$B$7)+1>MAX($K$6,Planning!$E$3)),\"\",IF(OR($C580>$C$7,MOD($C580-1,$B$7)>0),\"\",QUOTIENT($C580-1,$B$7)+1)))","v":""},572,null,null,null,null,null,"-",null,null," : "]
[null,{"$f":"IF($B$7=0,\"\",IF(OR($B$7=0,QUOTIENT($C581-1,$B$7)+1>MAX($K$6,Planning!$E$3)),\"\",IF(OR($C581>$C$7,MOD($C581-1,$B$7)>0),\"\",QUOTIENT($C581-1,$B$7)+1)))","v":""},573,null,null,null,null,null,"-",null,null," : "]
[null,{"$f":"IF($B$7=0,\"\",IF(OR($B$7=0,QUOTIENT($C582-1,$B$7)+1>MAX($K$6,Planning!$E$3)),\"\",IF(OR($C582>$C$7,MOD($C582-1,$B$7)>0),\"\",QUOTIENT($C582-1,$B$7)+1)))","v":""},574,null,null,null,null,null,"-",null,null," : "]
[null,{"$f":"IF($B$7=0,\"\",IF(OR($B$7=0,QUOTIENT($C583-1,$B$7)+1>MAX($K$6,Planning!$E$3)),\"\",IF(OR($C583>$C$7,MOD($C583-1,$B$7)>0),\"\",QUOTIENT($C583-1,$B$7)+1)))","v":""},575,null,null,null,null,null,"-",null,null," : "]
[null,{"$f":"IF($B$7=0,\"\",IF(OR($B$7=0,QUOTIENT($C584-1,$B$7)+1>MAX($K$6,Planning!$E$3)),\"\",IF(OR($C584>$C$7,MOD($C584-1,$B$7)>0),\"\",QUOTIENT($C584-1,$B$7)+1)))","v":""},576,null,null,null,null,null,"-",null,null," : "]
[null,{"$f":"IF($B$7=0,\"\",IF(OR($B$7=0,QUOTIENT($C585-1,$B$7)+1>MAX($K$6,Planning!$E$3)),\"\",IF(OR($C585>$C$7,MOD($C585-1,$B$7)>0),\"\",QUOTIENT($C585-1,$B$7)+1)))","v":""},577,null,null,null,null,null,"-",null,null," : "]
[null,{"$f":"IF($B$7=0,\"\",IF(OR($B$7=0,QUOTIENT($C586-1,$B$7)+1>MAX($K$6,Planning!$E$3)),\"\",IF(OR($C586>$C$7,MOD($C586-1,$B$7)>0),\"\",QUOTIENT($C586-1,$B$7)+1)))","v":""},578,null,null,null,null,null,"-",null,null," : "]
[null,{"$f":"IF($B$7=0,\"\",IF(OR($B$7=0,QUOTIENT($C587-1,$B$7)+1>MAX($K$6,Planning!$E$3)),\"\",IF(OR($C587>$C$7,MOD($C587-1,$B$7)>0),\"\",QUOTIENT($C587-1,$B$7)+1)))","v":""},579,null,null,null,null,null,"-",null,null," : "]
[null,{"$f":"IF($B$7=0,\"\",IF(OR($B$7=0,QUOTIENT($C588-1,$B$7)+1>MAX($K$6,Planning!$E$3)),\"\",IF(OR($C588>$C$7,MOD($C588-1,$B$7)>0),\"\",QUOTIENT($C588-1,$B$7)+1)))","v":""},580,null,null,null,null,null,"-",null,null," : "]
[null,{"$f":"IF($B$7=0,\"\",IF(OR($B$7=0,QUOTIENT($C589-1,$B$7)+1>MAX($K$6,Planning!$E$3)),\"\",IF(OR($C589>$C$7,MOD($C589-1,$B$7)>0),\"\",QUOTIENT($C589-1,$B$7)+1)))","v":""},581,null,null,null,null,null,"-",null,null," : "]
[null,{"$f":"IF($B$7=0,\"\",IF(OR($B$7=0,QUOTIENT($C590-1,$B$7)+1>MAX($K$6,Planning!$E$3)),\"\",IF(OR($C590>$C$7,MOD($C590-1,$B$7)>0),\"\",QUOTIENT($C590-1,$B$7)+1)))","v":""},582,null,null,null,null,null,"-",null,null," : "]
[null,{"$f":"IF($B$7=0,\"\",IF(OR($B$7=0,QUOTIENT($C591-1,$B$7)+1>MAX($K$6,Planning!$E$3)),\"\",IF(OR($C591>$C$7,MOD($C591-1,$B$7)>0),\"\",QUOTIENT($C591-1,$B$7)+1)))","v":""},583,null,null,null,null,null,"-",null,null," : "]
[null,{"$f":"IF($B$7=0,\"\",IF(OR($B$7=0,QUOTIENT($C592-1,$B$7)+1>MAX($K$6,Planning!$E$3)),\"\",IF(OR($C592>$C$7,MOD($C592-1,$B$7)>0),\"\",QUOTIENT($C592-1,$B$7)+1)))","v":""},584,null,null,null,null,null,"-",null,null," : "]
[null,{"$f":"IF($B$7=0,\"\",IF(OR($B$7=0,QUOTIENT($C593-1,$B$7)+1>MAX($K$6,Planning!$E$3)),\"\",IF(OR($C593>$C$7,MOD($C593-1,$B$7)>0),\"\",QUOTIENT($C593-1,$B$7)+1)))","v":""},585,null,null,null,null,null,"-",null,null," : "]
[null,{"$f":"IF($B$7=0,\"\",IF(OR($B$7=0,QUOTIENT($C594-1,$B$7)+1>MAX($K$6,Planning!$E$3)),\"\",IF(OR($C594>$C$7,MOD($C594-1,$B$7)>0),\"\",QUOTIENT($C594-1,$B$7)+1)))","v":""},586,null,null,null,null,null,"-",null,null," : "]
[null,{"$f":"IF($B$7=0,\"\",IF(OR($B$7=0,QUOTIENT($C595-1,$B$7)+1>MAX($K$6,Planning!$E$3)),\"\",IF(OR($C595>$C$7,MOD($C595-1,$B$7)>0),\"\",QUOTIENT($C595-1,$B$7)+1)))","v":""},587,null,null,null,null,null,"-",null,null," : "]
[null,{"$f":"IF($B$7=0,\"\",IF(OR($B$7=0,QUOTIENT($C596-1,$B$7)+1>MAX($K$6,Planning!$E$3)),\"\",IF(OR($C596>$C$7,MOD($C596-1,$B$7)>0),\"\",QUOTIENT($C596-1,$B$7)+1)))","v":""},588,null,null,null,null,null,"-",null,null," : "]
[null,{"$f":"IF($B$7=0,\"\",IF(OR($B$7=0,QUOTIENT($C597-1,$B$7)+1>MAX($K$6,Planning!$E$3)),\"\",IF(OR($C597>$C$7,MOD($C597-1,$B$7)>0),\"\",QUOTIENT($C597-1,$B$7)+1)))","v":""},589,null,null,null,null,null,"-",null,null," : "]
[null,{"$f":"IF($B$7=0,\"\",IF(OR($B$7=0,QUOTIENT($C598-1,$B$7)+1>MAX($K$6,Planning!$E$3)),\"\",IF(OR($C598>$C$7,MOD($C598-1,$B$7)>0),\"\",QUOTIENT($C598-1,$B$7)+1)))","v":""},590,null,null,null,null,null,"-",null,null," : "]
[null,{"$f":"IF($B$7=0,\"\",IF(OR($B$7=0,QUOTIENT($C599-1,$B$7)+1>MAX($K$6,Planning!$E$3)),\"\",IF(OR($C599>$C$7,MOD($C599-1,$B$7)>0),\"\",QUOTIENT($C599-1,$B$7)+1)))","v":""},591,null,null,null,null,null,"-",null,null," : "]
[null,{"$f":"IF($B$7=0,\"\",IF(OR($B$7=0,QUOTIENT($C600-1,$B$7)+1>MAX($K$6,Planning!$E$3)),\"\",IF(OR($C600>$C$7,MOD($C600-1,$B$7)>0),\"\",QUOTIENT($C600-1,$B$7)+1)))","v":""},592,null,null,null,null,null,"-",null,null," : "]
[null,{"$f":"IF($B$7=0,\"\",IF(OR($B$7=0,QUOTIENT($C601-1,$B$7)+1>MAX($K$6,Planning!$E$3)),\"\",IF(OR($C601>$C$7,MOD($C601-1,$B$7)>0),\"\",QUOTIENT($C601-1,$B$7)+1)))","v":""},593,null,null,null,null,null,"-",null,null," : "]
[null,{"$f":"IF($B$7=0,\"\",IF(OR($B$7=0,QUOTIENT($C602-1,$B$7)+1>MAX($K$6,Planning!$E$3)),\"\",IF(OR($C602>$C$7,MOD($C602-1,$B$7)>0),\"\",QUOTIENT($C602-1,$B$7)+1)))","v":""},594,null,null,null,null,null,"-",null,null," : "]
[null,{"$f":"IF($B$7=0,\"\",IF(OR($B$7=0,QUOTIENT($C603-1,$B$7)+1>MAX($K$6,Planning!$E$3)),\"\",IF(OR($C603>$C$7,MOD($C603-1,$B$7)>0),\"\",QUOTIENT($C603-1,$B$7)+1)))","v":""},595,null,null,null,null,null,"-",null,null," : "]
[null,{"$f":"IF($B$7=0,\"\",IF(OR($B$7=0,QUOTIENT($C604-1,$B$7)+1>MAX($K$6,Planning!$E$3)),\"\",IF(OR($C604>$C$7,MOD($C604-1,$B$7)>0),\"\",QUOTIENT($C604-1,$B$7)+1)))","v":""},596,null,null,null,null,null,"-",null,null," : "]
[null,{"$f":"IF($B$7=0,\"\",IF(OR($B$7=0,QUOTIENT($C605-1,$B$7)+1>MAX($K$6,Planning!$E$3)),\"\",IF(OR($C605>$C$7,MOD($C605-1,$B$7)>0),\"\",QUOTIENT($C605-1,$B$7)+1)))","v":""},597,null,null,null,null,null,"-",null,null," : "]
[null,{"$f":"IF($B$7=0,\"\",IF(OR($B$7=0,QUOTIENT($C606-1,$B$7)+1>MAX($K$6,Planning!$E$3)),\"\",IF(OR($C606>$C$7,MOD($C606-1,$B$7)>0),\"\",QUOTIENT($C606-1,$B$7)+1)))","v":""},598,null,null,null,null,null,"-",null,null," : "]
[null,{"$f":"IF($B$7=0,\"\",IF(OR($B$7=0,QUOTIENT($C607-1,$B$7)+1>MAX($K$6,Planning!$E$3)),\"\",IF(OR($C607>$C$7,MOD($C607-1,$B$7)>0),\"\",QUOTIENT($C607-1,$B$7)+1)))","v":""},599,null,null,null,null,null,"-",null,null," : "]
[null,{"$f":"IF($B$7=0,\"\",IF(OR($B$7=0,QUOTIENT($C608-1,$B$7)+1>MAX($K$6,Planning!$E$3)),\"\",IF(OR($C608>$C$7,MOD($C608-1,$B$7)>0),\"\",QUOTIENT($C608-1,$B$7)+1)))","v":""},600,null,null,null,null,null,"-",null,null," : "]
[null,{"$f":"IF($B$7=0,\"\",IF(OR($B$7=0,QUOTIENT($C609-1,$B$7)+1>MAX($K$6,Planning!$E$3)),\"\",IF(OR($C609>$C$7,MOD($C609-1,$B$7)>0),\"\",QUOTIENT($C609-1,$B$7)+1)))","v":""},601,null,null,null,null,null,"-",null,null," : "]
[null,{"$f":"IF($B$7=0,\"\",IF(OR($B$7=0,QUOTIENT($C610-1,$B$7)+1>MAX($K$6,Planning!$E$3)),\"\",IF(OR($C610>$C$7,MOD($C610-1,$B$7)>0),\"\",QUOTIENT($C610-1,$B$7)+1)))","v":""},602,null,null,null,null,null,"-",null,null," : "]
[null,{"$f":"IF($B$7=0,\"\",IF(OR($B$7=0,QUOTIENT($C611-1,$B$7)+1>MAX($K$6,Planning!$E$3)),\"\",IF(OR($C611>$C$7,MOD($C611-1,$B$7)>0),\"\",QUOTIENT($C611-1,$B$7)+1)))","v":""},603,null,null,null,null,null,"-",null,null," : "]
[null,{"$f":"IF($B$7=0,\"\",IF(OR($B$7=0,QUOTIENT($C612-1,$B$7)+1>MAX($K$6,Planning!$E$3)),\"\",IF(OR($C612>$C$7,MOD($C612-1,$B$7)>0),\"\",QUOTIENT($C612-1,$B$7)+1)))","v":""},604,null,null,null,null,null,"-",null,null," : "]
[null,{"$f":"IF($B$7=0,\"\",IF(OR($B$7=0,QUOTIENT($C613-1,$B$7)+1>MAX($K$6,Planning!$E$3)),\"\",IF(OR($C613>$C$7,MOD($C613-1,$B$7)>0),\"\",QUOTIENT($C613-1,$B$7)+1)))","v":""},605,null,null,null,null,null,"-",null,null," : "]
[null,{"$f":"IF($B$7=0,\"\",IF(OR($B$7=0,QUOTIENT($C614-1,$B$7)+1>MAX($K$6,Planning!$E$3)),\"\",IF(OR($C614>$C$7,MOD($C614-1,$B$7)>0),\"\",QUOTIENT($C614-1,$B$7)+1)))","v":""},606,null,null,null,null,null,"-",null,null," : "]
[null,{"$f":"IF($B$7=0,\"\",IF(OR($B$7=0,QUOTIENT($C615-1,$B$7)+1>MAX($K$6,Planning!$E$3)),\"\",IF(OR($C615>$C$7,MOD($C615-1,$B$7)>0),\"\",QUOTIENT($C615-1,$B$7)+1)))","v":""},607,null,null,null,null,null,"-",null,null," : "]
[null,{"$f":"IF($B$7=0,\"\",IF(OR($B$7=0,QUOTIENT($C616-1,$B$7)+1>MAX($K$6,Planning!$E$3)),\"\",IF(OR($C616>$C$7,MOD($C616-1,$B$7)>0),\"\",QUOTIENT($C616-1,$B$7)+1)))","v":""},608,null,null,null,null,null,"-",null,null," : "]
[null,{"$f":"IF($B$7=0,\"\",IF(OR($B$7=0,QUOTIENT($C617-1,$B$7)+1>MAX($K$6,Planning!$E$3)),\"\",IF(OR($C617>$C$7,MOD($C617-1,$B$7)>0),\"\",QUOTIENT($C617-1,$B$7)+1)))","v":""},609,null,null,null,null,null,"-",null,null," : "]
[null,{"$f":"IF($B$7=0,\"\",IF(OR($B$7=0,QUOTIENT($C618-1,$B$7)+1>MAX($K$6,Planning!$E$3)),\"\",IF(OR($C618>$C$7,MOD($C618-1,$B$7)>0),\"\",QUOTIENT($C618-1,$B$7)+1)))","v":""},610,null,null,null,null,null,"-",null,null," : "]
[null,{"$f":"IF($B$7=0,\"\",IF(OR($B$7=0,QUOTIENT($C619-1,$B$7)+1>MAX($K$6,Planning!$E$3)),\"\",IF(OR($C619>$C$7,MOD($C619-1,$B$7)>0),\"\",QUOTIENT($C619-1,$B$7)+1)))","v":""},611,null,null,null,null,null,"-",null,null," : "]
[null,{"$f":"IF($B$7=0,\"\",IF(OR($B$7=0,QUOTIENT($C620-1,$B$7)+1>MAX($K$6,Planning!$E$3)),\"\",IF(OR($C620>$C$7,MOD($C620-1,$B$7)>0),\"\",QUOTIENT($C620-1,$B$7)+1)))","v":""},612,null,null,null,null,null,"-",null,null," : "]
[null,{"$f":"IF($B$7=0,\"\",IF(OR($B$7=0,QUOTIENT($C621-1,$B$7)+1>MAX($K$6,Planning!$E$3)),\"\",IF(OR($C621>$C$7,MOD($C621-1,$B$7)>0),\"\",QUOTIENT($C621-1,$B$7)+1)))","v":""},613,null,null,null,null,null,"-",null,null," : "]
[null,{"$f":"IF($B$7=0,\"\",IF(OR($B$7=0,QUOTIENT($C622-1,$B$7)+1>MAX($K$6,Planning!$E$3)),\"\",IF(OR($C622>$C$7,MOD($C622-1,$B$7)>0),\"\",QUOTIENT($C622-1,$B$7)+1)))","v":""},614,null,null,null,null,null,"-",null,null," : "]
[null,{"$f":"IF($B$7=0,\"\",IF(OR($B$7=0,QUOTIENT($C623-1,$B$7)+1>MAX($K$6,Planning!$E$3)),\"\",IF(OR($C623>$C$7,MOD($C623-1,$B$7)>0),\"\",QUOTIENT($C623-1,$B$7)+1)))","v":""},615,null,null,null,null,null,"-",null,null," : "]
[null,{"$f":"IF($B$7=0,\"\",IF(OR($B$7=0,QUOTIENT($C624-1,$B$7)+1>MAX($K$6,Planning!$E$3)),\"\",IF(OR($C624>$C$7,MOD($C624-1,$B$7)>0),\"\",QUOTIENT($C624-1,$B$7)+1)))","v":""},616,null,null,null,null,null,"-",null,null," : "]
[null,{"$f":"IF($B$7=0,\"\",IF(OR($B$7=0,QUOTIENT($C625-1,$B$7)+1>MAX($K$6,Planning!$E$3)),\"\",IF(OR($C625>$C$7,MOD($C625-1,$B$7)>0),\"\",QUOTIENT($C625-1,$B$7)+1)))","v":""},617,null,null,null,null,null,"-",null,null," : "]
[null,{"$f":"IF($B$7=0,\"\",IF(OR($B$7=0,QUOTIENT($C626-1,$B$7)+1>MAX($K$6,Planning!$E$3)),\"\",IF(OR($C626>$C$7,MOD($C626-1,$B$7)>0),\"\",QUOTIENT($C626-1,$B$7)+1)))","v":""},618,null,null,null,null,null,"-",null,null," : "]
[null,{"$f":"IF($B$7=0,\"\",IF(OR($B$7=0,QUOTIENT($C627-1,$B$7)+1>MAX($K$6,Planning!$E$3)),\"\",IF(OR($C627>$C$7,MOD($C627-1,$B$7)>0),\"\",QUOTIENT($C627-1,$B$7)+1)))","v":""},619,null,null,null,null,null,"-",null,null," : "]
[null,{"$f":"IF($B$7=0,\"\",IF(OR($B$7=0,QUOTIENT($C628-1,$B$7)+1>MAX($K$6,Planning!$E$3)),\"\",IF(OR($C628>$C$7,MOD($C628-1,$B$7)>0),\"\",QUOTIENT($C628-1,$B$7)+1)))","v":""},620,null,null,null,null,null,"-",null,null," : "]
[null,{"$f":"IF($B$7=0,\"\",IF(OR($B$7=0,QUOTIENT($C629-1,$B$7)+1>MAX($K$6,Planning!$E$3)),\"\",IF(OR($C629>$C$7,MOD($C629-1,$B$7)>0),\"\",QUOTIENT($C629-1,$B$7)+1)))","v":""},621,null,null,null,null,null,"-",null,null," : "]
[null,{"$f":"IF($B$7=0,\"\",IF(OR($B$7=0,QUOTIENT($C630-1,$B$7)+1>MAX($K$6,Planning!$E$3)),\"\",IF(OR($C630>$C$7,MOD($C630-1,$B$7)>0),\"\",QUOTIENT($C630-1,$B$7)+1)))","v":""},622,null,null,null,null,null,"-",null,null," : "]
[null,{"$f":"IF($B$7=0,\"\",IF(OR($B$7=0,QUOTIENT($C631-1,$B$7)+1>MAX($K$6,Planning!$E$3)),\"\",IF(OR($C631>$C$7,MOD($C631-1,$B$7)>0),\"\",QUOTIENT($C631-1,$B$7)+1)))","v":""},623,null,null,null,null,null,"-",null,null," : "]
[null,{"$f":"IF($B$7=0,\"\",IF(OR($B$7=0,QUOTIENT($C632-1,$B$7)+1>MAX($K$6,Planning!$E$3)),\"\",IF(OR($C632>$C$7,MOD($C632-1,$B$7)>0),\"\",QUOTIENT($C632-1,$B$7)+1)))","v":""},624,null,null,null,null,null,"-",null,null," : "]
[null,{"$f":"IF($B$7=0,\"\",IF(OR($B$7=0,QUOTIENT($C633-1,$B$7)+1>MAX($K$6,Planning!$E$3)),\"\",IF(OR($C633>$C$7,MOD($C633-1,$B$7)>0),\"\",QUOTIENT($C633-1,$B$7)+1)))","v":""},625,null,null,null,null,null,"-",null,null," : "]
[null,{"$f":"IF($B$7=0,\"\",IF(OR($B$7=0,QUOTIENT($C634-1,$B$7)+1>MAX($K$6,Planning!$E$3)),\"\",IF(OR($C634>$C$7,MOD($C634-1,$B$7)>0),\"\",QUOTIENT($C634-1,$B$7)+1)))","v":""},626,null,null,null,null,null,"-",null,null," : "]
[null,{"$f":"IF($B$7=0,\"\",IF(OR($B$7=0,QUOTIENT($C635-1,$B$7)+1>MAX($K$6,Planning!$E$3)),\"\",IF(OR($C635>$C$7,MOD($C635-1,$B$7)>0),\"\",QUOTIENT($C635-1,$B$7)+1)))","v":""},627,null,null,null,null,null,"-",null,null," : "]
[null,{"$f":"IF($B$7=0,\"\",IF(OR($B$7=0,QUOTIENT($C636-1,$B$7)+1>MAX($K$6,Planning!$E$3)),\"\",IF(OR($C636>$C$7,MOD($C636-1,$B$7)>0),\"\",QUOTIENT($C636-1,$B$7)+1)))","v":""},628,null,null,null,null,null,"-",null,null," : "]
[null,{"$f":"IF($B$7=0,\"\",IF(OR($B$7=0,QUOTIENT($C637-1,$B$7)+1>MAX($K$6,Planning!$E$3)),\"\",IF(OR($C637>$C$7,MOD($C637-1,$B$7)>0),\"\",QUOTIENT($C637-1,$B$7)+1)))","v":""},629,null,null,null,null,null,"-",null,null," : "]
[null,{"$f":"IF($B$7=0,\"\",IF(OR($B$7=0,QUOTIENT($C638-1,$B$7)+1>MAX($K$6,Planning!$E$3)),\"\",IF(OR($C638>$C$7,MOD($C638-1,$B$7)>0),\"\",QUOTIENT($C638-1,$B$7)+1)))","v":""},630,null,null,null,null,null,"-",null,null," : "]
[null,{"$f":"IF($B$7=0,\"\",IF(OR($B$7=0,QUOTIENT($C639-1,$B$7)+1>MAX($K$6,Planning!$E$3)),\"\",IF(OR($C639>$C$7,MOD($C639-1,$B$7)>0),\"\",QUOTIENT($C639-1,$B$7)+1)))","v":""},631,null,null,null,null,null,"-",null,null," : "]
[null,{"$f":"IF($B$7=0,\"\",IF(OR($B$7=0,QUOTIENT($C640-1,$B$7)+1>MAX($K$6,Planning!$E$3)),\"\",IF(OR($C640>$C$7,MOD($C640-1,$B$7)>0),\"\",QUOTIENT($C640-1,$B$7)+1)))","v":""},632,null,null,null,null,null,"-",null,null," : "]
[null,{"$f":"IF($B$7=0,\"\",IF(OR($B$7=0,QUOTIENT($C641-1,$B$7)+1>MAX($K$6,Planning!$E$3)),\"\",IF(OR($C641>$C$7,MOD($C641-1,$B$7)>0),\"\",QUOTIENT($C641-1,$B$7)+1)))","v":""},633,null,null,null,null,null,"-",null,null," : "]
[null,{"$f":"IF($B$7=0,\"\",IF(OR($B$7=0,QUOTIENT($C642-1,$B$7)+1>MAX($K$6,Planning!$E$3)),\"\",IF(OR($C642>$C$7,MOD($C642-1,$B$7)>0),\"\",QUOTIENT($C642-1,$B$7)+1)))","v":""},634,null,null,null,null,null,"-",null,null," : "]
[null,{"$f":"IF($B$7=0,\"\",IF(OR($B$7=0,QUOTIENT($C643-1,$B$7)+1>MAX($K$6,Planning!$E$3)),\"\",IF(OR($C643>$C$7,MOD($C643-1,$B$7)>0),\"\",QUOTIENT($C643-1,$B$7)+1)))","v":""},635,null,null,null,null,null,"-",null,null," : "]
[null,{"$f":"IF($B$7=0,\"\",IF(OR($B$7=0,QUOTIENT($C644-1,$B$7)+1>MAX($K$6,Planning!$E$3)),\"\",IF(OR($C644>$C$7,MOD($C644-1,$B$7)>0),\"\",QUOTIENT($C644-1,$B$7)+1)))","v":""},636,null,null,null,null,null,"-",null,null," : "]
[null,{"$f":"IF($B$7=0,\"\",IF(OR($B$7=0,QUOTIENT($C645-1,$B$7)+1>MAX($K$6,Planning!$E$3)),\"\",IF(OR($C645>$C$7,MOD($C645-1,$B$7)>0),\"\",QUOTIENT($C645-1,$B$7)+1)))","v":""},637,null,null,null,null,null,"-",null,null," : "]
[null,{"$f":"IF($B$7=0,\"\",IF(OR($B$7=0,QUOTIENT($C646-1,$B$7)+1>MAX($K$6,Planning!$E$3)),\"\",IF(OR($C646>$C$7,MOD($C646-1,$B$7)>0),\"\",QUOTIENT($C646-1,$B$7)+1)))","v":""},638,null,null,null,null,null,"-",null,null," : "]
[null,{"$f":"IF($B$7=0,\"\",IF(OR($B$7=0,QUOTIENT($C647-1,$B$7)+1>MAX($K$6,Planning!$E$3)),\"\",IF(OR($C647>$C$7,MOD($C647-1,$B$7)>0),\"\",QUOTIENT($C647-1,$B$7)+1)))","v":""},639,null,null,null,null,null,"-",null,null," : "]
[null,{"$f":"IF($B$7=0,\"\",IF(OR($B$7=0,QUOTIENT($C648-1,$B$7)+1>MAX($K$6,Planning!$E$3)),\"\",IF(OR($C648>$C$7,MOD($C648-1,$B$7)>0),\"\",QUOTIENT($C648-1,$B$7)+1)))","v":""},640,null,null,null,null,null,"-",null,null," : "]
[null,{"$f":"IF($B$7=0,\"\",IF(OR($B$7=0,QUOTIENT($C649-1,$B$7)+1>MAX($K$6,Planning!$E$3)),\"\",IF(OR($C649>$C$7,MOD($C649-1,$B$7)>0),\"\",QUOTIENT($C649-1,$B$7)+1)))","v":""},641,null,null,null,null,null,"-",null,null," : "]
[null,{"$f":"IF($B$7=0,\"\",IF(OR($B$7=0,QUOTIENT($C650-1,$B$7)+1>MAX($K$6,Planning!$E$3)),\"\",IF(OR($C650>$C$7,MOD($C650-1,$B$7)>0),\"\",QUOTIENT($C650-1,$B$7)+1)))","v":""},642,null,null,null,null,null,"-",null,null," : "]
[null,{"$f":"IF($B$7=0,\"\",IF(OR($B$7=0,QUOTIENT($C651-1,$B$7)+1>MAX($K$6,Planning!$E$3)),\"\",IF(OR($C651>$C$7,MOD($C651-1,$B$7)>0),\"\",QUOTIENT($C651-1,$B$7)+1)))","v":""},643,null,null,null,null,null,"-",null,null," : "]
[null,{"$f":"IF($B$7=0,\"\",IF(OR($B$7=0,QUOTIENT($C652-1,$B$7)+1>MAX($K$6,Planning!$E$3)),\"\",IF(OR($C652>$C$7,MOD($C652-1,$B$7)>0),\"\",QUOTIENT($C652-1,$B$7)+1)))","v":""},644,null,null,null,null,null,"-",null,null," : "]
[null,{"$f":"IF($B$7=0,\"\",IF(OR($B$7=0,QUOTIENT($C653-1,$B$7)+1>MAX($K$6,Planning!$E$3)),\"\",IF(OR($C653>$C$7,MOD($C653-1,$B$7)>0),\"\",QUOTIENT($C653-1,$B$7)+1)))","v":""},645,null,null,null,null,null,"-",null,null," : "]
[null,{"$f":"IF($B$7=0,\"\",IF(OR($B$7=0,QUOTIENT($C654-1,$B$7)+1>MAX($K$6,Planning!$E$3)),\"\",IF(OR($C654>$C$7,MOD($C654-1,$B$7)>0),\"\",QUOTIENT($C654-1,$B$7)+1)))","v":""},646,null,null,null,null,null,"-",null,null," : "]
[null,{"$f":"IF($B$7=0,\"\",IF(OR($B$7=0,QUOTIENT($C655-1,$B$7)+1>MAX($K$6,Planning!$E$3)),\"\",IF(OR($C655>$C$7,MOD($C655-1,$B$7)>0),\"\",QUOTIENT($C655-1,$B$7)+1)))","v":""},647,null,null,null,null,null,"-",null,null," : "]
[null,{"$f":"IF($B$7=0,\"\",IF(OR($B$7=0,QUOTIENT($C656-1,$B$7)+1>MAX($K$6,Planning!$E$3)),\"\",IF(OR($C656>$C$7,MOD($C656-1,$B$7)>0),\"\",QUOTIENT($C656-1,$B$7)+1)))","v":""},648,null,null,null,null,null,"-",null,null," : "]
[null,{"$f":"IF($B$7=0,\"\",IF(OR($B$7=0,QUOTIENT($C657-1,$B$7)+1>MAX($K$6,Planning!$E$3)),\"\",IF(OR($C657>$C$7,MOD($C657-1,$B$7)>0),\"\",QUOTIENT($C657-1,$B$7)+1)))","v":""},649,null,null,null,null,null,"-",null,null," : "]
[null,{"$f":"IF($B$7=0,\"\",IF(OR($B$7=0,QUOTIENT($C658-1,$B$7)+1>MAX($K$6,Planning!$E$3)),\"\",IF(OR($C658>$C$7,MOD($C658-1,$B$7)>0),\"\",QUOTIENT($C658-1,$B$7)+1)))","v":""},650,null,null,null,null,null,"-",null,null," : "]
[null,{"$f":"IF($B$7=0,\"\",IF(OR($B$7=0,QUOTIENT($C659-1,$B$7)+1>MAX($K$6,Planning!$E$3)),\"\",IF(OR($C659>$C$7,MOD($C659-1,$B$7)>0),\"\",QUOTIENT($C659-1,$B$7)+1)))","v":""},651,null,null,null,null,null,"-",null,null," : "]
[null,{"$f":"IF($B$7=0,\"\",IF(OR($B$7=0,QUOTIENT($C660-1,$B$7)+1>MAX($K$6,Planning!$E$3)),\"\",IF(OR($C660>$C$7,MOD($C660-1,$B$7)>0),\"\",QUOTIENT($C660-1,$B$7)+1)))","v":""},652,null,null,null,null,null,"-",null,null," : "]
[null,{"$f":"IF($B$7=0,\"\",IF(OR($B$7=0,QUOTIENT($C661-1,$B$7)+1>MAX($K$6,Planning!$E$3)),\"\",IF(OR($C661>$C$7,MOD($C661-1,$B$7)>0),\"\",QUOTIENT($C661-1,$B$7)+1)))","v":""},653,null,null,null,null,null,"-",null,null," : "]
[null,{"$f":"IF($B$7=0,\"\",IF(OR($B$7=0,QUOTIENT($C662-1,$B$7)+1>MAX($K$6,Planning!$E$3)),\"\",IF(OR($C662>$C$7,MOD($C662-1,$B$7)>0),\"\",QUOTIENT($C662-1,$B$7)+1)))","v":""},654,null,null,null,null,null,"-",null,null," : "]
[null,{"$f":"IF($B$7=0,\"\",IF(OR($B$7=0,QUOTIENT($C663-1,$B$7)+1>MAX($K$6,Planning!$E$3)),\"\",IF(OR($C663>$C$7,MOD($C663-1,$B$7)>0),\"\",QUOTIENT($C663-1,$B$7)+1)))","v":""},655,null,null,null,null,null,"-",null,null," : "]
[null,{"$f":"IF($B$7=0,\"\",IF(OR($B$7=0,QUOTIENT($C664-1,$B$7)+1>MAX($K$6,Planning!$E$3)),\"\",IF(OR($C664>$C$7,MOD($C664-1,$B$7)>0),\"\",QUOTIENT($C664-1,$B$7)+1)))","v":""},656,null,null,null,null,null,"-",null,null," : "]
[null,{"$f":"IF($B$7=0,\"\",IF(OR($B$7=0,QUOTIENT($C665-1,$B$7)+1>MAX($K$6,Planning!$E$3)),\"\",IF(OR($C665>$C$7,MOD($C665-1,$B$7)>0),\"\",QUOTIENT($C665-1,$B$7)+1)))","v":""},657,null,null,null,null,null,"-",null,null," : "]
[null,{"$f":"IF($B$7=0,\"\",IF(OR($B$7=0,QUOTIENT($C666-1,$B$7)+1>MAX($K$6,Planning!$E$3)),\"\",IF(OR($C666>$C$7,MOD($C666-1,$B$7)>0),\"\",QUOTIENT($C666-1,$B$7)+1)))","v":""},658,null,null,null,null,null,"-",null,null," : "]
[null,{"$f":"IF($B$7=0,\"\",IF(OR($B$7=0,QUOTIENT($C667-1,$B$7)+1>MAX($K$6,Planning!$E$3)),\"\",IF(OR($C667>$C$7,MOD($C667-1,$B$7)>0),\"\",QUOTIENT($C667-1,$B$7)+1)))","v":""},659,null,null,null,null,null,"-",null,null," : "]
[null,{"$f":"IF($B$7=0,\"\",IF(OR($B$7=0,QUOTIENT($C668-1,$B$7)+1>MAX($K$6,Planning!$E$3)),\"\",IF(OR($C668>$C$7,MOD($C668-1,$B$7)>0),\"\",QUOTIENT($C668-1,$B$7)+1)))","v":""},660,null,null,null,null,null,"-",null,null," : "]
[null,{"$f":"IF($B$7=0,\"\",IF(OR($B$7=0,QUOTIENT($C669-1,$B$7)+1>MAX($K$6,Planning!$E$3)),\"\",IF(OR($C669>$C$7,MOD($C669-1,$B$7)>0),\"\",QUOTIENT($C669-1,$B$7)+1)))","v":""},661,null,null,null,null,null,"-",null,null," : "]
[null,{"$f":"IF($B$7=0,\"\",IF(OR($B$7=0,QUOTIENT($C670-1,$B$7)+1>MAX($K$6,Planning!$E$3)),\"\",IF(OR($C670>$C$7,MOD($C670-1,$B$7)>0),\"\",QUOTIENT($C670-1,$B$7)+1)))","v":""},662,null,null,null,null,null,"-",null,null," : "]
[null,{"$f":"IF($B$7=0,\"\",IF(OR($B$7=0,QUOTIENT($C671-1,$B$7)+1>MAX($K$6,Planning!$E$3)),\"\",IF(OR($C671>$C$7,MOD($C671-1,$B$7)>0),\"\",QUOTIENT($C671-1,$B$7)+1)))","v":""},663,null,null,null,null,null,"-",null,null," : "]
[null,{"$f":"IF($B$7=0,\"\",IF(OR($B$7=0,QUOTIENT($C672-1,$B$7)+1>MAX($K$6,Planning!$E$3)),\"\",IF(OR($C672>$C$7,MOD($C672-1,$B$7)>0),\"\",QUOTIENT($C672-1,$B$7)+1)))","v":""},664,null,null,null,null,null,"-",null,null," : "]
[null,{"$f":"IF($B$7=0,\"\",IF(OR($B$7=0,QUOTIENT($C673-1,$B$7)+1>MAX($K$6,Planning!$E$3)),\"\",IF(OR($C673>$C$7,MOD($C673-1,$B$7)>0),\"\",QUOTIENT($C673-1,$B$7)+1)))","v":""},665,null,null,null,null,null,"-",null,null," : "]
[null,{"$f":"IF($B$7=0,\"\",IF(OR($B$7=0,QUOTIENT($C674-1,$B$7)+1>MAX($K$6,Planning!$E$3)),\"\",IF(OR($C674>$C$7,MOD($C674-1,$B$7)>0),\"\",QUOTIENT($C674-1,$B$7)+1)))","v":""},666,null,null,null,null,null,"-",null,null," : "]
[null,{"$f":"IF($B$7=0,\"\",IF(OR($B$7=0,QUOTIENT($C675-1,$B$7)+1>MAX($K$6,Planning!$E$3)),\"\",IF(OR($C675>$C$7,MOD($C675-1,$B$7)>0),\"\",QUOTIENT($C675-1,$B$7)+1)))","v":""},667,null,null,null,null,null,"-",null,null," : "]
[null,{"$f":"IF($B$7=0,\"\",IF(OR($B$7=0,QUOTIENT($C676-1,$B$7)+1>MAX($K$6,Planning!$E$3)),\"\",IF(OR($C676>$C$7,MOD($C676-1,$B$7)>0),\"\",QUOTIENT($C676-1,$B$7)+1)))","v":""},668,null,null,null,null,null,"-",null,null," : "]
[null,{"$f":"IF($B$7=0,\"\",IF(OR($B$7=0,QUOTIENT($C677-1,$B$7)+1>MAX($K$6,Planning!$E$3)),\"\",IF(OR($C677>$C$7,MOD($C677-1,$B$7)>0),\"\",QUOTIENT($C677-1,$B$7)+1)))","v":""},669,null,null,null,null,null,"-",null,null," : "]
[null,{"$f":"IF($B$7=0,\"\",IF(OR($B$7=0,QUOTIENT($C678-1,$B$7)+1>MAX($K$6,Planning!$E$3)),\"\",IF(OR($C678>$C$7,MOD($C678-1,$B$7)>0),\"\",QUOTIENT($C678-1,$B$7)+1)))","v":""},670,null,null,null,null,null,"-",null,null," : "]
[null,{"$f":"IF($B$7=0,\"\",IF(OR($B$7=0,QUOTIENT($C679-1,$B$7)+1>MAX($K$6,Planning!$E$3)),\"\",IF(OR($C679>$C$7,MOD($C679-1,$B$7)>0),\"\",QUOTIENT($C679-1,$B$7)+1)))","v":""},671,null,null,null,null,null,"-",null,null," : "]
[null,{"$f":"IF($B$7=0,\"\",IF(OR($B$7=0,QUOTIENT($C680-1,$B$7)+1>MAX($K$6,Planning!$E$3)),\"\",IF(OR($C680>$C$7,MOD($C680-1,$B$7)>0),\"\",QUOTIENT($C680-1,$B$7)+1)))","v":""},672,null,null,null,null,null,"-",null,null," : "]
[null,{"$f":"IF($B$7=0,\"\",IF(OR($B$7=0,QUOTIENT($C681-1,$B$7)+1>MAX($K$6,Planning!$E$3)),\"\",IF(OR($C681>$C$7,MOD($C681-1,$B$7)>0),\"\",QUOTIENT($C681-1,$B$7)+1)))","v":""},673,null,null,null,null,null,"-",null,null," : "]
[null,{"$f":"IF($B$7=0,\"\",IF(OR($B$7=0,QUOTIENT($C682-1,$B$7)+1>MAX($K$6,Planning!$E$3)),\"\",IF(OR($C682>$C$7,MOD($C682-1,$B$7)>0),\"\",QUOTIENT($C682-1,$B$7)+1)))","v":""},674,null,null,null,null,null,"-",null,null," : "]
[null,{"$f":"IF($B$7=0,\"\",IF(OR($B$7=0,QUOTIENT($C683-1,$B$7)+1>MAX($K$6,Planning!$E$3)),\"\",IF(OR($C683>$C$7,MOD($C683-1,$B$7)>0),\"\",QUOTIENT($C683-1,$B$7)+1)))","v":""},675,null,null,null,null,null,"-",null,null," : "]
[null,{"$f":"IF($B$7=0,\"\",IF(OR($B$7=0,QUOTIENT($C684-1,$B$7)+1>MAX($K$6,Planning!$E$3)),\"\",IF(OR($C684>$C$7,MOD($C684-1,$B$7)>0),\"\",QUOTIENT($C684-1,$B$7)+1)))","v":""},676,null,null,null,null,null,"-",null,null," : "]
[null,{"$f":"IF($B$7=0,\"\",IF(OR($B$7=0,QUOTIENT($C685-1,$B$7)+1>MAX($K$6,Planning!$E$3)),\"\",IF(OR($C685>$C$7,MOD($C685-1,$B$7)>0),\"\",QUOTIENT($C685-1,$B$7)+1)))","v":""},677,null,null,null,null,null,"-",null,null," : "]
[null,{"$f":"IF($B$7=0,\"\",IF(OR($B$7=0,QUOTIENT($C686-1,$B$7)+1>MAX($K$6,Planning!$E$3)),\"\",IF(OR($C686>$C$7,MOD($C686-1,$B$7)>0),\"\",QUOTIENT($C686-1,$B$7)+1)))","v":""},678,null,null,null,null,null,"-",null,null," : "]
[null,{"$f":"IF($B$7=0,\"\",IF(OR($B$7=0,QUOTIENT($C687-1,$B$7)+1>MAX($K$6,Planning!$E$3)),\"\",IF(OR($C687>$C$7,MOD($C687-1,$B$7)>0),\"\",QUOTIENT($C687-1,$B$7)+1)))","v":""},679,null,null,null,null,null,"-",null,null," : "]
[null,{"$f":"IF($B$7=0,\"\",IF(OR($B$7=0,QUOTIENT($C688-1,$B$7)+1>MAX($K$6,Planning!$E$3)),\"\",IF(OR($C688>$C$7,MOD($C688-1,$B$7)>0),\"\",QUOTIENT($C688-1,$B$7)+1)))","v":""},680,null,null,null,null,null,"-",null,null," : "]
[null,{"$f":"IF($B$7=0,\"\",IF(OR($B$7=0,QUOTIENT($C689-1,$B$7)+1>MAX($K$6,Planning!$E$3)),\"\",IF(OR($C689>$C$7,MOD($C689-1,$B$7)>0),\"\",QUOTIENT($C689-1,$B$7)+1)))","v":""},681,null,null,null,null,null,"-",null,null," : "]
[null,{"$f":"IF($B$7=0,\"\",IF(OR($B$7=0,QUOTIENT($C690-1,$B$7)+1>MAX($K$6,Planning!$E$3)),\"\",IF(OR($C690>$C$7,MOD($C690-1,$B$7)>0),\"\",QUOTIENT($C690-1,$B$7)+1)))","v":""},682,null,null,null,null,null,"-",null,null," : "]
[null,{"$f":"IF($B$7=0,\"\",IF(OR($B$7=0,QUOTIENT($C691-1,$B$7)+1>MAX($K$6,Planning!$E$3)),\"\",IF(OR($C691>$C$7,MOD($C691-1,$B$7)>0),\"\",QUOTIENT($C691-1,$B$7)+1)))","v":""},683,null,null,null,null,null,"-",null,null," : "]
[null,{"$f":"IF($B$7=0,\"\",IF(OR($B$7=0,QUOTIENT($C692-1,$B$7)+1>MAX($K$6,Planning!$E$3)),\"\",IF(OR($C692>$C$7,MOD($C692-1,$B$7)>0),\"\",QUOTIENT($C692-1,$B$7)+1)))","v":""},684,null,null,null,null,null,"-",null,null," : "]
[null,{"$f":"IF($B$7=0,\"\",IF(OR($B$7=0,QUOTIENT($C693-1,$B$7)+1>MAX($K$6,Planning!$E$3)),\"\",IF(OR($C693>$C$7,MOD($C693-1,$B$7)>0),\"\",QUOTIENT($C693-1,$B$7)+1)))","v":""},685,null,null,null,null,null,"-",null,null," : "]
[null,{"$f":"IF($B$7=0,\"\",IF(OR($B$7=0,QUOTIENT($C694-1,$B$7)+1>MAX($K$6,Planning!$E$3)),\"\",IF(OR($C694>$C$7,MOD($C694-1,$B$7)>0),\"\",QUOTIENT($C694-1,$B$7)+1)))","v":""},686,null,null,null,null,null,"-",null,null," : "]
[null,{"$f":"IF($B$7=0,\"\",IF(OR($B$7=0,QUOTIENT($C695-1,$B$7)+1>MAX($K$6,Planning!$E$3)),\"\",IF(OR($C695>$C$7,MOD($C695-1,$B$7)>0),\"\",QUOTIENT($C695-1,$B$7)+1)))","v":""},687,null,null,null,null,null,"-",null,null," : "]
[null,{"$f":"IF($B$7=0,\"\",IF(OR($B$7=0,QUOTIENT($C696-1,$B$7)+1>MAX($K$6,Planning!$E$3)),\"\",IF(OR($C696>$C$7,MOD($C696-1,$B$7)>0),\"\",QUOTIENT($C696-1,$B$7)+1)))","v":""},688,null,null,null,null,null,"-",null,null," : "]
[null,{"$f":"IF($B$7=0,\"\",IF(OR($B$7=0,QUOTIENT($C697-1,$B$7)+1>MAX($K$6,Planning!$E$3)),\"\",IF(OR($C697>$C$7,MOD($C697-1,$B$7)>0),\"\",QUOTIENT($C697-1,$B$7)+1)))","v":""},689,null,null,null,null,null,"-",null,null," : "]
[null,{"$f":"IF($B$7=0,\"\",IF(OR($B$7=0,QUOTIENT($C698-1,$B$7)+1>MAX($K$6,Planning!$E$3)),\"\",IF(OR($C698>$C$7,MOD($C698-1,$B$7)>0),\"\",QUOTIENT($C698-1,$B$7)+1)))","v":""},690,null,null,null,null,null,"-",null,null," : "]
[null,{"$f":"IF($B$7=0,\"\",IF(OR($B$7=0,QUOTIENT($C699-1,$B$7)+1>MAX($K$6,Planning!$E$3)),\"\",IF(OR($C699>$C$7,MOD($C699-1,$B$7)>0),\"\",QUOTIENT($C699-1,$B$7)+1)))","v":""},691,null,null,null,null,null,"-",null,null," : "]
[null,{"$f":"IF($B$7=0,\"\",IF(OR($B$7=0,QUOTIENT($C700-1,$B$7)+1>MAX($K$6,Planning!$E$3)),\"\",IF(OR($C700>$C$7,MOD($C700-1,$B$7)>0),\"\",QUOTIENT($C700-1,$B$7)+1)))","v":""},692,null,null,null,null,null,"-",null,null," : "]
[null,{"$f":"IF($B$7=0,\"\",IF(OR($B$7=0,QUOTIENT($C701-1,$B$7)+1>MAX($K$6,Planning!$E$3)),\"\",IF(OR($C701>$C$7,MOD($C701-1,$B$7)>0),\"\",QUOTIENT($C701-1,$B$7)+1)))","v":""},693,null,null,null,null,null,"-",null,null," : "]
[null,{"$f":"IF($B$7=0,\"\",IF(OR($B$7=0,QUOTIENT($C702-1,$B$7)+1>MAX($K$6,Planning!$E$3)),\"\",IF(OR($C702>$C$7,MOD($C702-1,$B$7)>0),\"\",QUOTIENT($C702-1,$B$7)+1)))","v":""},694,null,null,null,null,null,"-",null,null," : "]
[null,{"$f":"IF($B$7=0,\"\",IF(OR($B$7=0,QUOTIENT($C703-1,$B$7)+1>MAX($K$6,Planning!$E$3)),\"\",IF(OR($C703>$C$7,MOD($C703-1,$B$7)>0),\"\",QUOTIENT($C703-1,$B$7)+1)))","v":""},695,null,null,null,null,null,"-",null,null," : "]
[null,{"$f":"IF($B$7=0,\"\",IF(OR($B$7=0,QUOTIENT($C704-1,$B$7)+1>MAX($K$6,Planning!$E$3)),\"\",IF(OR($C704>$C$7,MOD($C704-1,$B$7)>0),\"\",QUOTIENT($C704-1,$B$7)+1)))","v":""},696,null,null,null,null,null,"-",null,null," : "]
[null,{"$f":"IF($B$7=0,\"\",IF(OR($B$7=0,QUOTIENT($C705-1,$B$7)+1>MAX($K$6,Planning!$E$3)),\"\",IF(OR($C705>$C$7,MOD($C705-1,$B$7)>0),\"\",QUOTIENT($C705-1,$B$7)+1)))","v":""},697,null,null,null,null,null,"-",null,null," : "]
[null,{"$f":"IF($B$7=0,\"\",IF(OR($B$7=0,QUOTIENT($C706-1,$B$7)+1>MAX($K$6,Planning!$E$3)),\"\",IF(OR($C706>$C$7,MOD($C706-1,$B$7)>0),\"\",QUOTIENT($C706-1,$B$7)+1)))","v":""},698,null,null,null,null,null,"-",null,null," : "]
[null,{"$f":"IF($B$7=0,\"\",IF(OR($B$7=0,QUOTIENT($C707-1,$B$7)+1>MAX($K$6,Planning!$E$3)),\"\",IF(OR($C707>$C$7,MOD($C707-1,$B$7)>0),\"\",QUOTIENT($C707-1,$B$7)+1)))","v":""},699,null,null,null,null,null,"-",null,null," : "]
[null,{"$f":"IF($B$7=0,\"\",IF(OR($B$7=0,QUOTIENT($C708-1,$B$7)+1>MAX($K$6,Planning!$E$3)),\"\",IF(OR($C708>$C$7,MOD($C708-1,$B$7)>0),\"\",QUOTIENT($C708-1,$B$7)+1)))","v":""},700,null,null,null,null,null,"-",null,null," : "]
[null,{"$f":"IF($B$7=0,\"\",IF(OR($B$7=0,QUOTIENT($C709-1,$B$7)+1>MAX($K$6,Planning!$E$3)),\"\",IF(OR($C709>$C$7,MOD($C709-1,$B$7)>0),\"\",QUOTIENT($C709-1,$B$7)+1)))","v":""},701,null,null,null,null,null,"-",null,null," : "]
[null,{"$f":"IF($B$7=0,\"\",IF(OR($B$7=0,QUOTIENT($C710-1,$B$7)+1>MAX($K$6,Planning!$E$3)),\"\",IF(OR($C710>$C$7,MOD($C710-1,$B$7)>0),\"\",QUOTIENT($C710-1,$B$7)+1)))","v":""},702,null,null,null,null,null,"-",null,null," : "]
[null,{"$f":"IF($B$7=0,\"\",IF(OR($B$7=0,QUOTIENT($C711-1,$B$7)+1>MAX($K$6,Planning!$E$3)),\"\",IF(OR($C711>$C$7,MOD($C711-1,$B$7)>0),\"\",QUOTIENT($C711-1,$B$7)+1)))","v":""},703,null,null,null,null,null,"-",null,null," : "]
[null,{"$f":"IF($B$7=0,\"\",IF(OR($B$7=0,QUOTIENT($C712-1,$B$7)+1>MAX($K$6,Planning!$E$3)),\"\",IF(OR($C712>$C$7,MOD($C712-1,$B$7)>0),\"\",QUOTIENT($C712-1,$B$7)+1)))","v":""},704,null,null,null,null,null,"-",null,null," : "]
[null,{"$f":"IF($B$7=0,\"\",IF(OR($B$7=0,QUOTIENT($C713-1,$B$7)+1>MAX($K$6,Planning!$E$3)),\"\",IF(OR($C713>$C$7,MOD($C713-1,$B$7)>0),\"\",QUOTIENT($C713-1,$B$7)+1)))","v":""},705,null,null,null,null,null,"-",null,null," : "]
[null,{"$f":"IF($B$7=0,\"\",IF(OR($B$7=0,QUOTIENT($C714-1,$B$7)+1>MAX($K$6,Planning!$E$3)),\"\",IF(OR($C714>$C$7,MOD($C714-1,$B$7)>0),\"\",QUOTIENT($C714-1,$B$7)+1)))","v":""},706,null,null,null,null,null,"-",null,null," : "]
[null,{"$f":"IF($B$7=0,\"\",IF(OR($B$7=0,QUOTIENT($C715-1,$B$7)+1>MAX($K$6,Planning!$E$3)),\"\",IF(OR($C715>$C$7,MOD($C715-1,$B$7)>0),\"\",QUOTIENT($C715-1,$B$7)+1)))","v":""},707,null,null,null,null,null,"-",null,null," : "]
[null,{"$f":"IF($B$7=0,\"\",IF(OR($B$7=0,QUOTIENT($C716-1,$B$7)+1>MAX($K$6,Planning!$E$3)),\"\",IF(OR($C716>$C$7,MOD($C716-1,$B$7)>0),\"\",QUOTIENT($C716-1,$B$7)+1)))","v":""},708,null,null,null,null,null,"-",null,null," : "]
[null,{"$f":"IF($B$7=0,\"\",IF(OR($B$7=0,QUOTIENT($C717-1,$B$7)+1>MAX($K$6,Planning!$E$3)),\"\",IF(OR($C717>$C$7,MOD($C717-1,$B$7)>0),\"\",QUOTIENT($C717-1,$B$7)+1)))","v":""},709,null,null,null,null,null,"-",null,null," : "]
[null,{"$f":"IF($B$7=0,\"\",IF(OR($B$7=0,QUOTIENT($C718-1,$B$7)+1>MAX($K$6,Planning!$E$3)),\"\",IF(OR($C718>$C$7,MOD($C718-1,$B$7)>0),\"\",QUOTIENT($C718-1,$B$7)+1)))","v":""},710,null,null,null,null,null,"-",null,null," : "]
[null,{"$f":"IF($B$7=0,\"\",IF(OR($B$7=0,QUOTIENT($C719-1,$B$7)+1>MAX($K$6,Planning!$E$3)),\"\",IF(OR($C719>$C$7,MOD($C719-1,$B$7)>0),\"\",QUOTIENT($C719-1,$B$7)+1)))","v":""},711,null,null,null,null,null,"-",null,null," : "]
[null,{"$f":"IF($B$7=0,\"\",IF(OR($B$7=0,QUOTIENT($C720-1,$B$7)+1>MAX($K$6,Planning!$E$3)),\"\",IF(OR($C720>$C$7,MOD($C720-1,$B$7)>0),\"\",QUOTIENT($C720-1,$B$7)+1)))","v":""},712,null,null,null,null,null,"-",null,null," : "]
[null,{"$f":"IF($B$7=0,\"\",IF(OR($B$7=0,QUOTIENT($C721-1,$B$7)+1>MAX($K$6,Planning!$E$3)),\"\",IF(OR($C721>$C$7,MOD($C721-1,$B$7)>0),\"\",QUOTIENT($C721-1,$B$7)+1)))","v":""},713,null,null,null,null,null,"-",null,null," : "]
[null,{"$f":"IF($B$7=0,\"\",IF(OR($B$7=0,QUOTIENT($C722-1,$B$7)+1>MAX($K$6,Planning!$E$3)),\"\",IF(OR($C722>$C$7,MOD($C722-1,$B$7)>0),\"\",QUOTIENT($C722-1,$B$7)+1)))","v":""},714,null,null,null,null,null,"-",null,null," : "]
[null,{"$f":"IF($B$7=0,\"\",IF(OR($B$7=0,QUOTIENT($C723-1,$B$7)+1>MAX($K$6,Planning!$E$3)),\"\",IF(OR($C723>$C$7,MOD($C723-1,$B$7)>0),\"\",QUOTIENT($C723-1,$B$7)+1)))","v":""},715,null,null,null,null,null,"-",null,null," : "]
[null,{"$f":"IF($B$7=0,\"\",IF(OR($B$7=0,QUOTIENT($C724-1,$B$7)+1>MAX($K$6,Planning!$E$3)),\"\",IF(OR($C724>$C$7,MOD($C724-1,$B$7)>0),\"\",QUOTIENT($C724-1,$B$7)+1)))","v":""},716,null,null,null,null,null,"-",null,null," : "]
[null,{"$f":"IF($B$7=0,\"\",IF(OR($B$7=0,QUOTIENT($C725-1,$B$7)+1>MAX($K$6,Planning!$E$3)),\"\",IF(OR($C725>$C$7,MOD($C725-1,$B$7)>0),\"\",QUOTIENT($C725-1,$B$7)+1)))","v":""},717,null,null,null,null,null,"-",null,null," : "]
[null,{"$f":"IF($B$7=0,\"\",IF(OR($B$7=0,QUOTIENT($C726-1,$B$7)+1>MAX($K$6,Planning!$E$3)),\"\",IF(OR($C726>$C$7,MOD($C726-1,$B$7)>0),\"\",QUOTIENT($C726-1,$B$7)+1)))","v":""},718,null,null,null,null,null,"-",null,null," : "]
[null,{"$f":"IF($B$7=0,\"\",IF(OR($B$7=0,QUOTIENT($C727-1,$B$7)+1>MAX($K$6,Planning!$E$3)),\"\",IF(OR($C727>$C$7,MOD($C727-1,$B$7)>0),\"\",QUOTIENT($C727-1,$B$7)+1)))","v":""},719,null,null,null,null,null,"-",null,null," : "]
[null,{"$f":"IF($B$7=0,\"\",IF(OR($B$7=0,QUOTIENT($C728-1,$B$7)+1>MAX($K$6,Planning!$E$3)),\"\",IF(OR($C728>$C$7,MOD($C728-1,$B$7)>0),\"\",QUOTIENT($C728-1,$B$7)+1)))","v":""},720,null,null,null,null,null,"-",null,null," : "]
[null,{"$f":"IF($B$7=0,\"\",IF(OR($B$7=0,QUOTIENT($C729-1,$B$7)+1>MAX($K$6,Planning!$E$3)),\"\",IF(OR($C729>$C$7,MOD($C729-1,$B$7)>0),\"\",QUOTIENT($C729-1,$B$7)+1)))","v":""},721,null,null,null,null,null,"-",null,null," : "]
[null,{"$f":"IF($B$7=0,\"\",IF(OR($B$7=0,QUOTIENT($C730-1,$B$7)+1>MAX($K$6,Planning!$E$3)),\"\",IF(OR($C730>$C$7,MOD($C730-1,$B$7)>0),\"\",QUOTIENT($C730-1,$B$7)+1)))","v":""},722,null,null,null,null,null,"-",null,null," : "]
[null,{"$f":"IF($B$7=0,\"\",IF(OR($B$7=0,QUOTIENT($C731-1,$B$7)+1>MAX($K$6,Planning!$E$3)),\"\",IF(OR($C731>$C$7,MOD($C731-1,$B$7)>0),\"\",QUOTIENT($C731-1,$B$7)+1)))","v":""},723,null,null,null,null,null,"-",null,null," : "]
[null,{"$f":"IF($B$7=0,\"\",IF(OR($B$7=0,QUOTIENT($C732-1,$B$7)+1>MAX($K$6,Planning!$E$3)),\"\",IF(OR($C732>$C$7,MOD($C732-1,$B$7)>0),\"\",QUOTIENT($C732-1,$B$7)+1)))","v":""},724,null,null,null,null,null,"-",null,null," : "]
[null,{"$f":"IF($B$7=0,\"\",IF(OR($B$7=0,QUOTIENT($C733-1,$B$7)+1>MAX($K$6,Planning!$E$3)),\"\",IF(OR($C733>$C$7,MOD($C733-1,$B$7)>0),\"\",QUOTIENT($C733-1,$B$7)+1)))","v":""},725,null,null,null,null,null,"-",null,null," : "]
[null,{"$f":"IF($B$7=0,\"\",IF(OR($B$7=0,QUOTIENT($C734-1,$B$7)+1>MAX($K$6,Planning!$E$3)),\"\",IF(OR($C734>$C$7,MOD($C734-1,$B$7)>0),\"\",QUOTIENT($C734-1,$B$7)+1)))","v":""},726,null,null,null,null,null,"-",null,null," : "]
[null,{"$f":"IF($B$7=0,\"\",IF(OR($B$7=0,QUOTIENT($C735-1,$B$7)+1>MAX($K$6,Planning!$E$3)),\"\",IF(OR($C735>$C$7,MOD($C735-1,$B$7)>0),\"\",QUOTIENT($C735-1,$B$7)+1)))","v":""},727,null,null,null,null,null,"-",null,null," : "]
[null,{"$f":"IF($B$7=0,\"\",IF(OR($B$7=0,QUOTIENT($C736-1,$B$7)+1>MAX($K$6,Planning!$E$3)),\"\",IF(OR($C736>$C$7,MOD($C736-1,$B$7)>0),\"\",QUOTIENT($C736-1,$B$7)+1)))","v":""},728,null,null,null,null,null,"-",null,null," : "]
[null,{"$f":"IF($B$7=0,\"\",IF(OR($B$7=0,QUOTIENT($C737-1,$B$7)+1>MAX($K$6,Planning!$E$3)),\"\",IF(OR($C737>$C$7,MOD($C737-1,$B$7)>0),\"\",QUOTIENT($C737-1,$B$7)+1)))","v":""},729,null,null,null,null,null,"-",null,null," : "]
[null,{"$f":"IF($B$7=0,\"\",IF(OR($B$7=0,QUOTIENT($C738-1,$B$7)+1>MAX($K$6,Planning!$E$3)),\"\",IF(OR($C738>$C$7,MOD($C738-1,$B$7)>0),\"\",QUOTIENT($C738-1,$B$7)+1)))","v":""},730,null,null,null,null,null,"-",null,null," : "]
[null,{"$f":"IF($B$7=0,\"\",IF(OR($B$7=0,QUOTIENT($C739-1,$B$7)+1>MAX($K$6,Planning!$E$3)),\"\",IF(OR($C739>$C$7,MOD($C739-1,$B$7)>0),\"\",QUOTIENT($C739-1,$B$7)+1)))","v":""},731,null,null,null,null,null,"-",null,null," : "]
[null,{"$f":"IF($B$7=0,\"\",IF(OR($B$7=0,QUOTIENT($C740-1,$B$7)+1>MAX($K$6,Planning!$E$3)),\"\",IF(OR($C740>$C$7,MOD($C740-1,$B$7)>0),\"\",QUOTIENT($C740-1,$B$7)+1)))","v":""},732,null,null,null,null,null,"-",null,null," : "]
[null,{"$f":"IF($B$7=0,\"\",IF(OR($B$7=0,QUOTIENT($C741-1,$B$7)+1>MAX($K$6,Planning!$E$3)),\"\",IF(OR($C741>$C$7,MOD($C741-1,$B$7)>0),\"\",QUOTIENT($C741-1,$B$7)+1)))","v":""},733,null,null,null,null,null,"-",null,null," : "]
[null,{"$f":"IF($B$7=0,\"\",IF(OR($B$7=0,QUOTIENT($C742-1,$B$7)+1>MAX($K$6,Planning!$E$3)),\"\",IF(OR($C742>$C$7,MOD($C742-1,$B$7)>0),\"\",QUOTIENT($C742-1,$B$7)+1)))","v":""},734,null,null,null,null,null,"-",null,null," : "]
[null,{"$f":"IF($B$7=0,\"\",IF(OR($B$7=0,QUOTIENT($C743-1,$B$7)+1>MAX($K$6,Planning!$E$3)),\"\",IF(OR($C743>$C$7,MOD($C743-1,$B$7)>0),\"\",QUOTIENT($C743-1,$B$7)+1)))","v":""},735,null,null,null,null,null,"-",null,null," : "]
[null,{"$f":"IF($B$7=0,\"\",IF(OR($B$7=0,QUOTIENT($C744-1,$B$7)+1>MAX($K$6,Planning!$E$3)),\"\",IF(OR($C744>$C$7,MOD($C744-1,$B$7)>0),\"\",QUOTIENT($C744-1,$B$7)+1)))","v":""},736,null,null,null,null,null,"-",null,null," : "]
[null,{"$f":"IF($B$7=0,\"\",IF(OR($B$7=0,QUOTIENT($C745-1,$B$7)+1>MAX($K$6,Planning!$E$3)),\"\",IF(OR($C745>$C$7,MOD($C745-1,$B$7)>0),\"\",QUOTIENT($C745-1,$B$7)+1)))","v":""},737,null,null,null,null,null,"-",null,null," : "]
[null,{"$f":"IF($B$7=0,\"\",IF(OR($B$7=0,QUOTIENT($C746-1,$B$7)+1>MAX($K$6,Planning!$E$3)),\"\",IF(OR($C746>$C$7,MOD($C746-1,$B$7)>0),\"\",QUOTIENT($C746-1,$B$7)+1)))","v":""},738,null,null,null,null,null,"-",null,null," : "]
[null,{"$f":"IF($B$7=0,\"\",IF(OR($B$7=0,QUOTIENT($C747-1,$B$7)+1>MAX($K$6,Planning!$E$3)),\"\",IF(OR($C747>$C$7,MOD($C747-1,$B$7)>0),\"\",QUOTIENT($C747-1,$B$7)+1)))","v":""},739,null,null,null,null,null,"-",null,null," : "]
[null,{"$f":"IF($B$7=0,\"\",IF(OR($B$7=0,QUOTIENT($C748-1,$B$7)+1>MAX($K$6,Planning!$E$3)),\"\",IF(OR($C748>$C$7,MOD($C748-1,$B$7)>0),\"\",QUOTIENT($C748-1,$B$7)+1)))","v":""},740,null,null,null,null,null,"-",null,null," : "]
[null,{"$f":"IF($B$7=0,\"\",IF(OR($B$7=0,QUOTIENT($C749-1,$B$7)+1>MAX($K$6,Planning!$E$3)),\"\",IF(OR($C749>$C$7,MOD($C749-1,$B$7)>0),\"\",QUOTIENT($C749-1,$B$7)+1)))","v":""},741,null,null,null,null,null,"-",null,null," : "]
[null,{"$f":"IF($B$7=0,\"\",IF(OR($B$7=0,QUOTIENT($C750-1,$B$7)+1>MAX($K$6,Planning!$E$3)),\"\",IF(OR($C750>$C$7,MOD($C750-1,$B$7)>0),\"\",QUOTIENT($C750-1,$B$7)+1)))","v":""},742,null,null,null,null,null,"-",null,null," : "]
[null,{"$f":"IF($B$7=0,\"\",IF(OR($B$7=0,QUOTIENT($C751-1,$B$7)+1>MAX($K$6,Planning!$E$3)),\"\",IF(OR($C751>$C$7,MOD($C751-1,$B$7)>0),\"\",QUOTIENT($C751-1,$B$7)+1)))","v":""},743,null,null,null,null,null,"-",null,null," : "]
[null,{"$f":"IF($B$7=0,\"\",IF(OR($B$7=0,QUOTIENT($C752-1,$B$7)+1>MAX($K$6,Planning!$E$3)),\"\",IF(OR($C752>$C$7,MOD($C752-1,$B$7)>0),\"\",QUOTIENT($C752-1,$B$7)+1)))","v":""},744,null,null,null,null,null,"-",null,null," : "]
[null,{"$f":"IF($B$7=0,\"\",IF(OR($B$7=0,QUOTIENT($C753-1,$B$7)+1>MAX($K$6,Planning!$E$3)),\"\",IF(OR($C753>$C$7,MOD($C753-1,$B$7)>0),\"\",QUOTIENT($C753-1,$B$7)+1)))","v":""},745,null,null,null,null,null,"-",null,null," : "]
[null,{"$f":"IF($B$7=0,\"\",IF(OR($B$7=0,QUOTIENT($C754-1,$B$7)+1>MAX($K$6,Planning!$E$3)),\"\",IF(OR($C754>$C$7,MOD($C754-1,$B$7)>0),\"\",QUOTIENT($C754-1,$B$7)+1)))","v":""},746,null,null,null,null,null,"-",null,null," : "]
[null,{"$f":"IF($B$7=0,\"\",IF(OR($B$7=0,QUOTIENT($C755-1,$B$7)+1>MAX($K$6,Planning!$E$3)),\"\",IF(OR($C755>$C$7,MOD($C755-1,$B$7)>0),\"\",QUOTIENT($C755-1,$B$7)+1)))","v":""},747,null,null,null,null,null,"-",null,null," : "]
[null,{"$f":"IF($B$7=0,\"\",IF(OR($B$7=0,QUOTIENT($C756-1,$B$7)+1>MAX($K$6,Planning!$E$3)),\"\",IF(OR($C756>$C$7,MOD($C756-1,$B$7)>0),\"\",QUOTIENT($C756-1,$B$7)+1)))","v":""},748,null,null,null,null,null,"-",null,null," : "]
[null,{"$f":"IF($B$7=0,\"\",IF(OR($B$7=0,QUOTIENT($C757-1,$B$7)+1>MAX($K$6,Planning!$E$3)),\"\",IF(OR($C757>$C$7,MOD($C757-1,$B$7)>0),\"\",QUOTIENT($C757-1,$B$7)+1)))","v":""},749,null,null,null,null,null,"-",null,null," : "]
[null,{"$f":"IF($B$7=0,\"\",IF(OR($B$7=0,QUOTIENT($C758-1,$B$7)+1>MAX($K$6,Planning!$E$3)),\"\",IF(OR($C758>$C$7,MOD($C758-1,$B$7)>0),\"\",QUOTIENT($C758-1,$B$7)+1)))","v":""},750,null,null,null,null,null,"-",null,null," : "]
[null,{"$f":"IF($B$7=0,\"\",IF(OR($B$7=0,QUOTIENT($C759-1,$B$7)+1>MAX($K$6,Planning!$E$3)),\"\",IF(OR($C759>$C$7,MOD($C759-1,$B$7)>0),\"\",QUOTIENT($C759-1,$B$7)+1)))","v":""},751,null,null,null,null,null,"-",null,null," : "]
[null,{"$f":"IF($B$7=0,\"\",IF(OR($B$7=0,QUOTIENT($C760-1,$B$7)+1>MAX($K$6,Planning!$E$3)),\"\",IF(OR($C760>$C$7,MOD($C760-1,$B$7)>0),\"\",QUOTIENT($C760-1,$B$7)+1)))","v":""},752,null,null,null,null,null,"-",null,null," : "]
[null,{"$f":"IF($B$7=0,\"\",IF(OR($B$7=0,QUOTIENT($C761-1,$B$7)+1>MAX($K$6,Planning!$E$3)),\"\",IF(OR($C761>$C$7,MOD($C761-1,$B$7)>0),\"\",QUOTIENT($C761-1,$B$7)+1)))","v":""},753,null,null,null,null,null,"-",null,null," : "]
[null,{"$f":"IF($B$7=0,\"\",IF(OR($B$7=0,QUOTIENT($C762-1,$B$7)+1>MAX($K$6,Planning!$E$3)),\"\",IF(OR($C762>$C$7,MOD($C762-1,$B$7)>0),\"\",QUOTIENT($C762-1,$B$7)+1)))","v":""},754,null,null,null,null,null,"-",null,null," : "]
[null,{"$f":"IF($B$7=0,\"\",IF(OR($B$7=0,QUOTIENT($C763-1,$B$7)+1>MAX($K$6,Planning!$E$3)),\"\",IF(OR($C763>$C$7,MOD($C763-1,$B$7)>0),\"\",QUOTIENT($C763-1,$B$7)+1)))","v":""},755,null,null,null,null,null,"-",null,null," : "]
[null,{"$f":"IF($B$7=0,\"\",IF(OR($B$7=0,QUOTIENT($C764-1,$B$7)+1>MAX($K$6,Planning!$E$3)),\"\",IF(OR($C764>$C$7,MOD($C764-1,$B$7)>0),\"\",QUOTIENT($C764-1,$B$7)+1)))","v":""},756,null,null,null,null,null,"-",null,null," : "]
[null,{"$f":"IF($B$7=0,\"\",IF(OR($B$7=0,QUOTIENT($C765-1,$B$7)+1>MAX($K$6,Planning!$E$3)),\"\",IF(OR($C765>$C$7,MOD($C765-1,$B$7)>0),\"\",QUOTIENT($C765-1,$B$7)+1)))","v":""},757,null,null,null,null,null,"-",null,null," : "]
[null,{"$f":"IF($B$7=0,\"\",IF(OR($B$7=0,QUOTIENT($C766-1,$B$7)+1>MAX($K$6,Planning!$E$3)),\"\",IF(OR($C766>$C$7,MOD($C766-1,$B$7)>0),\"\",QUOTIENT($C766-1,$B$7)+1)))","v":""},758,null,null,null,null,null,"-",null,null," : "]
[null,{"$f":"IF($B$7=0,\"\",IF(OR($B$7=0,QUOTIENT($C767-1,$B$7)+1>MAX($K$6,Planning!$E$3)),\"\",IF(OR($C767>$C$7,MOD($C767-1,$B$7)>0),\"\",QUOTIENT($C767-1,$B$7)+1)))","v":""},759,null,null,null,null,null,"-",null,null," : "]
[null,{"$f":"IF($B$7=0,\"\",IF(OR($B$7=0,QUOTIENT($C768-1,$B$7)+1>MAX($K$6,Planning!$E$3)),\"\",IF(OR($C768>$C$7,MOD($C768-1,$B$7)>0),\"\",QUOTIENT($C768-1,$B$7)+1)))","v":""},760,null,null,null,null,null,"-",null,null," : "]
[null,{"$f":"IF($B$7=0,\"\",IF(OR($B$7=0,QUOTIENT($C769-1,$B$7)+1>MAX($K$6,Planning!$E$3)),\"\",IF(OR($C769>$C$7,MOD($C769-1,$B$7)>0),\"\",QUOTIENT($C769-1,$B$7)+1)))","v":""},761,null,null,null,null,null,"-",null,null," : "]
[null,{"$f":"IF($B$7=0,\"\",IF(OR($B$7=0,QUOTIENT($C770-1,$B$7)+1>MAX($K$6,Planning!$E$3)),\"\",IF(OR($C770>$C$7,MOD($C770-1,$B$7)>0),\"\",QUOTIENT($C770-1,$B$7)+1)))","v":""},762,null,null,null,null,null,"-",null,null," : "]
[null,{"$f":"IF($B$7=0,\"\",IF(OR($B$7=0,QUOTIENT($C771-1,$B$7)+1>MAX($K$6,Planning!$E$3)),\"\",IF(OR($C771>$C$7,MOD($C771-1,$B$7)>0),\"\",QUOTIENT($C771-1,$B$7)+1)))","v":""},763,null,null,null,null,null,"-",null,null," : "]
[null,{"$f":"IF($B$7=0,\"\",IF(OR($B$7=0,QUOTIENT($C772-1,$B$7)+1>MAX($K$6,Planning!$E$3)),\"\",IF(OR($C772>$C$7,MOD($C772-1,$B$7)>0),\"\",QUOTIENT($C772-1,$B$7)+1)))","v":""},764,null,null,null,null,null,"-",null,null," : "]
[null,{"$f":"IF($B$7=0,\"\",IF(OR($B$7=0,QUOTIENT($C773-1,$B$7)+1>MAX($K$6,Planning!$E$3)),\"\",IF(OR($C773>$C$7,MOD($C773-1,$B$7)>0),\"\",QUOTIENT($C773-1,$B$7)+1)))","v":""},765,null,null,null,null,null,"-",null,null," : "]
[null,{"$f":"IF($B$7=0,\"\",IF(OR($B$7=0,QUOTIENT($C774-1,$B$7)+1>MAX($K$6,Planning!$E$3)),\"\",IF(OR($C774>$C$7,MOD($C774-1,$B$7)>0),\"\",QUOTIENT($C774-1,$B$7)+1)))","v":""},766,null,null,null,null,null,"-",null,null," : "]
[null,{"$f":"IF($B$7=0,\"\",IF(OR($B$7=0,QUOTIENT($C775-1,$B$7)+1>MAX($K$6,Planning!$E$3)),\"\",IF(OR($C775>$C$7,MOD($C775-1,$B$7)>0),\"\",QUOTIENT($C775-1,$B$7)+1)))","v":""},767,null,null,null,null,null,"-",null,null," : "]
[null,{"$f":"IF($B$7=0,\"\",IF(OR($B$7=0,QUOTIENT($C776-1,$B$7)+1>MAX($K$6,Planning!$E$3)),\"\",IF(OR($C776>$C$7,MOD($C776-1,$B$7)>0),\"\",QUOTIENT($C776-1,$B$7)+1)))","v":""},768,null,null,null,null,null,"-",null,null," : "]
[null,{"$f":"IF($B$7=0,\"\",IF(OR($B$7=0,QUOTIENT($C777-1,$B$7)+1>MAX($K$6,Planning!$E$3)),\"\",IF(OR($C777>$C$7,MOD($C777-1,$B$7)>0),\"\",QUOTIENT($C777-1,$B$7)+1)))","v":""},769,null,null,null,null,null,"-",null,null," : "]
[null,{"$f":"IF($B$7=0,\"\",IF(OR($B$7=0,QUOTIENT($C778-1,$B$7)+1>MAX($K$6,Planning!$E$3)),\"\",IF(OR($C778>$C$7,MOD($C778-1,$B$7)>0),\"\",QUOTIENT($C778-1,$B$7)+1)))","v":""},770,null,null,null,null,null,"-",null,null," : "]
[null,{"$f":"IF($B$7=0,\"\",IF(OR($B$7=0,QUOTIENT($C779-1,$B$7)+1>MAX($K$6,Planning!$E$3)),\"\",IF(OR($C779>$C$7,MOD($C779-1,$B$7)>0),\"\",QUOTIENT($C779-1,$B$7)+1)))","v":""},771,null,null,null,null,null,"-",null,null," : "]
[null,{"$f":"IF($B$7=0,\"\",IF(OR($B$7=0,QUOTIENT($C780-1,$B$7)+1>MAX($K$6,Planning!$E$3)),\"\",IF(OR($C780>$C$7,MOD($C780-1,$B$7)>0),\"\",QUOTIENT($C780-1,$B$7)+1)))","v":""},772,null,null,null,null,null,"-",null,null," : "]
[null,{"$f":"IF($B$7=0,\"\",IF(OR($B$7=0,QUOTIENT($C781-1,$B$7)+1>MAX($K$6,Planning!$E$3)),\"\",IF(OR($C781>$C$7,MOD($C781-1,$B$7)>0),\"\",QUOTIENT($C781-1,$B$7)+1)))","v":""},773,null,null,null,null,null,"-",null,null," : "]
[null,{"$f":"IF($B$7=0,\"\",IF(OR($B$7=0,QUOTIENT($C782-1,$B$7)+1>MAX($K$6,Planning!$E$3)),\"\",IF(OR($C782>$C$7,MOD($C782-1,$B$7)>0),\"\",QUOTIENT($C782-1,$B$7)+1)))","v":""},774,null,null,null,null,null,"-",null,null," : "]
[null,{"$f":"IF($B$7=0,\"\",IF(OR($B$7=0,QUOTIENT($C783-1,$B$7)+1>MAX($K$6,Planning!$E$3)),\"\",IF(OR($C783>$C$7,MOD($C783-1,$B$7)>0),\"\",QUOTIENT($C783-1,$B$7)+1)))","v":""},775,null,null,null,null,null,"-",null,null," : "]
[null,{"$f":"IF($B$7=0,\"\",IF(OR($B$7=0,QUOTIENT($C784-1,$B$7)+1>MAX($K$6,Planning!$E$3)),\"\",IF(OR($C784>$C$7,MOD($C784-1,$B$7)>0),\"\",QUOTIENT($C784-1,$B$7)+1)))","v":""},776,null,null,null,null,null,"-",null,null," : "]
[null,{"$f":"IF($B$7=0,\"\",IF(OR($B$7=0,QUOTIENT($C785-1,$B$7)+1>MAX($K$6,Planning!$E$3)),\"\",IF(OR($C785>$C$7,MOD($C785-1,$B$7)>0),\"\",QUOTIENT($C785-1,$B$7)+1)))","v":""},777,null,null,null,null,null,"-",null,null," : "]
[null,{"$f":"IF($B$7=0,\"\",IF(OR($B$7=0,QUOTIENT($C786-1,$B$7)+1>MAX($K$6,Planning!$E$3)),\"\",IF(OR($C786>$C$7,MOD($C786-1,$B$7)>0),\"\",QUOTIENT($C786-1,$B$7)+1)))","v":""},778,null,null,null,null,null,"-",null,null," : "]
[null,{"$f":"IF($B$7=0,\"\",IF(OR($B$7=0,QUOTIENT($C787-1,$B$7)+1>MAX($K$6,Planning!$E$3)),\"\",IF(OR($C787>$C$7,MOD($C787-1,$B$7)>0),\"\",QUOTIENT($C787-1,$B$7)+1)))","v":""},779,null,null,null,null,null,"-",null,null," : "]
[null,{"$f":"IF($B$7=0,\"\",IF(OR($B$7=0,QUOTIENT($C788-1,$B$7)+1>MAX($K$6,Planning!$E$3)),\"\",IF(OR($C788>$C$7,MOD($C788-1,$B$7)>0),\"\",QUOTIENT($C788-1,$B$7)+1)))","v":""},780,null,null,null,null,null,"-",null,null," : "]
[null,{"$f":"IF($B$7=0,\"\",IF(OR($B$7=0,QUOTIENT($C789-1,$B$7)+1>MAX($K$6,Planning!$E$3)),\"\",IF(OR($C789>$C$7,MOD($C789-1,$B$7)>0),\"\",QUOTIENT($C789-1,$B$7)+1)))","v":""},781,null,null,null,null,null,"-",null,null," : "]
[null,{"$f":"IF($B$7=0,\"\",IF(OR($B$7=0,QUOTIENT($C790-1,$B$7)+1>MAX($K$6,Planning!$E$3)),\"\",IF(OR($C790>$C$7,MOD($C790-1,$B$7)>0),\"\",QUOTIENT($C790-1,$B$7)+1)))","v":""},782,null,null,null,null,null,"-",null,null," : "]
[null,{"$f":"IF($B$7=0,\"\",IF(OR($B$7=0,QUOTIENT($C791-1,$B$7)+1>MAX($K$6,Planning!$E$3)),\"\",IF(OR($C791>$C$7,MOD($C791-1,$B$7)>0),\"\",QUOTIENT($C791-1,$B$7)+1)))","v":""},783,null,null,null,null,null,"-",null,null," : "]
[null,{"$f":"IF($B$7=0,\"\",IF(OR($B$7=0,QUOTIENT($C792-1,$B$7)+1>MAX($K$6,Planning!$E$3)),\"\",IF(OR($C792>$C$7,MOD($C792-1,$B$7)>0),\"\",QUOTIENT($C792-1,$B$7)+1)))","v":""},784,null,null,null,null,null,"-",null,null," : "]
[null,{"$f":"IF($B$7=0,\"\",IF(OR($B$7=0,QUOTIENT($C793-1,$B$7)+1>MAX($K$6,Planning!$E$3)),\"\",IF(OR($C793>$C$7,MOD($C793-1,$B$7)>0),\"\",QUOTIENT($C793-1,$B$7)+1)))","v":""},785,null,null,null,null,null,"-",null,null," : "]
[null,{"$f":"IF($B$7=0,\"\",IF(OR($B$7=0,QUOTIENT($C794-1,$B$7)+1>MAX($K$6,Planning!$E$3)),\"\",IF(OR($C794>$C$7,MOD($C794-1,$B$7)>0),\"\",QUOTIENT($C794-1,$B$7)+1)))","v":""},786,null,null,null,null,null,"-",null,null," : "]
[null,{"$f":"IF($B$7=0,\"\",IF(OR($B$7=0,QUOTIENT($C795-1,$B$7)+1>MAX($K$6,Planning!$E$3)),\"\",IF(OR($C795>$C$7,MOD($C795-1,$B$7)>0),\"\",QUOTIENT($C795-1,$B$7)+1)))","v":""},787,null,null,null,null,null,"-",null,null," : "]
[null,{"$f":"IF($B$7=0,\"\",IF(OR($B$7=0,QUOTIENT($C796-1,$B$7)+1>MAX($K$6,Planning!$E$3)),\"\",IF(OR($C796>$C$7,MOD($C796-1,$B$7)>0),\"\",QUOTIENT($C796-1,$B$7)+1)))","v":""},788,null,null,null,null,null,"-",null,null," : "]
[null,{"$f":"IF($B$7=0,\"\",IF(OR($B$7=0,QUOTIENT($C797-1,$B$7)+1>MAX($K$6,Planning!$E$3)),\"\",IF(OR($C797>$C$7,MOD($C797-1,$B$7)>0),\"\",QUOTIENT($C797-1,$B$7)+1)))","v":""},789,null,null,null,null,null,"-",null,null," : "]
[null,{"$f":"IF($B$7=0,\"\",IF(OR($B$7=0,QUOTIENT($C798-1,$B$7)+1>MAX($K$6,Planning!$E$3)),\"\",IF(OR($C798>$C$7,MOD($C798-1,$B$7)>0),\"\",QUOTIENT($C798-1,$B$7)+1)))","v":""},790,null,null,null,null,null,"-",null,null," : "]
[null,{"$f":"IF($B$7=0,\"\",IF(OR($B$7=0,QUOTIENT($C799-1,$B$7)+1>MAX($K$6,Planning!$E$3)),\"\",IF(OR($C799>$C$7,MOD($C799-1,$B$7)>0),\"\",QUOTIENT($C799-1,$B$7)+1)))","v":""},791,null,null,null,null,null,"-",null,null," : "]
[null,{"$f":"IF($B$7=0,\"\",IF(OR($B$7=0,QUOTIENT($C800-1,$B$7)+1>MAX($K$6,Planning!$E$3)),\"\",IF(OR($C800>$C$7,MOD($C800-1,$B$7)>0),\"\",QUOTIENT($C800-1,$B$7)+1)))","v":""},792,null,null,null,null,null,"-",null,null," : "]
[null,{"$f":"IF($B$7=0,\"\",IF(OR($B$7=0,QUOTIENT($C801-1,$B$7)+1>MAX($K$6,Planning!$E$3)),\"\",IF(OR($C801>$C$7,MOD($C801-1,$B$7)>0),\"\",QUOTIENT($C801-1,$B$7)+1)))","v":""},793,null,null,null,null,null,"-",null,null," : "]
[null,{"$f":"IF($B$7=0,\"\",IF(OR($B$7=0,QUOTIENT($C802-1,$B$7)+1>MAX($K$6,Planning!$E$3)),\"\",IF(OR($C802>$C$7,MOD($C802-1,$B$7)>0),\"\",QUOTIENT($C802-1,$B$7)+1)))","v":""},794,null,null,null,null,null,"-",null,null," : "]
[null,{"$f":"IF($B$7=0,\"\",IF(OR($B$7=0,QUOTIENT($C803-1,$B$7)+1>MAX($K$6,Planning!$E$3)),\"\",IF(OR($C803>$C$7,MOD($C803-1,$B$7)>0),\"\",QUOTIENT($C803-1,$B$7)+1)))","v":""},795,null,null,null,null,null,"-",null,null," : "]
[null,{"$f":"IF($B$7=0,\"\",IF(OR($B$7=0,QUOTIENT($C804-1,$B$7)+1>MAX($K$6,Planning!$E$3)),\"\",IF(OR($C804>$C$7,MOD($C804-1,$B$7)>0),\"\",QUOTIENT($C804-1,$B$7)+1)))","v":""},796,null,null,null,null,null,"-",null,null," : "]
[null,{"$f":"IF($B$7=0,\"\",IF(OR($B$7=0,QUOTIENT($C805-1,$B$7)+1>MAX($K$6,Planning!$E$3)),\"\",IF(OR($C805>$C$7,MOD($C805-1,$B$7)>0),\"\",QUOTIENT($C805-1,$B$7)+1)))","v":""},797,null,null,null,null,null,"-",null,null," : "]
[null,{"$f":"IF($B$7=0,\"\",IF(OR($B$7=0,QUOTIENT($C806-1,$B$7)+1>MAX($K$6,Planning!$E$3)),\"\",IF(OR($C806>$C$7,MOD($C806-1,$B$7)>0),\"\",QUOTIENT($C806-1,$B$7)+1)))","v":""},798,null,null,null,null,null,"-",null,null," : "]
[null,{"$f":"IF($B$7=0,\"\",IF(OR($B$7=0,QUOTIENT($C807-1,$B$7)+1>MAX($K$6,Planning!$E$3)),\"\",IF(OR($C807>$C$7,MOD($C807-1,$B$7)>0),\"\",QUOTIENT($C807-1,$B$7)+1)))","v":""},799,null,null,null,null,null,"-",null,null," : "]
[null,{"$f":"IF($B$7=0,\"\",IF(OR($B$7=0,QUOTIENT($C808-1,$B$7)+1>MAX($K$6,Planning!$E$3)),\"\",IF(OR($C808>$C$7,MOD($C808-1,$B$7)>0),\"\",QUOTIENT($C808-1,$B$7)+1)))","v":""},800,null,null,null,null,null,"-",null,null," : "]
[null,{"$f":"IF($B$7=0,\"\",IF(OR($B$7=0,QUOTIENT($C809-1,$B$7)+1>MAX($K$6,Planning!$E$3)),\"\",IF(OR($C809>$C$7,MOD($C809-1,$B$7)>0),\"\",QUOTIENT($C809-1,$B$7)+1)))","v":""},801,null,null,null,null,null,"-",null,null," : "]
[null,{"$f":"IF($B$7=0,\"\",IF(OR($B$7=0,QUOTIENT($C810-1,$B$7)+1>MAX($K$6,Planning!$E$3)),\"\",IF(OR($C810>$C$7,MOD($C810-1,$B$7)>0),\"\",QUOTIENT($C810-1,$B$7)+1)))","v":""},802,null,null,null,null,null,"-",null,null," : "]
[null,{"$f":"IF($B$7=0,\"\",IF(OR($B$7=0,QUOTIENT($C811-1,$B$7)+1>MAX($K$6,Planning!$E$3)),\"\",IF(OR($C811>$C$7,MOD($C811-1,$B$7)>0),\"\",QUOTIENT($C811-1,$B$7)+1)))","v":""},803,null,null,null,null,null,"-",null,null," : "]
[null,{"$f":"IF($B$7=0,\"\",IF(OR($B$7=0,QUOTIENT($C812-1,$B$7)+1>MAX($K$6,Planning!$E$3)),\"\",IF(OR($C812>$C$7,MOD($C812-1,$B$7)>0),\"\",QUOTIENT($C812-1,$B$7)+1)))","v":""},804,null,null,null,null,null,"-",null,null," : "]
[null,{"$f":"IF($B$7=0,\"\",IF(OR($B$7=0,QUOTIENT($C813-1,$B$7)+1>MAX($K$6,Planning!$E$3)),\"\",IF(OR($C813>$C$7,MOD($C813-1,$B$7)>0),\"\",QUOTIENT($C813-1,$B$7)+1)))","v":""},805,null,null,null,null,null,"-",null,null," : "]
[null,{"$f":"IF($B$7=0,\"\",IF(OR($B$7=0,QUOTIENT($C814-1,$B$7)+1>MAX($K$6,Planning!$E$3)),\"\",IF(OR($C814>$C$7,MOD($C814-1,$B$7)>0),\"\",QUOTIENT($C814-1,$B$7)+1)))","v":""},806,null,null,null,null,null,"-",null,null," : "]
[null,{"$f":"IF($B$7=0,\"\",IF(OR($B$7=0,QUOTIENT($C815-1,$B$7)+1>MAX($K$6,Planning!$E$3)),\"\",IF(OR($C815>$C$7,MOD($C815-1,$B$7)>0),\"\",QUOTIENT($C815-1,$B$7)+1)))","v":""},807,null,null,null,null,null,"-",null,null," : "]
[null,{"$f":"IF($B$7=0,\"\",IF(OR($B$7=0,QUOTIENT($C816-1,$B$7)+1>MAX($K$6,Planning!$E$3)),\"\",IF(OR($C816>$C$7,MOD($C816-1,$B$7)>0),\"\",QUOTIENT($C816-1,$B$7)+1)))","v":""},808,null,null,null,null,null,"-",null,null," : "]
[null,{"$f":"IF($B$7=0,\"\",IF(OR($B$7=0,QUOTIENT($C817-1,$B$7)+1>MAX($K$6,Planning!$E$3)),\"\",IF(OR($C817>$C$7,MOD($C817-1,$B$7)>0),\"\",QUOTIENT($C817-1,$B$7)+1)))","v":""},809,null,null,null,null,null,"-",null,null," : "]
[null,{"$f":"IF($B$7=0,\"\",IF(OR($B$7=0,QUOTIENT($C818-1,$B$7)+1>MAX($K$6,Planning!$E$3)),\"\",IF(OR($C818>$C$7,MOD($C818-1,$B$7)>0),\"\",QUOTIENT($C818-1,$B$7)+1)))","v":""},810,null,null,null,null,null,"-",null,null," : "]
[null,{"$f":"IF($B$7=0,\"\",IF(OR($B$7=0,QUOTIENT($C819-1,$B$7)+1>MAX($K$6,Planning!$E$3)),\"\",IF(OR($C819>$C$7,MOD($C819-1,$B$7)>0),\"\",QUOTIENT($C819-1,$B$7)+1)))","v":""},811,null,null,null,null,null,"-",null,null," : "]
[null,{"$f":"IF($B$7=0,\"\",IF(OR($B$7=0,QUOTIENT($C820-1,$B$7)+1>MAX($K$6,Planning!$E$3)),\"\",IF(OR($C820>$C$7,MOD($C820-1,$B$7)>0),\"\",QUOTIENT($C820-1,$B$7)+1)))","v":""},812,null,null,null,null,null,"-",null,null," : "]
[null,{"$f":"IF($B$7=0,\"\",IF(OR($B$7=0,QUOTIENT($C821-1,$B$7)+1>MAX($K$6,Planning!$E$3)),\"\",IF(OR($C821>$C$7,MOD($C821-1,$B$7)>0),\"\",QUOTIENT($C821-1,$B$7)+1)))","v":""},813,null,null,null,null,null,"-",null,null," : "]
[null,{"$f":"IF($B$7=0,\"\",IF(OR($B$7=0,QUOTIENT($C822-1,$B$7)+1>MAX($K$6,Planning!$E$3)),\"\",IF(OR($C822>$C$7,MOD($C822-1,$B$7)>0),\"\",QUOTIENT($C822-1,$B$7)+1)))","v":""},814,null,null,null,null,null,"-",null,null," : "]
[null,{"$f":"IF($B$7=0,\"\",IF(OR($B$7=0,QUOTIENT($C823-1,$B$7)+1>MAX($K$6,Planning!$E$3)),\"\",IF(OR($C823>$C$7,MOD($C823-1,$B$7)>0),\"\",QUOTIENT($C823-1,$B$7)+1)))","v":""},815,null,null,null,null,null,"-",null,null," : "]
[null,{"$f":"IF($B$7=0,\"\",IF(OR($B$7=0,QUOTIENT($C824-1,$B$7)+1>MAX($K$6,Planning!$E$3)),\"\",IF(OR($C824>$C$7,MOD($C824-1,$B$7)>0),\"\",QUOTIENT($C824-1,$B$7)+1)))","v":""},816,null,null,null,null,null,"-",null,null," : "]
[null,{"$f":"IF($B$7=0,\"\",IF(OR($B$7=0,QUOTIENT($C825-1,$B$7)+1>MAX($K$6,Planning!$E$3)),\"\",IF(OR($C825>$C$7,MOD($C825-1,$B$7)>0),\"\",QUOTIENT($C825-1,$B$7)+1)))","v":""},817,null,null,null,null,null,"-",null,null," : "]
[null,{"$f":"IF($B$7=0,\"\",IF(OR($B$7=0,QUOTIENT($C826-1,$B$7)+1>MAX($K$6,Planning!$E$3)),\"\",IF(OR($C826>$C$7,MOD($C826-1,$B$7)>0),\"\",QUOTIENT($C826-1,$B$7)+1)))","v":""},818,null,null,null,null,null,"-",null,null," : "]
[null,{"$f":"IF($B$7=0,\"\",IF(OR($B$7=0,QUOTIENT($C827-1,$B$7)+1>MAX($K$6,Planning!$E$3)),\"\",IF(OR($C827>$C$7,MOD($C827-1,$B$7)>0),\"\",QUOTIENT($C827-1,$B$7)+1)))","v":""},819,null,null,null,null,null,"-",null,null," : "]
[null,{"$f":"IF($B$7=0,\"\",IF(OR($B$7=0,QUOTIENT($C828-1,$B$7)+1>MAX($K$6,Planning!$E$3)),\"\",IF(OR($C828>$C$7,MOD($C828-1,$B$7)>0),\"\",QUOTIENT($C828-1,$B$7)+1)))","v":""},820,null,null,null,null,null,"-",null,null," : "]
[null,{"$f":"IF($B$7=0,\"\",IF(OR($B$7=0,QUOTIENT($C829-1,$B$7)+1>MAX($K$6,Planning!$E$3)),\"\",IF(OR($C829>$C$7,MOD($C829-1,$B$7)>0),\"\",QUOTIENT($C829-1,$B$7)+1)))","v":""},821,null,null,null,null,null,"-",null,null," : "]
[null,{"$f":"IF($B$7=0,\"\",IF(OR($B$7=0,QUOTIENT($C830-1,$B$7)+1>MAX($K$6,Planning!$E$3)),\"\",IF(OR($C830>$C$7,MOD($C830-1,$B$7)>0),\"\",QUOTIENT($C830-1,$B$7)+1)))","v":""},822,null,null,null,null,null,"-",null,null," : "]
[null,{"$f":"IF($B$7=0,\"\",IF(OR($B$7=0,QUOTIENT($C831-1,$B$7)+1>MAX($K$6,Planning!$E$3)),\"\",IF(OR($C831>$C$7,MOD($C831-1,$B$7)>0),\"\",QUOTIENT($C831-1,$B$7)+1)))","v":""},823,null,null,null,null,null,"-",null,null," : "]
[null,{"$f":"IF($B$7=0,\"\",IF(OR($B$7=0,QUOTIENT($C832-1,$B$7)+1>MAX($K$6,Planning!$E$3)),\"\",IF(OR($C832>$C$7,MOD($C832-1,$B$7)>0),\"\",QUOTIENT($C832-1,$B$7)+1)))","v":""},824,null,null,null,null,null,"-",null,null," : "]
[null,{"$f":"IF($B$7=0,\"\",IF(OR($B$7=0,QUOTIENT($C833-1,$B$7)+1>MAX($K$6,Planning!$E$3)),\"\",IF(OR($C833>$C$7,MOD($C833-1,$B$7)>0),\"\",QUOTIENT($C833-1,$B$7)+1)))","v":""},825,null,null,null,null,null,"-",null,null," : "]
[null,{"$f":"IF($B$7=0,\"\",IF(OR($B$7=0,QUOTIENT($C834-1,$B$7)+1>MAX($K$6,Planning!$E$3)),\"\",IF(OR($C834>$C$7,MOD($C834-1,$B$7)>0),\"\",QUOTIENT($C834-1,$B$7)+1)))","v":""},826,null,null,null,null,null,"-",null,null," : "]
[null,{"$f":"IF($B$7=0,\"\",IF(OR($B$7=0,QUOTIENT($C835-1,$B$7)+1>MAX($K$6,Planning!$E$3)),\"\",IF(OR($C835>$C$7,MOD($C835-1,$B$7)>0),\"\",QUOTIENT($C835-1,$B$7)+1)))","v":""},827,null,null,null,null,null,"-",null,null," : "]
[null,{"$f":"IF($B$7=0,\"\",IF(OR($B$7=0,QUOTIENT($C836-1,$B$7)+1>MAX($K$6,Planning!$E$3)),\"\",IF(OR($C836>$C$7,MOD($C836-1,$B$7)>0),\"\",QUOTIENT($C836-1,$B$7)+1)))","v":""},828,null,null,null,null,null,"-",null,null," : "]
[null,{"$f":"IF($B$7=0,\"\",IF(OR($B$7=0,QUOTIENT($C837-1,$B$7)+1>MAX($K$6,Planning!$E$3)),\"\",IF(OR($C837>$C$7,MOD($C837-1,$B$7)>0),\"\",QUOTIENT($C837-1,$B$7)+1)))","v":""},829,null,null,null,null,null,"-",null,null," : "]
[null,{"$f":"IF($B$7=0,\"\",IF(OR($B$7=0,QUOTIENT($C838-1,$B$7)+1>MAX($K$6,Planning!$E$3)),\"\",IF(OR($C838>$C$7,MOD($C838-1,$B$7)>0),\"\",QUOTIENT($C838-1,$B$7)+1)))","v":""},830,null,null,null,null,null,"-",null,null," : "]
[null,{"$f":"IF($B$7=0,\"\",IF(OR($B$7=0,QUOTIENT($C839-1,$B$7)+1>MAX($K$6,Planning!$E$3)),\"\",IF(OR($C839>$C$7,MOD($C839-1,$B$7)>0),\"\",QUOTIENT($C839-1,$B$7)+1)))","v":""},831,null,null,null,null,null,"-",null,null," : "]
[null,{"$f":"IF($B$7=0,\"\",IF(OR($B$7=0,QUOTIENT($C840-1,$B$7)+1>MAX($K$6,Planning!$E$3)),\"\",IF(OR($C840>$C$7,MOD($C840-1,$B$7)>0),\"\",QUOTIENT($C840-1,$B$7)+1)))","v":""},832,null,null,null,null,null,"-",null,null," : "]
[null,{"$f":"IF($B$7=0,\"\",IF(OR($B$7=0,QUOTIENT($C841-1,$B$7)+1>MAX($K$6,Planning!$E$3)),\"\",IF(OR($C841>$C$7,MOD($C841-1,$B$7)>0),\"\",QUOTIENT($C841-1,$B$7)+1)))","v":""},833,null,null,null,null,null,"-",null,null," : "]
[null,{"$f":"IF($B$7=0,\"\",IF(OR($B$7=0,QUOTIENT($C842-1,$B$7)+1>MAX($K$6,Planning!$E$3)),\"\",IF(OR($C842>$C$7,MOD($C842-1,$B$7)>0),\"\",QUOTIENT($C842-1,$B$7)+1)))","v":""},834,null,null,null,null,null,"-",null,null," : "]
[null,{"$f":"IF($B$7=0,\"\",IF(OR($B$7=0,QUOTIENT($C843-1,$B$7)+1>MAX($K$6,Planning!$E$3)),\"\",IF(OR($C843>$C$7,MOD($C843-1,$B$7)>0),\"\",QUOTIENT($C843-1,$B$7)+1)))","v":""},835,null,null,null,null,null,"-",null,null," : "]
[null,{"$f":"IF($B$7=0,\"\",IF(OR($B$7=0,QUOTIENT($C844-1,$B$7)+1>MAX($K$6,Planning!$E$3)),\"\",IF(OR($C844>$C$7,MOD($C844-1,$B$7)>0),\"\",QUOTIENT($C844-1,$B$7)+1)))","v":""},836,null,null,null,null,null,"-",null,null," : "]
[null,{"$f":"IF($B$7=0,\"\",IF(OR($B$7=0,QUOTIENT($C845-1,$B$7)+1>MAX($K$6,Planning!$E$3)),\"\",IF(OR($C845>$C$7,MOD($C845-1,$B$7)>0),\"\",QUOTIENT($C845-1,$B$7)+1)))","v":""},837,null,null,null,null,null,"-",null,null," : "]
[null,{"$f":"IF($B$7=0,\"\",IF(OR($B$7=0,QUOTIENT($C846-1,$B$7)+1>MAX($K$6,Planning!$E$3)),\"\",IF(OR($C846>$C$7,MOD($C846-1,$B$7)>0),\"\",QUOTIENT($C846-1,$B$7)+1)))","v":""},838,null,null,null,null,null,"-",null,null," : "]
[null,{"$f":"IF($B$7=0,\"\",IF(OR($B$7=0,QUOTIENT($C847-1,$B$7)+1>MAX($K$6,Planning!$E$3)),\"\",IF(OR($C847>$C$7,MOD($C847-1,$B$7)>0),\"\",QUOTIENT($C847-1,$B$7)+1)))","v":""},839,null,null,null,null,null,"-",null,null," : "]
[null,{"$f":"IF($B$7=0,\"\",IF(OR($B$7=0,QUOTIENT($C848-1,$B$7)+1>MAX($K$6,Planning!$E$3)),\"\",IF(OR($C848>$C$7,MOD($C848-1,$B$7)>0),\"\",QUOTIENT($C848-1,$B$7)+1)))","v":""},840,null,null,null,null,null,"-",null,null," : "]
[null,{"$f":"IF($B$7=0,\"\",IF(OR($B$7=0,QUOTIENT($C849-1,$B$7)+1>MAX($K$6,Planning!$E$3)),\"\",IF(OR($C849>$C$7,MOD($C849-1,$B$7)>0),\"\",QUOTIENT($C849-1,$B$7)+1)))","v":""},841,null,null,null,null,null,"-",null,null," : "]
[null,{"$f":"IF($B$7=0,\"\",IF(OR($B$7=0,QUOTIENT($C850-1,$B$7)+1>MAX($K$6,Planning!$E$3)),\"\",IF(OR($C850>$C$7,MOD($C850-1,$B$7)>0),\"\",QUOTIENT($C850-1,$B$7)+1)))","v":""},842,null,null,null,null,null,"-",null,null," : "]
[null,{"$f":"IF($B$7=0,\"\",IF(OR($B$7=0,QUOTIENT($C851-1,$B$7)+1>MAX($K$6,Planning!$E$3)),\"\",IF(OR($C851>$C$7,MOD($C851-1,$B$7)>0),\"\",QUOTIENT($C851-1,$B$7)+1)))","v":""},843,null,null,null,null,null,"-",null,null," : "]
[null,{"$f":"IF($B$7=0,\"\",IF(OR($B$7=0,QUOTIENT($C852-1,$B$7)+1>MAX($K$6,Planning!$E$3)),\"\",IF(OR($C852>$C$7,MOD($C852-1,$B$7)>0),\"\",QUOTIENT($C852-1,$B$7)+1)))","v":""},844,null,null,null,null,null,"-",null,null," : "]
[null,{"$f":"IF($B$7=0,\"\",IF(OR($B$7=0,QUOTIENT($C853-1,$B$7)+1>MAX($K$6,Planning!$E$3)),\"\",IF(OR($C853>$C$7,MOD($C853-1,$B$7)>0),\"\",QUOTIENT($C853-1,$B$7)+1)))","v":""},845,null,null,null,null,null,"-",null,null," : "]
[null,{"$f":"IF($B$7=0,\"\",IF(OR($B$7=0,QUOTIENT($C854-1,$B$7)+1>MAX($K$6,Planning!$E$3)),\"\",IF(OR($C854>$C$7,MOD($C854-1,$B$7)>0),\"\",QUOTIENT($C854-1,$B$7)+1)))","v":""},846,null,null,null,null,null,"-",null,null," : "]
[null,{"$f":"IF($B$7=0,\"\",IF(OR($B$7=0,QUOTIENT($C855-1,$B$7)+1>MAX($K$6,Planning!$E$3)),\"\",IF(OR($C855>$C$7,MOD($C855-1,$B$7)>0),\"\",QUOTIENT($C855-1,$B$7)+1)))","v":""},847,null,null,null,null,null,"-",null,null," : "]
[null,{"$f":"IF($B$7=0,\"\",IF(OR($B$7=0,QUOTIENT($C856-1,$B$7)+1>MAX($K$6,Planning!$E$3)),\"\",IF(OR($C856>$C$7,MOD($C856-1,$B$7)>0),\"\",QUOTIENT($C856-1,$B$7)+1)))","v":""},848,null,null,null,null,null,"-",null,null," : "]
[null,{"$f":"IF($B$7=0,\"\",IF(OR($B$7=0,QUOTIENT($C857-1,$B$7)+1>MAX($K$6,Planning!$E$3)),\"\",IF(OR($C857>$C$7,MOD($C857-1,$B$7)>0),\"\",QUOTIENT($C857-1,$B$7)+1)))","v":""},849,null,null,null,null,null,"-",null,null," : "]
[null,{"$f":"IF($B$7=0,\"\",IF(OR($B$7=0,QUOTIENT($C858-1,$B$7)+1>MAX($K$6,Planning!$E$3)),\"\",IF(OR($C858>$C$7,MOD($C858-1,$B$7)>0),\"\",QUOTIENT($C858-1,$B$7)+1)))","v":""},850,null,null,null,null,null,"-",null,null," : "]
[null,{"$f":"IF($B$7=0,\"\",IF(OR($B$7=0,QUOTIENT($C859-1,$B$7)+1>MAX($K$6,Planning!$E$3)),\"\",IF(OR($C859>$C$7,MOD($C859-1,$B$7)>0),\"\",QUOTIENT($C859-1,$B$7)+1)))","v":""},851,null,null,null,null,null,"-",null,null," : "]
[null,{"$f":"IF($B$7=0,\"\",IF(OR($B$7=0,QUOTIENT($C860-1,$B$7)+1>MAX($K$6,Planning!$E$3)),\"\",IF(OR($C860>$C$7,MOD($C860-1,$B$7)>0),\"\",QUOTIENT($C860-1,$B$7)+1)))","v":""},852,null,null,null,null,null,"-",null,null," : "]
[null,{"$f":"IF($B$7=0,\"\",IF(OR($B$7=0,QUOTIENT($C861-1,$B$7)+1>MAX($K$6,Planning!$E$3)),\"\",IF(OR($C861>$C$7,MOD($C861-1,$B$7)>0),\"\",QUOTIENT($C861-1,$B$7)+1)))","v":""},853,null,null,null,null,null,"-",null,null," : "]
[null,{"$f":"IF($B$7=0,\"\",IF(OR($B$7=0,QUOTIENT($C862-1,$B$7)+1>MAX($K$6,Planning!$E$3)),\"\",IF(OR($C862>$C$7,MOD($C862-1,$B$7)>0),\"\",QUOTIENT($C862-1,$B$7)+1)))","v":""},854,null,null,null,null,null,"-",null,null," : "]
[null,{"$f":"IF($B$7=0,\"\",IF(OR($B$7=0,QUOTIENT($C863-1,$B$7)+1>MAX($K$6,Planning!$E$3)),\"\",IF(OR($C863>$C$7,MOD($C863-1,$B$7)>0),\"\",QUOTIENT($C863-1,$B$7)+1)))","v":""},855,null,null,null,null,null,"-",null,null," : "]
[null,{"$f":"IF($B$7=0,\"\",IF(OR($B$7=0,QUOTIENT($C864-1,$B$7)+1>MAX($K$6,Planning!$E$3)),\"\",IF(OR($C864>$C$7,MOD($C864-1,$B$7)>0),\"\",QUOTIENT($C864-1,$B$7)+1)))","v":""},856,null,null,null,null,null,"-",null,null," : "]
[null,{"$f":"IF($B$7=0,\"\",IF(OR($B$7=0,QUOTIENT($C865-1,$B$7)+1>MAX($K$6,Planning!$E$3)),\"\",IF(OR($C865>$C$7,MOD($C865-1,$B$7)>0),\"\",QUOTIENT($C865-1,$B$7)+1)))","v":""},857,null,null,null,null,null,"-",null,null," : "]
[null,{"$f":"IF($B$7=0,\"\",IF(OR($B$7=0,QUOTIENT($C866-1,$B$7)+1>MAX($K$6,Planning!$E$3)),\"\",IF(OR($C866>$C$7,MOD($C866-1,$B$7)>0),\"\",QUOTIENT($C866-1,$B$7)+1)))","v":""},858,null,null,null,null,null,"-",null,null," : "]
[null,{"$f":"IF($B$7=0,\"\",IF(OR($B$7=0,QUOTIENT($C867-1,$B$7)+1>MAX($K$6,Planning!$E$3)),\"\",IF(OR($C867>$C$7,MOD($C867-1,$B$7)>0),\"\",QUOTIENT($C867-1,$B$7)+1)))","v":""},859,null,null,null,null,null,"-",null,null," : "]
[null,{"$f":"IF($B$7=0,\"\",IF(OR($B$7=0,QUOTIENT($C868-1,$B$7)+1>MAX($K$6,Planning!$E$3)),\"\",IF(OR($C868>$C$7,MOD($C868-1,$B$7)>0),\"\",QUOTIENT($C868-1,$B$7)+1)))","v":""},860,null,null,null,null,null,"-",null,null," : "]
[null,{"$f":"IF($B$7=0,\"\",IF(OR($B$7=0,QUOTIENT($C869-1,$B$7)+1>MAX($K$6,Planning!$E$3)),\"\",IF(OR($C869>$C$7,MOD($C869-1,$B$7)>0),\"\",QUOTIENT($C869-1,$B$7)+1)))","v":""},861,null,null,null,null,null,"-",null,null," : "]
[null,{"$f":"IF($B$7=0,\"\",IF(OR($B$7=0,QUOTIENT($C870-1,$B$7)+1>MAX($K$6,Planning!$E$3)),\"\",IF(OR($C870>$C$7,MOD($C870-1,$B$7)>0),\"\",QUOTIENT($C870-1,$B$7)+1)))","v":""},862,null,null,null,null,null,"-",null,null," : "]
[null,{"$f":"IF($B$7=0,\"\",IF(OR($B$7=0,QUOTIENT($C871-1,$B$7)+1>MAX($K$6,Planning!$E$3)),\"\",IF(OR($C871>$C$7,MOD($C871-1,$B$7)>0),\"\",QUOTIENT($C871-1,$B$7)+1)))","v":""},863,null,null,null,null,null,"-",null,null," : "]
[null,{"$f":"IF($B$7=0,\"\",IF(OR($B$7=0,QUOTIENT($C872-1,$B$7)+1>MAX($K$6,Planning!$E$3)),\"\",IF(OR($C872>$C$7,MOD($C872-1,$B$7)>0),\"\",QUOTIENT($C872-1,$B$7)+1)))","v":""},864,null,null,null,null,null,"-",null,null," : "]
[null,{"$f":"IF($B$7=0,\"\",IF(OR($B$7=0,QUOTIENT($C873-1,$B$7)+1>MAX($K$6,Planning!$E$3)),\"\",IF(OR($C873>$C$7,MOD($C873-1,$B$7)>0),\"\",QUOTIENT($C873-1,$B$7)+1)))","v":""},865,null,null,null,null,null,"-",null,null," : "]
[null,{"$f":"IF($B$7=0,\"\",IF(OR($B$7=0,QUOTIENT($C874-1,$B$7)+1>MAX($K$6,Planning!$E$3)),\"\",IF(OR($C874>$C$7,MOD($C874-1,$B$7)>0),\"\",QUOTIENT($C874-1,$B$7)+1)))","v":""},866,null,null,null,null,null,"-",null,null," : "]
[null,{"$f":"IF($B$7=0,\"\",IF(OR($B$7=0,QUOTIENT($C875-1,$B$7)+1>MAX($K$6,Planning!$E$3)),\"\",IF(OR($C875>$C$7,MOD($C875-1,$B$7)>0),\"\",QUOTIENT($C875-1,$B$7)+1)))","v":""},867,null,null,null,null,null,"-",null,null," : "]
[null,{"$f":"IF($B$7=0,\"\",IF(OR($B$7=0,QUOTIENT($C876-1,$B$7)+1>MAX($K$6,Planning!$E$3)),\"\",IF(OR($C876>$C$7,MOD($C876-1,$B$7)>0),\"\",QUOTIENT($C876-1,$B$7)+1)))","v":""},868,null,null,null,null,null,"-",null,null," : "]
[null,{"$f":"IF($B$7=0,\"\",IF(OR($B$7=0,QUOTIENT($C877-1,$B$7)+1>MAX($K$6,Planning!$E$3)),\"\",IF(OR($C877>$C$7,MOD($C877-1,$B$7)>0),\"\",QUOTIENT($C877-1,$B$7)+1)))","v":""},869,null,null,null,null,null,"-",null,null," : "]
[null,{"$f":"IF($B$7=0,\"\",IF(OR($B$7=0,QUOTIENT($C878-1,$B$7)+1>MAX($K$6,Planning!$E$3)),\"\",IF(OR($C878>$C$7,MOD($C878-1,$B$7)>0),\"\",QUOTIENT($C878-1,$B$7)+1)))","v":""},870,null,null,null,null,null,"-",null,null," : "]
[null,{"$f":"IF($B$7=0,\"\",IF(OR($B$7=0,QUOTIENT($C879-1,$B$7)+1>MAX($K$6,Planning!$E$3)),\"\",IF(OR($C879>$C$7,MOD($C879-1,$B$7)>0),\"\",QUOTIENT($C879-1,$B$7)+1)))","v":""},871,null,null,null,null,null,"-",null,null," : "]
[null,{"$f":"IF($B$7=0,\"\",IF(OR($B$7=0,QUOTIENT($C880-1,$B$7)+1>MAX($K$6,Planning!$E$3)),\"\",IF(OR($C880>$C$7,MOD($C880-1,$B$7)>0),\"\",QUOTIENT($C880-1,$B$7)+1)))","v":""},872,null,null,null,null,null,"-",null,null," : "]
[null,{"$f":"IF($B$7=0,\"\",IF(OR($B$7=0,QUOTIENT($C881-1,$B$7)+1>MAX($K$6,Planning!$E$3)),\"\",IF(OR($C881>$C$7,MOD($C881-1,$B$7)>0),\"\",QUOTIENT($C881-1,$B$7)+1)))","v":""},873,null,null,null,null,null,"-",null,null," : "]
[null,{"$f":"IF($B$7=0,\"\",IF(OR($B$7=0,QUOTIENT($C882-1,$B$7)+1>MAX($K$6,Planning!$E$3)),\"\",IF(OR($C882>$C$7,MOD($C882-1,$B$7)>0),\"\",QUOTIENT($C882-1,$B$7)+1)))","v":""},874,null,null,null,null,null,"-",null,null," : "]
[null,{"$f":"IF($B$7=0,\"\",IF(OR($B$7=0,QUOTIENT($C883-1,$B$7)+1>MAX($K$6,Planning!$E$3)),\"\",IF(OR($C883>$C$7,MOD($C883-1,$B$7)>0),\"\",QUOTIENT($C883-1,$B$7)+1)))","v":""},875,null,null,null,null,null,"-",null,null," : "]
[null,{"$f":"IF($B$7=0,\"\",IF(OR($B$7=0,QUOTIENT($C884-1,$B$7)+1>MAX($K$6,Planning!$E$3)),\"\",IF(OR($C884>$C$7,MOD($C884-1,$B$7)>0),\"\",QUOTIENT($C884-1,$B$7)+1)))","v":""},876,null,null,null,null,null,"-",null,null," : "]
[null,{"$f":"IF($B$7=0,\"\",IF(OR($B$7=0,QUOTIENT($C885-1,$B$7)+1>MAX($K$6,Planning!$E$3)),\"\",IF(OR($C885>$C$7,MOD($C885-1,$B$7)>0),\"\",QUOTIENT($C885-1,$B$7)+1)))","v":""},877,null,null,null,null,null,"-",null,null," : "]
[null,{"$f":"IF($B$7=0,\"\",IF(OR($B$7=0,QUOTIENT($C886-1,$B$7)+1>MAX($K$6,Planning!$E$3)),\"\",IF(OR($C886>$C$7,MOD($C886-1,$B$7)>0),\"\",QUOTIENT($C886-1,$B$7)+1)))","v":""},878,null,null,null,null,null,"-",null,null," : "]
[null,{"$f":"IF($B$7=0,\"\",IF(OR($B$7=0,QUOTIENT($C887-1,$B$7)+1>MAX($K$6,Planning!$E$3)),\"\",IF(OR($C887>$C$7,MOD($C887-1,$B$7)>0),\"\",QUOTIENT($C887-1,$B$7)+1)))","v":""},879,null,null,null,null,null,"-",null,null," : "]
[null,{"$f":"IF($B$7=0,\"\",IF(OR($B$7=0,QUOTIENT($C888-1,$B$7)+1>MAX($K$6,Planning!$E$3)),\"\",IF(OR($C888>$C$7,MOD($C888-1,$B$7)>0),\"\",QUOTIENT($C888-1,$B$7)+1)))","v":""},880,null,null,null,null,null,"-",null,null," : "]
[null,{"$f":"IF($B$7=0,\"\",IF(OR($B$7=0,QUOTIENT($C889-1,$B$7)+1>MAX($K$6,Planning!$E$3)),\"\",IF(OR($C889>$C$7,MOD($C889-1,$B$7)>0),\"\",QUOTIENT($C889-1,$B$7)+1)))","v":""},881,null,null,null,null,null,"-",null,null," : "]
[null,{"$f":"IF($B$7=0,\"\",IF(OR($B$7=0,QUOTIENT($C890-1,$B$7)+1>MAX($K$6,Planning!$E$3)),\"\",IF(OR($C890>$C$7,MOD($C890-1,$B$7)>0),\"\",QUOTIENT($C890-1,$B$7)+1)))","v":""},882,null,null,null,null,null,"-",null,null," : "]
[null,{"$f":"IF($B$7=0,\"\",IF(OR($B$7=0,QUOTIENT($C891-1,$B$7)+1>MAX($K$6,Planning!$E$3)),\"\",IF(OR($C891>$C$7,MOD($C891-1,$B$7)>0),\"\",QUOTIENT($C891-1,$B$7)+1)))","v":""},883,null,null,null,null,null,"-",null,null," : "]
[null,{"$f":"IF($B$7=0,\"\",IF(OR($B$7=0,QUOTIENT($C892-1,$B$7)+1>MAX($K$6,Planning!$E$3)),\"\",IF(OR($C892>$C$7,MOD($C892-1,$B$7)>0),\"\",QUOTIENT($C892-1,$B$7)+1)))","v":""},884,null,null,null,null,null,"-",null,null," : "]
[null,{"$f":"IF($B$7=0,\"\",IF(OR($B$7=0,QUOTIENT($C893-1,$B$7)+1>MAX($K$6,Planning!$E$3)),\"\",IF(OR($C893>$C$7,MOD($C893-1,$B$7)>0),\"\",QUOTIENT($C893-1,$B$7)+1)))","v":""},885,null,null,null,null,null,"-",null,null," : "]
[null,{"$f":"IF($B$7=0,\"\",IF(OR($B$7=0,QUOTIENT($C894-1,$B$7)+1>MAX($K$6,Planning!$E$3)),\"\",IF(OR($C894>$C$7,MOD($C894-1,$B$7)>0),\"\",QUOTIENT($C894-1,$B$7)+1)))","v":""},886,null,null,null,null,null,"-",null,null," : "]
[null,{"$f":"IF($B$7=0,\"\",IF(OR($B$7=0,QUOTIENT($C895-1,$B$7)+1>MAX($K$6,Planning!$E$3)),\"\",IF(OR($C895>$C$7,MOD($C895-1,$B$7)>0),\"\",QUOTIENT($C895-1,$B$7)+1)))","v":""},887,null,null,null,null,null,"-",null,null," : "]
[null,{"$f":"IF($B$7=0,\"\",IF(OR($B$7=0,QUOTIENT($C896-1,$B$7)+1>MAX($K$6,Planning!$E$3)),\"\",IF(OR($C896>$C$7,MOD($C896-1,$B$7)>0),\"\",QUOTIENT($C896-1,$B$7)+1)))","v":""},888,null,null,null,null,null,"-",null,null," : "]
[null,{"$f":"IF($B$7=0,\"\",IF(OR($B$7=0,QUOTIENT($C897-1,$B$7)+1>MAX($K$6,Planning!$E$3)),\"\",IF(OR($C897>$C$7,MOD($C897-1,$B$7)>0),\"\",QUOTIENT($C897-1,$B$7)+1)))","v":""},889,null,null,null,null,null,"-",null,null," : "]
[null,{"$f":"IF($B$7=0,\"\",IF(OR($B$7=0,QUOTIENT($C898-1,$B$7)+1>MAX($K$6,Planning!$E$3)),\"\",IF(OR($C898>$C$7,MOD($C898-1,$B$7)>0),\"\",QUOTIENT($C898-1,$B$7)+1)))","v":""},890,null,null,null,null,null,"-",null,null," : "]
[null,{"$f":"IF($B$7=0,\"\",IF(OR($B$7=0,QUOTIENT($C899-1,$B$7)+1>MAX($K$6,Planning!$E$3)),\"\",IF(OR($C899>$C$7,MOD($C899-1,$B$7)>0),\"\",QUOTIENT($C899-1,$B$7)+1)))","v":""},891,null,null,null,null,null,"-",null,null," : "]
[null,{"$f":"IF($B$7=0,\"\",IF(OR($B$7=0,QUOTIENT($C900-1,$B$7)+1>MAX($K$6,Planning!$E$3)),\"\",IF(OR($C900>$C$7,MOD($C900-1,$B$7)>0),\"\",QUOTIENT($C900-1,$B$7)+1)))","v":""},892,null,null,null,null,null,"-",null,null," : "]
[null,{"$f":"IF($B$7=0,\"\",IF(OR($B$7=0,QUOTIENT($C901-1,$B$7)+1>MAX($K$6,Planning!$E$3)),\"\",IF(OR($C901>$C$7,MOD($C901-1,$B$7)>0),\"\",QUOTIENT($C901-1,$B$7)+1)))","v":""},893,null,null,null,null,null,"-",null,null," : "]
[null,{"$f":"IF($B$7=0,\"\",IF(OR($B$7=0,QUOTIENT($C902-1,$B$7)+1>MAX($K$6,Planning!$E$3)),\"\",IF(OR($C902>$C$7,MOD($C902-1,$B$7)>0),\"\",QUOTIENT($C902-1,$B$7)+1)))","v":""},894,null,null,null,null,null,"-",null,null," : "]
[null,{"$f":"IF($B$7=0,\"\",IF(OR($B$7=0,QUOTIENT($C903-1,$B$7)+1>MAX($K$6,Planning!$E$3)),\"\",IF(OR($C903>$C$7,MOD($C903-1,$B$7)>0),\"\",QUOTIENT($C903-1,$B$7)+1)))","v":""},895,null,null,null,null,null,"-",null,null," : "]
[null,{"$f":"IF($B$7=0,\"\",IF(OR($B$7=0,QUOTIENT($C904-1,$B$7)+1>MAX($K$6,Planning!$E$3)),\"\",IF(OR($C904>$C$7,MOD($C904-1,$B$7)>0),\"\",QUOTIENT($C904-1,$B$7)+1)))","v":""},896,null,null,null,null,null,"-",null,null," : "]
[null,{"$f":"IF($B$7=0,\"\",IF(OR($B$7=0,QUOTIENT($C905-1,$B$7)+1>MAX($K$6,Planning!$E$3)),\"\",IF(OR($C905>$C$7,MOD($C905-1,$B$7)>0),\"\",QUOTIENT($C905-1,$B$7)+1)))","v":""},897,null,null,null,null,null,"-",null,null," : "]
[null,{"$f":"IF($B$7=0,\"\",IF(OR($B$7=0,QUOTIENT($C906-1,$B$7)+1>MAX($K$6,Planning!$E$3)),\"\",IF(OR($C906>$C$7,MOD($C906-1,$B$7)>0),\"\",QUOTIENT($C906-1,$B$7)+1)))","v":""},898,null,null,null,null,null,"-",null,null," : "]
[null,{"$f":"IF($B$7=0,\"\",IF(OR($B$7=0,QUOTIENT($C907-1,$B$7)+1>MAX($K$6,Planning!$E$3)),\"\",IF(OR($C907>$C$7,MOD($C907-1,$B$7)>0),\"\",QUOTIENT($C907-1,$B$7)+1)))","v":""},899,null,null,null,null,null,"-",null,null," : "]
[null,{"$f":"IF($B$7=0,\"\",IF(OR($B$7=0,QUOTIENT($C908-1,$B$7)+1>MAX($K$6,Planning!$E$3)),\"\",IF(OR($C908>$C$7,MOD($C908-1,$B$7)>0),\"\",QUOTIENT($C908-1,$B$7)+1)))","v":""},900,null,null,null,null,null,"-",null,null," : "]
[null,{"$f":"IF($B$7=0,\"\",IF(OR($B$7=0,QUOTIENT($C909-1,$B$7)+1>MAX($K$6,Planning!$E$3)),\"\",IF(OR($C909>$C$7,MOD($C909-1,$B$7)>0),\"\",QUOTIENT($C909-1,$B$7)+1)))","v":""},901,null,null,null,null,null,"-",null,null," : "]
[null,{"$f":"IF($B$7=0,\"\",IF(OR($B$7=0,QUOTIENT($C910-1,$B$7)+1>MAX($K$6,Planning!$E$3)),\"\",IF(OR($C910>$C$7,MOD($C910-1,$B$7)>0),\"\",QUOTIENT($C910-1,$B$7)+1)))","v":""},902,null,null,null,null,null,"-",null,null," : "]
[null,{"$f":"IF($B$7=0,\"\",IF(OR($B$7=0,QUOTIENT($C911-1,$B$7)+1>MAX($K$6,Planning!$E$3)),\"\",IF(OR($C911>$C$7,MOD($C911-1,$B$7)>0),\"\",QUOTIENT($C911-1,$B$7)+1)))","v":""},903,null,null,null,null,null,"-",null,null," : "]
[null,{"$f":"IF($B$7=0,\"\",IF(OR($B$7=0,QUOTIENT($C912-1,$B$7)+1>MAX($K$6,Planning!$E$3)),\"\",IF(OR($C912>$C$7,MOD($C912-1,$B$7)>0),\"\",QUOTIENT($C912-1,$B$7)+1)))","v":""},904,null,null,null,null,null,"-",null,null," : "]
[null,{"$f":"IF($B$7=0,\"\",IF(OR($B$7=0,QUOTIENT($C913-1,$B$7)+1>MAX($K$6,Planning!$E$3)),\"\",IF(OR($C913>$C$7,MOD($C913-1,$B$7)>0),\"\",QUOTIENT($C913-1,$B$7)+1)))","v":""},905,null,null,null,null,null,"-",null,null," : "]
[null,{"$f":"IF($B$7=0,\"\",IF(OR($B$7=0,QUOTIENT($C914-1,$B$7)+1>MAX($K$6,Planning!$E$3)),\"\",IF(OR($C914>$C$7,MOD($C914-1,$B$7)>0),\"\",QUOTIENT($C914-1,$B$7)+1)))","v":""},906,null,null,null,null,null,"-",null,null," : "]
[null,{"$f":"IF($B$7=0,\"\",IF(OR($B$7=0,QUOTIENT($C915-1,$B$7)+1>MAX($K$6,Planning!$E$3)),\"\",IF(OR($C915>$C$7,MOD($C915-1,$B$7)>0),\"\",QUOTIENT($C915-1,$B$7)+1)))","v":""},907,null,null,null,null,null,"-",null,null," : "]
[null,{"$f":"IF($B$7=0,\"\",IF(OR($B$7=0,QUOTIENT($C916-1,$B$7)+1>MAX($K$6,Planning!$E$3)),\"\",IF(OR($C916>$C$7,MOD($C916-1,$B$7)>0),\"\",QUOTIENT($C916-1,$B$7)+1)))","v":""},908,null,null,null,null,null,"-",null,null," : "]
[null,{"$f":"IF($B$7=0,\"\",IF(OR($B$7=0,QUOTIENT($C917-1,$B$7)+1>MAX($K$6,Planning!$E$3)),\"\",IF(OR($C917>$C$7,MOD($C917-1,$B$7)>0),\"\",QUOTIENT($C917-1,$B$7)+1)))","v":""},909,null,null,null,null,null,"-",null,null," : "]
[null,{"$f":"IF($B$7=0,\"\",IF(OR($B$7=0,QUOTIENT($C918-1,$B$7)+1>MAX($K$6,Planning!$E$3)),\"\",IF(OR($C918>$C$7,MOD($C918-1,$B$7)>0),\"\",QUOTIENT($C918-1,$B$7)+1)))","v":""},910,null,null,null,null,null,"-",null,null," : "]
[null,{"$f":"IF($B$7=0,\"\",IF(OR($B$7=0,QUOTIENT($C919-1,$B$7)+1>MAX($K$6,Planning!$E$3)),\"\",IF(OR($C919>$C$7,MOD($C919-1,$B$7)>0),\"\",QUOTIENT($C919-1,$B$7)+1)))","v":""},911,null,null,null,null,null,"-",null,null," : "]
[null,{"$f":"IF($B$7=0,\"\",IF(OR($B$7=0,QUOTIENT($C920-1,$B$7)+1>MAX($K$6,Planning!$E$3)),\"\",IF(OR($C920>$C$7,MOD($C920-1,$B$7)>0),\"\",QUOTIENT($C920-1,$B$7)+1)))","v":""},912,null,null,null,null,null,"-",null,null," : "]
[null,{"$f":"IF($B$7=0,\"\",IF(OR($B$7=0,QUOTIENT($C921-1,$B$7)+1>MAX($K$6,Planning!$E$3)),\"\",IF(OR($C921>$C$7,MOD($C921-1,$B$7)>0),\"\",QUOTIENT($C921-1,$B$7)+1)))","v":""},913,null,null,null,null,null,"-",null,null," : "]
[null,{"$f":"IF($B$7=0,\"\",IF(OR($B$7=0,QUOTIENT($C922-1,$B$7)+1>MAX($K$6,Planning!$E$3)),\"\",IF(OR($C922>$C$7,MOD($C922-1,$B$7)>0),\"\",QUOTIENT($C922-1,$B$7)+1)))","v":""},914,null,null,null,null,null,"-",null,null," : "]
[null,{"$f":"IF($B$7=0,\"\",IF(OR($B$7=0,QUOTIENT($C923-1,$B$7)+1>MAX($K$6,Planning!$E$3)),\"\",IF(OR($C923>$C$7,MOD($C923-1,$B$7)>0),\"\",QUOTIENT($C923-1,$B$7)+1)))","v":""},915,null,null,null,null,null,"-",null,null," : "]
[null,{"$f":"IF($B$7=0,\"\",IF(OR($B$7=0,QUOTIENT($C924-1,$B$7)+1>MAX($K$6,Planning!$E$3)),\"\",IF(OR($C924>$C$7,MOD($C924-1,$B$7)>0),\"\",QUOTIENT($C924-1,$B$7)+1)))","v":""},916,null,null,null,null,null,"-",null,null," : "]
[null,{"$f":"IF($B$7=0,\"\",IF(OR($B$7=0,QUOTIENT($C925-1,$B$7)+1>MAX($K$6,Planning!$E$3)),\"\",IF(OR($C925>$C$7,MOD($C925-1,$B$7)>0),\"\",QUOTIENT($C925-1,$B$7)+1)))","v":""},917,null,null,null,null,null,"-",null,null," : "]
[null,{"$f":"IF($B$7=0,\"\",IF(OR($B$7=0,QUOTIENT($C926-1,$B$7)+1>MAX($K$6,Planning!$E$3)),\"\",IF(OR($C926>$C$7,MOD($C926-1,$B$7)>0),\"\",QUOTIENT($C926-1,$B$7)+1)))","v":""},918,null,null,null,null,null,"-",null,null," : "]
[null,{"$f":"IF($B$7=0,\"\",IF(OR($B$7=0,QUOTIENT($C927-1,$B$7)+1>MAX($K$6,Planning!$E$3)),\"\",IF(OR($C927>$C$7,MOD($C927-1,$B$7)>0),\"\",QUOTIENT($C927-1,$B$7)+1)))","v":""},919,null,null,null,null,null,"-",null,null," : "]
[null,{"$f":"IF($B$7=0,\"\",IF(OR($B$7=0,QUOTIENT($C928-1,$B$7)+1>MAX($K$6,Planning!$E$3)),\"\",IF(OR($C928>$C$7,MOD($C928-1,$B$7)>0),\"\",QUOTIENT($C928-1,$B$7)+1)))","v":""},920,null,null,null,null,null,"-",null,null," : "]
[null,{"$f":"IF($B$7=0,\"\",IF(OR($B$7=0,QUOTIENT($C929-1,$B$7)+1>MAX($K$6,Planning!$E$3)),\"\",IF(OR($C929>$C$7,MOD($C929-1,$B$7)>0),\"\",QUOTIENT($C929-1,$B$7)+1)))","v":""},921,null,null,null,null,null,"-",null,null," : "]
[null,{"$f":"IF($B$7=0,\"\",IF(OR($B$7=0,QUOTIENT($C930-1,$B$7)+1>MAX($K$6,Planning!$E$3)),\"\",IF(OR($C930>$C$7,MOD($C930-1,$B$7)>0),\"\",QUOTIENT($C930-1,$B$7)+1)))","v":""},922,null,null,null,null,null,"-",null,null," : "]
[null,{"$f":"IF($B$7=0,\"\",IF(OR($B$7=0,QUOTIENT($C931-1,$B$7)+1>MAX($K$6,Planning!$E$3)),\"\",IF(OR($C931>$C$7,MOD($C931-1,$B$7)>0),\"\",QUOTIENT($C931-1,$B$7)+1)))","v":""},923,null,null,null,null,null,"-",null,null," : "]
[null,{"$f":"IF($B$7=0,\"\",IF(OR($B$7=0,QUOTIENT($C932-1,$B$7)+1>MAX($K$6,Planning!$E$3)),\"\",IF(OR($C932>$C$7,MOD($C932-1,$B$7)>0),\"\",QUOTIENT($C932-1,$B$7)+1)))","v":""},924,null,null,null,null,null,"-",null,null," : "]
[null,{"$f":"IF($B$7=0,\"\",IF(OR($B$7=0,QUOTIENT($C933-1,$B$7)+1>MAX($K$6,Planning!$E$3)),\"\",IF(OR($C933>$C$7,MOD($C933-1,$B$7)>0),\"\",QUOTIENT($C933-1,$B$7)+1)))","v":""},925,null,null,null,null,null,"-",null,null," : "]
[null,{"$f":"IF($B$7=0,\"\",IF(OR($B$7=0,QUOTIENT($C934-1,$B$7)+1>MAX($K$6,Planning!$E$3)),\"\",IF(OR($C934>$C$7,MOD($C934-1,$B$7)>0),\"\",QUOTIENT($C934-1,$B$7)+1)))","v":""},926,null,null,null,null,null,"-",null,null," : "]
[null,{"$f":"IF($B$7=0,\"\",IF(OR($B$7=0,QUOTIENT($C935-1,$B$7)+1>MAX($K$6,Planning!$E$3)),\"\",IF(OR($C935>$C$7,MOD($C935-1,$B$7)>0),\"\",QUOTIENT($C935-1,$B$7)+1)))","v":""},927,null,null,null,null,null,"-",null,null," : "]
[null,{"$f":"IF($B$7=0,\"\",IF(OR($B$7=0,QUOTIENT($C936-1,$B$7)+1>MAX($K$6,Planning!$E$3)),\"\",IF(OR($C936>$C$7,MOD($C936-1,$B$7)>0),\"\",QUOTIENT($C936-1,$B$7)+1)))","v":""},928,null,null,null,null,null,"-",null,null," : "]
[null,{"$f":"IF($B$7=0,\"\",IF(OR($B$7=0,QUOTIENT($C937-1,$B$7)+1>MAX($K$6,Planning!$E$3)),\"\",IF(OR($C937>$C$7,MOD($C937-1,$B$7)>0),\"\",QUOTIENT($C937-1,$B$7)+1)))","v":""},929,null,null,null,null,null,"-",null,null," : "]
[null,{"$f":"IF($B$7=0,\"\",IF(OR($B$7=0,QUOTIENT($C938-1,$B$7)+1>MAX($K$6,Planning!$E$3)),\"\",IF(OR($C938>$C$7,MOD($C938-1,$B$7)>0),\"\",QUOTIENT($C938-1,$B$7)+1)))","v":""},930,null,null,null,null,null,"-",null,null," : "]
[null,{"$f":"IF($B$7=0,\"\",IF(OR($B$7=0,QUOTIENT($C939-1,$B$7)+1>MAX($K$6,Planning!$E$3)),\"\",IF(OR($C939>$C$7,MOD($C939-1,$B$7)>0),\"\",QUOTIENT($C939-1,$B$7)+1)))","v":""},931,null,null,null,null,null,"-",null,null," : "]
[null,{"$f":"IF($B$7=0,\"\",IF(OR($B$7=0,QUOTIENT($C940-1,$B$7)+1>MAX($K$6,Planning!$E$3)),\"\",IF(OR($C940>$C$7,MOD($C940-1,$B$7)>0),\"\",QUOTIENT($C940-1,$B$7)+1)))","v":""},932,null,null,null,null,null,"-",null,null," : "]
[null,{"$f":"IF($B$7=0,\"\",IF(OR($B$7=0,QUOTIENT($C941-1,$B$7)+1>MAX($K$6,Planning!$E$3)),\"\",IF(OR($C941>$C$7,MOD($C941-1,$B$7)>0),\"\",QUOTIENT($C941-1,$B$7)+1)))","v":""},933,null,null,null,null,null,"-",null,null," : "]
[null,{"$f":"IF($B$7=0,\"\",IF(OR($B$7=0,QUOTIENT($C942-1,$B$7)+1>MAX($K$6,Planning!$E$3)),\"\",IF(OR($C942>$C$7,MOD($C942-1,$B$7)>0),\"\",QUOTIENT($C942-1,$B$7)+1)))","v":""},934,null,null,null,null,null,"-",null,null," : "]
[null,{"$f":"IF($B$7=0,\"\",IF(OR($B$7=0,QUOTIENT($C943-1,$B$7)+1>MAX($K$6,Planning!$E$3)),\"\",IF(OR($C943>$C$7,MOD($C943-1,$B$7)>0),\"\",QUOTIENT($C943-1,$B$7)+1)))","v":""},935,null,null,null,null,null,"-",null,null," : "]
[null,{"$f":"IF($B$7=0,\"\",IF(OR($B$7=0,QUOTIENT($C944-1,$B$7)+1>MAX($K$6,Planning!$E$3)),\"\",IF(OR($C944>$C$7,MOD($C944-1,$B$7)>0),\"\",QUOTIENT($C944-1,$B$7)+1)))","v":""},936,null,null,null,null,null,"-",null,null," : "]
[null,{"$f":"IF($B$7=0,\"\",IF(OR($B$7=0,QUOTIENT($C945-1,$B$7)+1>MAX($K$6,Planning!$E$3)),\"\",IF(OR($C945>$C$7,MOD($C945-1,$B$7)>0),\"\",QUOTIENT($C945-1,$B$7)+1)))","v":""},937,null,null,null,null,null,"-",null,null," : "]
[null,{"$f":"IF($B$7=0,\"\",IF(OR($B$7=0,QUOTIENT($C946-1,$B$7)+1>MAX($K$6,Planning!$E$3)),\"\",IF(OR($C946>$C$7,MOD($C946-1,$B$7)>0),\"\",QUOTIENT($C946-1,$B$7)+1)))","v":""},938,null,null,null,null,null,"-",null,null," : "]
[null,{"$f":"IF($B$7=0,\"\",IF(OR($B$7=0,QUOTIENT($C947-1,$B$7)+1>MAX($K$6,Planning!$E$3)),\"\",IF(OR($C947>$C$7,MOD($C947-1,$B$7)>0),\"\",QUOTIENT($C947-1,$B$7)+1)))","v":""},939,null,null,null,null,null,"-",null,null," : "]
[null,{"$f":"IF($B$7=0,\"\",IF(OR($B$7=0,QUOTIENT($C948-1,$B$7)+1>MAX($K$6,Planning!$E$3)),\"\",IF(OR($C948>$C$7,MOD($C948-1,$B$7)>0),\"\",QUOTIENT($C948-1,$B$7)+1)))","v":""},940,null,null,null,null,null,"-",null,null," : "]
[null,{"$f":"IF($B$7=0,\"\",IF(OR($B$7=0,QUOTIENT($C949-1,$B$7)+1>MAX($K$6,Planning!$E$3)),\"\",IF(OR($C949>$C$7,MOD($C949-1,$B$7)>0),\"\",QUOTIENT($C949-1,$B$7)+1)))","v":""},941,null,null,null,null,null,"-",null,null," : "]
[null,{"$f":"IF($B$7=0,\"\",IF(OR($B$7=0,QUOTIENT($C950-1,$B$7)+1>MAX($K$6,Planning!$E$3)),\"\",IF(OR($C950>$C$7,MOD($C950-1,$B$7)>0),\"\",QUOTIENT($C950-1,$B$7)+1)))","v":""},942,null,null,null,null,null,"-",null,null," : "]
[null,{"$f":"IF($B$7=0,\"\",IF(OR($B$7=0,QUOTIENT($C951-1,$B$7)+1>MAX($K$6,Planning!$E$3)),\"\",IF(OR($C951>$C$7,MOD($C951-1,$B$7)>0),\"\",QUOTIENT($C951-1,$B$7)+1)))","v":""},943,null,null,null,null,null,"-",null,null," : "]
[null,{"$f":"IF($B$7=0,\"\",IF(OR($B$7=0,QUOTIENT($C952-1,$B$7)+1>MAX($K$6,Planning!$E$3)),\"\",IF(OR($C952>$C$7,MOD($C952-1,$B$7)>0),\"\",QUOTIENT($C952-1,$B$7)+1)))","v":""},944,null,null,null,null,null,"-",null,null," : "]
[null,{"$f":"IF($B$7=0,\"\",IF(OR($B$7=0,QUOTIENT($C953-1,$B$7)+1>MAX($K$6,Planning!$E$3)),\"\",IF(OR($C953>$C$7,MOD($C953-1,$B$7)>0),\"\",QUOTIENT($C953-1,$B$7)+1)))","v":""},945,null,null,null,null,null,"-",null,null," : "]
[null,{"$f":"IF($B$7=0,\"\",IF(OR($B$7=0,QUOTIENT($C954-1,$B$7)+1>MAX($K$6,Planning!$E$3)),\"\",IF(OR($C954>$C$7,MOD($C954-1,$B$7)>0),\"\",QUOTIENT($C954-1,$B$7)+1)))","v":""},946,null,null,null,null,null,"-",null,null," : "]
[null,{"$f":"IF($B$7=0,\"\",IF(OR($B$7=0,QUOTIENT($C955-1,$B$7)+1>MAX($K$6,Planning!$E$3)),\"\",IF(OR($C955>$C$7,MOD($C955-1,$B$7)>0),\"\",QUOTIENT($C955-1,$B$7)+1)))","v":""},947,null,null,null,null,null,"-",null,null," : "]
[null,{"$f":"IF($B$7=0,\"\",IF(OR($B$7=0,QUOTIENT($C956-1,$B$7)+1>MAX($K$6,Planning!$E$3)),\"\",IF(OR($C956>$C$7,MOD($C956-1,$B$7)>0),\"\",QUOTIENT($C956-1,$B$7)+1)))","v":""},948,null,null,null,null,null,"-",null,null," : "]
[null,{"$f":"IF($B$7=0,\"\",IF(OR($B$7=0,QUOTIENT($C957-1,$B$7)+1>MAX($K$6,Planning!$E$3)),\"\",IF(OR($C957>$C$7,MOD($C957-1,$B$7)>0),\"\",QUOTIENT($C957-1,$B$7)+1)))","v":""},949,null,null,null,null,null,"-",null,null," : "]
[null,{"$f":"IF($B$7=0,\"\",IF(OR($B$7=0,QUOTIENT($C958-1,$B$7)+1>MAX($K$6,Planning!$E$3)),\"\",IF(OR($C958>$C$7,MOD($C958-1,$B$7)>0),\"\",QUOTIENT($C958-1,$B$7)+1)))","v":""},950,null,null,null,null,null,"-",null,null," : "]
[null,{"$f":"IF($B$7=0,\"\",IF(OR($B$7=0,QUOTIENT($C959-1,$B$7)+1>MAX($K$6,Planning!$E$3)),\"\",IF(OR($C959>$C$7,MOD($C959-1,$B$7)>0),\"\",QUOTIENT($C959-1,$B$7)+1)))","v":""},951,null,null,null,null,null,"-",null,null," : "]
[null,{"$f":"IF($B$7=0,\"\",IF(OR($B$7=0,QUOTIENT($C960-1,$B$7)+1>MAX($K$6,Planning!$E$3)),\"\",IF(OR($C960>$C$7,MOD($C960-1,$B$7)>0),\"\",QUOTIENT($C960-1,$B$7)+1)))","v":""},952,null,null,null,null,null,"-",null,null," : "]
[null,{"$f":"IF($B$7=0,\"\",IF(OR($B$7=0,QUOTIENT($C961-1,$B$7)+1>MAX($K$6,Planning!$E$3)),\"\",IF(OR($C961>$C$7,MOD($C961-1,$B$7)>0),\"\",QUOTIENT($C961-1,$B$7)+1)))","v":""},953,null,null,null,null,null,"-",null,null," : "]
[null,{"$f":"IF($B$7=0,\"\",IF(OR($B$7=0,QUOTIENT($C962-1,$B$7)+1>MAX($K$6,Planning!$E$3)),\"\",IF(OR($C962>$C$7,MOD($C962-1,$B$7)>0),\"\",QUOTIENT($C962-1,$B$7)+1)))","v":""},954,null,null,null,null,null,"-",null,null," : "]
[null,{"$f":"IF($B$7=0,\"\",IF(OR($B$7=0,QUOTIENT($C963-1,$B$7)+1>MAX($K$6,Planning!$E$3)),\"\",IF(OR($C963>$C$7,MOD($C963-1,$B$7)>0),\"\",QUOTIENT($C963-1,$B$7)+1)))","v":""},955,null,null,null,null,null,"-",null,null," : "]
[null,{"$f":"IF($B$7=0,\"\",IF(OR($B$7=0,QUOTIENT($C964-1,$B$7)+1>MAX($K$6,Planning!$E$3)),\"\",IF(OR($C964>$C$7,MOD($C964-1,$B$7)>0),\"\",QUOTIENT($C964-1,$B$7)+1)))","v":""},956,null,null,null,null,null,"-",null,null," : "]
[null,{"$f":"IF($B$7=0,\"\",IF(OR($B$7=0,QUOTIENT($C965-1,$B$7)+1>MAX($K$6,Planning!$E$3)),\"\",IF(OR($C965>$C$7,MOD($C965-1,$B$7)>0),\"\",QUOTIENT($C965-1,$B$7)+1)))","v":""},957,null,null,null,null,null,"-",null,null," : "]
[null,{"$f":"IF($B$7=0,\"\",IF(OR($B$7=0,QUOTIENT($C966-1,$B$7)+1>MAX($K$6,Planning!$E$3)),\"\",IF(OR($C966>$C$7,MOD($C966-1,$B$7)>0),\"\",QUOTIENT($C966-1,$B$7)+1)))","v":""},958,null,null,null,null,null,"-",null,null," : "]
[null,{"$f":"IF($B$7=0,\"\",IF(OR($B$7=0,QUOTIENT($C967-1,$B$7)+1>MAX($K$6,Planning!$E$3)),\"\",IF(OR($C967>$C$7,MOD($C967-1,$B$7)>0),\"\",QUOTIENT($C967-1,$B$7)+1)))","v":""},959,null,null,null,null,null,"-",null,null," : "]
[null,{"$f":"IF($B$7=0,\"\",IF(OR($B$7=0,QUOTIENT($C968-1,$B$7)+1>MAX($K$6,Planning!$E$3)),\"\",IF(OR($C968>$C$7,MOD($C968-1,$B$7)>0),\"\",QUOTIENT($C968-1,$B$7)+1)))","v":""},960,null,null,null,null,null,"-",null,null," : "]
[null,{"$f":"IF($B$7=0,\"\",IF(OR($B$7=0,QUOTIENT($C969-1,$B$7)+1>MAX($K$6,Planning!$E$3)),\"\",IF(OR($C969>$C$7,MOD($C969-1,$B$7)>0),\"\",QUOTIENT($C969-1,$B$7)+1)))","v":""},961,null,null,null,null,null,"-",null,null," : "]
[null,{"$f":"IF($B$7=0,\"\",IF(OR($B$7=0,QUOTIENT($C970-1,$B$7)+1>MAX($K$6,Planning!$E$3)),\"\",IF(OR($C970>$C$7,MOD($C970-1,$B$7)>0),\"\",QUOTIENT($C970-1,$B$7)+1)))","v":""},962,null,null,null,null,null,"-",null,null," : "]
[null,{"$f":"IF($B$7=0,\"\",IF(OR($B$7=0,QUOTIENT($C971-1,$B$7)+1>MAX($K$6,Planning!$E$3)),\"\",IF(OR($C971>$C$7,MOD($C971-1,$B$7)>0),\"\",QUOTIENT($C971-1,$B$7)+1)))","v":""},963,null,null,null,null,null,"-",null,null," : "]
[null,{"$f":"IF($B$7=0,\"\",IF(OR($B$7=0,QUOTIENT($C972-1,$B$7)+1>MAX($K$6,Planning!$E$3)),\"\",IF(OR($C972>$C$7,MOD($C972-1,$B$7)>0),\"\",QUOTIENT($C972-1,$B$7)+1)))","v":""},964,null,null,null,null,null,"-",null,null," : "]
[null,{"$f":"IF($B$7=0,\"\",IF(OR($B$7=0,QUOTIENT($C973-1,$B$7)+1>MAX($K$6,Planning!$E$3)),\"\",IF(OR($C973>$C$7,MOD($C973-1,$B$7)>0),\"\",QUOTIENT($C973-1,$B$7)+1)))","v":""},965,null,null,null,null,null,"-",null,null," : "]
[null,{"$f":"IF($B$7=0,\"\",IF(OR($B$7=0,QUOTIENT($C974-1,$B$7)+1>MAX($K$6,Planning!$E$3)),\"\",IF(OR($C974>$C$7,MOD($C974-1,$B$7)>0),\"\",QUOTIENT($C974-1,$B$7)+1)))","v":""},966,null,null,null,null,null,"-",null,null," : "]
[null,{"$f":"IF($B$7=0,\"\",IF(OR($B$7=0,QUOTIENT($C975-1,$B$7)+1>MAX($K$6,Planning!$E$3)),\"\",IF(OR($C975>$C$7,MOD($C975-1,$B$7)>0),\"\",QUOTIENT($C975-1,$B$7)+1)))","v":""},967,null,null,null,null,null,"-",null,null," : "]
[null,{"$f":"IF($B$7=0,\"\",IF(OR($B$7=0,QUOTIENT($C976-1,$B$7)+1>MAX($K$6,Planning!$E$3)),\"\",IF(OR($C976>$C$7,MOD($C976-1,$B$7)>0),\"\",QUOTIENT($C976-1,$B$7)+1)))","v":""},968,null,null,null,null,null,"-",null,null," : "]
[null,{"$f":"IF($B$7=0,\"\",IF(OR($B$7=0,QUOTIENT($C977-1,$B$7)+1>MAX($K$6,Planning!$E$3)),\"\",IF(OR($C977>$C$7,MOD($C977-1,$B$7)>0),\"\",QUOTIENT($C977-1,$B$7)+1)))","v":""},969,null,null,null,null,null,"-",null,null," : "]
[null,{"$f":"IF($B$7=0,\"\",IF(OR($B$7=0,QUOTIENT($C978-1,$B$7)+1>MAX($K$6,Planning!$E$3)),\"\",IF(OR($C978>$C$7,MOD($C978-1,$B$7)>0),\"\",QUOTIENT($C978-1,$B$7)+1)))","v":""},970,null,null,null,null,null,"-",null,null," : "]
[null,{"$f":"IF($B$7=0,\"\",IF(OR($B$7=0,QUOTIENT($C979-1,$B$7)+1>MAX($K$6,Planning!$E$3)),\"\",IF(OR($C979>$C$7,MOD($C979-1,$B$7)>0),\"\",QUOTIENT($C979-1,$B$7)+1)))","v":""},971,null,null,null,null,null,"-",null,null," : "]
[null,{"$f":"IF($B$7=0,\"\",IF(OR($B$7=0,QUOTIENT($C980-1,$B$7)+1>MAX($K$6,Planning!$E$3)),\"\",IF(OR($C980>$C$7,MOD($C980-1,$B$7)>0),\"\",QUOTIENT($C980-1,$B$7)+1)))","v":""},972,null,null,null,null,null,"-",null,null," : "]
[null,{"$f":"IF($B$7=0,\"\",IF(OR($B$7=0,QUOTIENT($C981-1,$B$7)+1>MAX($K$6,Planning!$E$3)),\"\",IF(OR($C981>$C$7,MOD($C981-1,$B$7)>0),\"\",QUOTIENT($C981-1,$B$7)+1)))","v":""},973,null,null,null,null,null,"-",null,null," : "]
[null,{"$f":"IF($B$7=0,\"\",IF(OR($B$7=0,QUOTIENT($C982-1,$B$7)+1>MAX($K$6,Planning!$E$3)),\"\",IF(OR($C982>$C$7,MOD($C982-1,$B$7)>0),\"\",QUOTIENT($C982-1,$B$7)+1)))","v":""},974,null,null,null,null,null,"-",null,null," : "]
[null,{"$f":"IF($B$7=0,\"\",IF(OR($B$7=0,QUOTIENT($C983-1,$B$7)+1>MAX($K$6,Planning!$E$3)),\"\",IF(OR($C983>$C$7,MOD($C983-1,$B$7)>0),\"\",QUOTIENT($C983-1,$B$7)+1)))","v":""},975,null,null,null,null,null,"-",null,null," : "]
[null,{"$f":"IF($B$7=0,\"\",IF(OR($B$7=0,QUOTIENT($C984-1,$B$7)+1>MAX($K$6,Planning!$E$3)),\"\",IF(OR($C984>$C$7,MOD($C984-1,$B$7)>0),\"\",QUOTIENT($C984-1,$B$7)+1)))","v":""},976,null,null,null,null,null,"-",null,null," : "]
[null,{"$f":"IF($B$7=0,\"\",IF(OR($B$7=0,QUOTIENT($C985-1,$B$7)+1>MAX($K$6,Planning!$E$3)),\"\",IF(OR($C985>$C$7,MOD($C985-1,$B$7)>0),\"\",QUOTIENT($C985-1,$B$7)+1)))","v":""},977,null,null,null,null,null,"-",null,null," : "]
[null,{"$f":"IF($B$7=0,\"\",IF(OR($B$7=0,QUOTIENT($C986-1,$B$7)+1>MAX($K$6,Planning!$E$3)),\"\",IF(OR($C986>$C$7,MOD($C986-1,$B$7)>0),\"\",QUOTIENT($C986-1,$B$7)+1)))","v":""},978,null,null,null,null,null,"-",null,null," : "]
[null,{"$f":"IF($B$7=0,\"\",IF(OR($B$7=0,QUOTIENT($C987-1,$B$7)+1>MAX($K$6,Planning!$E$3)),\"\",IF(OR($C987>$C$7,MOD($C987-1,$B$7)>0),\"\",QUOTIENT($C987-1,$B$7)+1)))","v":""},979,null,null,null,null,null,"-",null,null," : "]
[null,{"$f":"IF($B$7=0,\"\",IF(OR($B$7=0,QUOTIENT($C988-1,$B$7)+1>MAX($K$6,Planning!$E$3)),\"\",IF(OR($C988>$C$7,MOD($C988-1,$B$7)>0),\"\",QUOTIENT($C988-1,$B$7)+1)))","v":""},980,null,null,null,null,null,"-",null,null," : "]
[null,{"$f":"IF($B$7=0,\"\",IF(OR($B$7=0,QUOTIENT($C989-1,$B$7)+1>MAX($K$6,Planning!$E$3)),\"\",IF(OR($C989>$C$7,MOD($C989-1,$B$7)>0),\"\",QUOTIENT($C989-1,$B$7)+1)))","v":""},981,null,null,null,null,null,"-",null,null," : "]
[null,{"$f":"IF($B$7=0,\"\",IF(OR($B$7=0,QUOTIENT($C990-1,$B$7)+1>MAX($K$6,Planning!$E$3)),\"\",IF(OR($C990>$C$7,MOD($C990-1,$B$7)>0),\"\",QUOTIENT($C990-1,$B$7)+1)))","v":""},982,null,null,null,null,null,"-",null,null," : "]
[null,{"$f":"IF($B$7=0,\"\",IF(OR($B$7=0,QUOTIENT($C991-1,$B$7)+1>MAX($K$6,Planning!$E$3)),\"\",IF(OR($C991>$C$7,MOD($C991-1,$B$7)>0),\"\",QUOTIENT($C991-1,$B$7)+1)))","v":""},983,null,null,null,null,null,"-",null,null," : "]
[null,{"$f":"IF($B$7=0,\"\",IF(OR($B$7=0,QUOTIENT($C992-1,$B$7)+1>MAX($K$6,Planning!$E$3)),\"\",IF(OR($C992>$C$7,MOD($C992-1,$B$7)>0),\"\",QUOTIENT($C992-1,$B$7)+1)))","v":""},984,null,null,null,null,null,"-",null,null," : "]
[null,{"$f":"IF($B$7=0,\"\",IF(OR($B$7=0,QUOTIENT($C993-1,$B$7)+1>MAX($K$6,Planning!$E$3)),\"\",IF(OR($C993>$C$7,MOD($C993-1,$B$7)>0),\"\",QUOTIENT($C993-1,$B$7)+1)))","v":""},985,null,null,null,null,null,"-",null,null," : "]
[null,{"$f":"IF($B$7=0,\"\",IF(OR($B$7=0,QUOTIENT($C994-1,$B$7)+1>MAX($K$6,Planning!$E$3)),\"\",IF(OR($C994>$C$7,MOD($C994-1,$B$7)>0),\"\",QUOTIENT($C994-1,$B$7)+1)))","v":""},986,null,null,null,null,null,"-",null,null," : "]
[null,{"$f":"IF($B$7=0,\"\",IF(OR($B$7=0,QUOTIENT($C995-1,$B$7)+1>MAX($K$6,Planning!$E$3)),\"\",IF(OR($C995>$C$7,MOD($C995-1,$B$7)>0),\"\",QUOTIENT($C995-1,$B$7)+1)))","v":""},987,null,null,null,null,null,"-",null,null," : "]
[null,{"$f":"IF($B$7=0,\"\",IF(OR($B$7=0,QUOTIENT($C996-1,$B$7)+1>MAX($K$6,Planning!$E$3)),\"\",IF(OR($C996>$C$7,MOD($C996-1,$B$7)>0),\"\",QUOTIENT($C996-1,$B$7)+1)))","v":""},988,null,null,null,null,null,"-",null,null," : "]
[null,{"$f":"IF($B$7=0,\"\",IF(OR($B$7=0,QUOTIENT($C997-1,$B$7)+1>MAX($K$6,Planning!$E$3)),\"\",IF(OR($C997>$C$7,MOD($C997-1,$B$7)>0),\"\",QUOTIENT($C997-1,$B$7)+1)))","v":""},989,null,null,null,null,null,"-",null,null," : "]
[null,{"$f":"IF($B$7=0,\"\",IF(OR($B$7=0,QUOTIENT($C998-1,$B$7)+1>MAX($K$6,Planning!$E$3)),\"\",IF(OR($C998>$C$7,MOD($C998-1,$B$7)>0),\"\",QUOTIENT($C998-1,$B$7)+1)))","v":""},990,null,null,null,null,null,"-",null,null," : "]
[null,{"$f":"IF($B$7=0,\"\",IF(OR($B$7=0,QUOTIENT($C999-1,$B$7)+1>MAX($K$6,Planning!$E$3)),\"\",IF(OR($C999>$C$7,MOD($C999-1,$B$7)>0),\"\",QUOTIENT($C999-1,$B$7)+1)))","v":""},991,null,null,null,null,null,"-",null,null," : "]
[null,{"$f":"IF($B$7=0,\"\",IF(OR($B$7=0,QUOTIENT($C1000-1,$B$7)+1>MAX($K$6,Planning!$E$3)),\"\",IF(OR($C1000>$C$7,MOD($C1000-1,$B$7)>0),\"\",QUOTIENT($C1000-1,$B$7)+1)))","v":""},992,null,null,null,null,null,"-",null,null," : "]
[null,{"$f":"IF($B$7=0,\"\",IF(OR($B$7=0,QUOTIENT($C1001-1,$B$7)+1>MAX($K$6,Planning!$E$3)),\"\",IF(OR($C1001>$C$7,MOD($C1001-1,$B$7)>0),\"\",QUOTIENT($C1001-1,$B$7)+1)))","v":""},993,null,null,null,null,null,"-",null,null," : "]
[null,{"$f":"IF($B$7=0,\"\",IF(OR($B$7=0,QUOTIENT($C1002-1,$B$7)+1>MAX($K$6,Planning!$E$3)),\"\",IF(OR($C1002>$C$7,MOD($C1002-1,$B$7)>0),\"\",QUOTIENT($C1002-1,$B$7)+1)))","v":""},994,null,null,null,null,null,"-",null,null," : "]
[null,{"$f":"IF($B$7=0,\"\",IF(OR($B$7=0,QUOTIENT($C1003-1,$B$7)+1>MAX($K$6,Planning!$E$3)),\"\",IF(OR($C1003>$C$7,MOD($C1003-1,$B$7)>0),\"\",QUOTIENT($C1003-1,$B$7)+1)))","v":""},995,null,null,null,null,null,"-",null,null," : "]
[null,{"$f":"IF($B$7=0,\"\",IF(OR($B$7=0,QUOTIENT($C1004-1,$B$7)+1>MAX($K$6,Planning!$E$3)),\"\",IF(OR($C1004>$C$7,MOD($C1004-1,$B$7)>0),\"\",QUOTIENT($C1004-1,$B$7)+1)))","v":""},996,null,null,null,null,null,"-",null,null," : "]
[null,{"$f":"IF($B$7=0,\"\",IF(OR($B$7=0,QUOTIENT($C1005-1,$B$7)+1>MAX($K$6,Planning!$E$3)),\"\",IF(OR($C1005>$C$7,MOD($C1005-1,$B$7)>0),\"\",QUOTIENT($C1005-1,$B$7)+1)))","v":""},997,null,null,null,null,null,"-",null,null," : "]
[null,{"$f":"IF($B$7=0,\"\",IF(OR($B$7=0,QUOTIENT($C1006-1,$B$7)+1>MAX($K$6,Planning!$E$3)),\"\",IF(OR($C1006>$C$7,MOD($C1006-1,$B$7)>0),\"\",QUOTIENT($C1006-1,$B$7)+1)))","v":""},998,null,null,null,null,null,"-",null,null," : "]
[null,{"$f":"IF($B$7=0,\"\",IF(OR($B$7=0,QUOTIENT($C1007-1,$B$7)+1>MAX($K$6,Planning!$E$3)),\"\",IF(OR($C1007>$C$7,MOD($C1007-1,$B$7)>0),\"\",QUOTIENT($C1007-1,$B$7)+1)))","v":""},999,null,null,null,null,null,"-",null,null," : "]
[null,{"$f":"IF($B$7=0,\"\",IF(OR($B$7=0,QUOTIENT($C1008-1,$B$7)+1>MAX($K$6,Planning!$E$3)),\"\",IF(OR($C1008>$C$7,MOD($C1008-1,$B$7)>0),\"\",QUOTIENT($C1008-1,$B$7)+1)))","v":""},1000,null,null,null,null,null,"-",null,null," : "]

{"sheet":"CrossTable","index":2,"n_rows":14,"n_cols":14,"rows_kept":14,"cut":false,"hidden":false,"merged":[]}
[]
[null,null,{"$f":"Language!$E$38","v":"Cross table of match results"}]
[null,null,null,"FC Augsburg","Hertha BSC","1. FC Union Berlin","VFL Bochum 1848","SV Werder Bremen","Borussia Dortmund","Eintracht Frankfurt","Sport-Club Freiburg","TSG Hoffenheim","1. FC Köln","RB Leipzig"]
[null,null,"FC Augsburg",null,null,"1 - 2","3 - 2",null,null,null,null,"3 - 1"]
[null,null,"Hertha BSC",null,null,null,null,"2 - 1",null,null,null,null,"1 - 3"]
[null,null,"1. FC Union Berlin","2 - 1",null,null,null,null,"1 - 3","1 - 1"]
[null,null,"VFL Bochum 1848","2 - 3",null,null,null,"3 - 1",null,null,null,null,null,"1 - 3"]
[null,null,"SV Werder Bremen",null,"1 - 2",null,"1 - 3",null,null,null,"1 - 2"]
[null,null,"Borussia Dortmund",null,null,"3 - 1",null,null,null,null,"4 - 1"]
[null,null,"Eintracht Frankfurt",null,null,"1 - 1",null,null,null,null,null,"3 - 0","2 - 0"]
[null,null,"Sport-Club Freiburg",null,null,null,null,"2 - 1","1 - 4",null,null,null,null,"2 - 1"]
[null,null,"TSG Hoffenheim","1 - 3",null,null,null,null,null,"0 - 3"]
[null,null,"1. FC Köln",null,"3 - 1",null,null,null,null,"0 - 2",null,null,null,"2 - 0"]
[null,null,"RB Leipzig",null,null,null,"3 - 1",null,null,null,"1 - 2",null,"0 - 2"]

{"sheet":"Paarungen","index":3,"n_rows":103,"n_cols":103,"rows_kept":103,"cut":false,"hidden":true,"merged":[[1,2,1,22]]}
[]
[null,null,{"$f":"Language!$E$34","v":"Pairings"}]
[null,null,null,1,2,3,4,5,6,7,8,9,10,11,12,13,14,15,16,17,18,19,20,21,22,23,24,25,26,27,28,29,30,31,32,33,34,35,36,37,38,39,40,41,42,43,44,45,46,47,48,49,50,51,52,53,54,55,56,57,58,59,60,61,62,63,64,65,66,67,68,69,70,71,72,73,74,75,76,77,78,79,80,81,82,83,84,85,86,87,88,89,90,91,92,93,94,95,96,97,98,99,100]
[null,null,1,null,null,"x","x",null,null,null,null,"x"]
[null,null,2,null,null,null,null,"x",null,null,null,null,"x"]
[null,null,3,"x",null,null,null,null,"x","x"]
[null,null,4,"x",null,null,null,"x",null,null,null,null,null,"x"]
[null,null,5,null,"x",null,"x",null,null,null,"x"]
[null,null,6,null,null,"x",null,null,null,null,"x"]
[null,null,7,null,null,"x",null,null,null,null,null,"x","x"]
[null,null,8,null,null,null,null,"x","x",null,null,null,null,"x"]
[null,null,9,"x",null,null,null,null,null,"x"]
[null,null,10,null,"x",null,null,null,null,"x",null,null,null,"x"]
[null,null,11,null,null,null,"x",null,null,null,"x",null,"x"]
[null,null,12]
[null,null,13]
[null,null,14]
[null,null,15]
[null,null,16]
[null,null,17]
[null,null,18]
[null,null,19]
[null,null,20]
[null,null,21]
[null,null,22]
[null,null,23]
[null,null,24]
[null,null,25]
[null,null,26]
[null,null,27]
[null,null,28]
[null,null,29]
[null,null,30]
[null,null,31]
[null,null,32]
[null,null,33]
[null,null,34]
[null,null,35]
[null,null,36]
[null,null,37]
[null,null,38]
[null,null,39]
[null,null,40]
[null,null,41]
[null,null,42]
[null,null,43]
[null,null,44]
[null,null,45]
[null,null,46]
[null,null,47]
[null,null,48]
[null,null,49]
[null,null,50]
[null,null,51]
[null,null,52]
[null,null,53]
[null,null,54]
[null,null,55]
[null,null,56]
[null,null,57]
[null,null,58]
[null,null,59]
[null,null,60]
[null,null,61]
[null,null,62]
[null,null,63]
[null,null,64]
[null,null,65]
[null,null,66]
[null,null,67]
[null,null,68]
[null,null,69]
[null,null,70]
[null,null,71]
[null,null,72]
[null,null,73]
[null,null,74]
[null,null,75]
[null,null,76]
[null,null,77]
[null,null,78]
[null,null,79]
[null,null,80]
[null,null,81]
[null,null,82]
[null,null,83]
[null,null,84]
[null,null,85]
[null,null,86]
[null,null,87]
[null,null,88]
[null,null,89]
[null,null,90]
[null,null,91]
[null,null,92]
[null,null,93]
[null,null,94]
[null,null,95]
[null,null,96]
[null,null,97]
[null,null,98]
[null,null,99]
[null,null,100]

{"sheet":"Language","index":4,"n_rows":115,"n_cols":12,"rows_kept":115,"cut":false,"hidden":false,"merged":[[0,5,0,7],[2,7,3,7],[1,5,1,6],[2,3,3,3],[2,4,3,4],[2,5,3,5],[2,6,3,6]]}
[null,null,null,null,null,{"$f":"$E$35","v":"Choose language"},null,null,null,"english",{"$f":"_xlfn.UNICHAR(8592)","v":"←"},{"$f":"$E$75","v":"Click here and choose language"}]
[]
[null,"english",{"$f":"IF(AND($J$1<>B4,$J$1<>B5),1,0)","v":1},null,null,"english","deutsch","my language"]
[null,"deutsch",{"$f":"IF($J$1=B4,1,0)","v":0}]
[null,"my language",{"$f":"IF($J$1=B5,1,0)","v":0},null,null,{"$f":"$E$36","v":"Captions"}]
[null,null,null,null,{"$f":"IF($C$3,F6,IF($C$4,G6,IF($H6<>\"\",$H6,$F6)))","v":"Tie break"},"Tie break","Tie-Break"]
[null,null,null,null,{"$f":"IF($C$3,F7,IF($C$4,G7,IF($H7<>\"\",$H7,$F7)))","v":"Settings"},"Settings","Einstellungen"]
[null,null,null,null,"Match points","Match points","Spielpunkte"]
[null,null,null,null,"No.","No.","Nr."]
[null,null,null,null,"Participant or Team","Participant or Team","Teilnehmer bzw. Mannschaft"]
[null,null,null,null,"Results","Results","Ergebnisse"]
[null,null,null,null,"Table","Table","Tabelle"]
[null,null,null,null,"Matchups","Matchups","Spielpaarungen"]
[null,null,null,null,"Matchup","Matchup","Spielpaarung"]
[null,null,null,null,"Result","Result","Ergebnis"]
[null,null,null,null,"Matchweeks","Matchweeks","Spieltage"]
[null,null,null,null,"Up to round:","Up to round:","Bis Runde:"]
[null,null,null,null,"BH","BH","BH"]
[null,null,null,null,"FBH","FBH","FBH"]
[null,null,null,null,"Name","Name","Name"]
[null,null,null,null,"Pl","Pl","Sp"]
[null,null,null,null,"W","W","G"]
[null,null,null,null,"Diff.","Diff.","Diff."]
[null,null,null,null,"L","L","V"]
[null,null,null,null,"GF  -  GA","GF  -  GA","Tore"]
[null,null,null,null,"GD","GD","TD"]
[null,null,null,null,"Pts","Pts","Pkt"]
[null,null,null,null,"D","D","U"]
[null,null,null,null,"Number of rounds:","Number of rounds:","Anzahl der Runden:"]
[null,null,null,null,"Participant list","Participant list","Teilnehmerliste"]
[null,null,null,null,"Number of participants:","Number of participants:","Anzahl der Teilnehmer:"]
[null,null,null,null,"Schedule","Schedule","Ablaufplan"]
[null,null,null,null,"Game no.","Game no.","Spiel-Nr."]
[null,null,null,null,"Pairings","Pairings","Paarungen"]
[null,null,null,null,"Choose language","Choose language","Sprache wählen"]
[null,null,null,null,"Captions","Captions","Überschriften"]
[null,null,null,null,"Messages","Messages","Meldungen"]
[null,null,null,null,"Cross table of match results","Cross table of match results","Kreuztabelle der Spielergebnisse"]
[null,null,null,null,"Number of points for a win:","Number of points for a win:","Anzahl der Punkte für einen Sieg:"]
[null,null,null,null,"Number of points for a draw:","Number of points for a draw:","Anzahl der Punkte für ein Unentschieden:"]
[null,null,null,null,"Number of points for a bye:","Number of points for a bye:","Anzahl der Punkte für ein Freilos:"]
[null,null,null,null,"Current round:","Current round:","Aktuelle Runde:"]
[null,null,null,null,"Round","Round","Runde"]
[null,null,null,null,"Playing strength","Playing strength","Spielstärke"]
[null,null,null,null,"Byes","Byes","Freilose"]
[null,null,null,null,"Bye:","Bye:","Freilos:"]
[null,null,null,null,"Date","Date","Datum"]
[null,null,null,null,"Match against","Match against","Spiel gegen"]
[null,null,null,null,"Pts diff","Pts diff","Pkt-diff"]
[null,null,null,null,"Time","Time","Zeit"]
[null,null,null,null,"Bonus","Bonus","Bonus"]
[null,null,null,null,"Team","Team","Team"]
[null,null,null,null,"recomm.:","recomm.:","empfohlen:"]
[null,null,null,null,"Are draws valid?","Are draws valid?","Sind unentschiedene Spiele gültig?"]
[null,null,null,null,"Yes","Yes","Ja"]
[null,null,null,null,"No","No","Nein"]
[null,null,null,null,"Drawn games are valid and will be counted.","Drawn games are valid and will be counted.","Unentschiedene Spiele sind gültig und gehen in die Wertung ein."]
[null,null,null,null,"Automatic saving?","Automatic saving?","Automatische Speicherung?"]
[null,null,null,null,"Field","Field","Feld"]
[null,null,null,null,"Automatic backup after each round?","Automatic backup after each round?","Automatisches Backup nach jeder Runde?"]
[null,null,null,null,"Home games (white pieces in chess):","Home games (white pieces in chess):","Heimspiele (weiße Figuren beim Schach):"]
[null,null,null,null,"Display the home game statistics to the left of the rankings?","Display the home game statistics to the left of the rankings?","Anzeige der Heimspielstatistik links neben der Rangliste?"]
[null,null,null,null,"If the home game statistics are tied, should the weaker team get home advantage or the stronger team?","If the home game statistics are tied, should the weaker team get home advantage or the stronger team?","Soll bei Gleichstand in der Heimspielstatistik das schwächere Team Heimrecht bekommen oder das stärkere Team?"]
[null,null,null,null,"Weaker team","Weaker team","Schwächeres Team"]
[null,null,null,null,"Stronger team","Stronger team","Stärkeres Team"]
[null,null,null,null,"H - A","H - A","H - A"]
[null,null,null,null,0]
[null,null,null,null,0]
[null,null,null,null,0]
[null,null,null,null,null,{"$f":"$E$37","v":"Messages"}]
[null,null,null,null,"If two or more teams cannot be distinguished and a direct comparison or a decisive match decides, it is sufficient to enter bonus points for the preferred teams.","If two or more teams cannot be distinguished and a direct comparison or a decisive match decides, it is sufficient to enter bonus points for the preferred teams.","Sind zwei oder mehr Mannschaften nicht unterscheidbar und ein direkter Vergleich oder ein Entscheidungsspiel entscheiden, genügt es, für die bevorzugte Mannschaft einen Bonuspunkt einzutragen."]
[null,null,null,null,"Double match pairings and matches against oneself\nlead to incorrect values in the overall table!","Double match pairings and matches against oneself\nlead to incorrect values in the overall table!","Doppelte Spielpaarungen und Spiele gegen sich selbst\nführen in der Gesamttabelle zu falschen Werten!"]
[null,null,null,null,"After each round draw and after each update of the rankings, the results are saved automatically.","After each round draw and after each update of the rankings, the results are saved automatically.","Nach jeder Rundenauslosung und nach jeder Aktualisierung der Rangliste wird automatisch gespeichert."]
[null,null,null,null,"double","double","doppelt"]
[null,null,null,null,"Click here and choose language","Click here and choose language","Hier klicken und Sprache wählen"]
[null,null,null,null,"Duplicate names","Duplicate names","Doppelte Namen"]
[null,null,null,null,"If two (or more) teams have the same number of points, the same goal difference and the same number of goals scored at the end of the season, the following tie-breakers will be used according to §24 of the regulations for the Bundesliga:\n\n1. Points from direct encounters\n2. Goal difference from the direct encounters\n3. Number of away goals from direct encounters\n4. Number of away goals from all matches\n\nIf a distinction is still not possible, a play-off takes place on neutral ground.\n\nSince such a case is extremely unlikely after 306 games, these regulations are not taken into account in this game plan. Such a case can be solved by entering a bonus point for the preferred team.","If two (or more) teams have the same number of points, the same goal difference and the same number of goals scored at the end of the season, the following tie-breakers will be used according to §24 of the regulations for the Bundesliga:\n\n1. Points from direct encounters\n2. Goal difference from the direct encounters\n3. Number of away goals from direct encounters\n4. Number of away goals from all matches\n\nIf a distinction is still not possible, a play-off takes place on neutral ground.\n\nSince such a case is extremely unlikely after 306 games, these regulations are not taken into account in this game plan. Such a case can be solved by entering a bonus point for the preferred team.","Haben zwei (oder mehr) Mannschaften am Ende der Saison dieselbe Punktzahl, dieselbe Tordifferenz und dieselbe Anzahl erzielter Tore, werden nach §24 der Bestimmungen für die Fußball-Bundesliga folgende Tie-Breakers herangezogen:\n\n1.  Punkte aus den Direktbegegnungen\n2.  Tordifferenz aus den Direktbegegnungen\n3.  Anzahl der Auswärtstore aus den Direktbegegnungen\n4.  Anzahl der Auswärtstore aus allen Spielen\n\nIst immer noch keine Unterscheidung möglich, findet ein Entscheidungsspiel auf neutralem Boden statt.\n\nDa ein solcher Fall nach 306 Spielen äußerst unwahrscheinlich ist, sind diese Bestimmungen in diesem Spielplan nicht berücksichtigt. Ein solcher Fall kann durch Eintragen eines Bonuspunktes für die bevorzugte Mannschaft gelöst werden."]
[null,null,null,null,"Explanation","Explanation","Erläuterung"]
[null,null,null,null,"The number of participants has been changed. This must be reversed or the tournament must be restarted.","The number of participants has been changed. This must be reversed or the tournament must be restarted.","Die Teilnehmeranzahl wurde verändert. Dies muss rückgängig gemacht werden oder das Turnier muss neu gestartet werden."]
[null,null,null,null,"The specified number of rounds has been reached. Should more rounds still be played?","The specified number of rounds has been reached. Should more rounds still be played?","Die vorgegebene Anzahl Runden ist erreicht. Sollen trotzdem weitere Runden stattfinden?"]
[null,null,null,null,"To start the tournament, first click the 'Start Tournament' button on the 'Plan' worksheet","To start the tournament, first click the 'Start Tournament' button on the 'Plan' worksheet","Zum Starten des Turniers zuerst auf dem Tabellenblatt 'Plan' die Schaltfläche 'Turnier starten' klicken"]
[null,null,null,null,"The participant names are not unique!","The participant names are not unique!","Die Teilnehmernamen sind nicht eindeutig!"]
[null,null,null,null,"At least ","At least ","Es müssen mindestens "]
[null,null,null,null," participants must be registered!"," participants must be registered!"," Teilnehmer eingetragen sein!"]
[null,null,null,null,"The number of rounds must be greater than zero!","The number of rounds must be greater than zero!","Die Anzahl der Runden muss größer als null sein!"]
[null,null,null,null,"A maximum of ","A maximum of ","Es sind höchstens "]
[null,null,null,null," rounds are possible!"," rounds are possible!"," Runden möglich!"]
[null,null,null,null,"There are no further pairings!","There are no further pairings!","Es gibt keine weiteren Paarungen!"]
[null,null,null,null," - "," - "," : "]
[null,null,null,null,"Schedule","Schedule","Zeitplan"]
[null,null,null,null,"Start:","Start:","Beginn:"]
[null,null,null,null,"End:","End:","Ende:"]
[null,null,null,null,"End of preliminary round:","End of preliminary round:","Ende der Vorrunde:"]
[null,null,null,null,"Playing times","Playing times","Spielzeiten"]
[null,null,null,null,"Playing time per match:","Playing time per match:","Spielzeit pro Spiel:"]
[null,null,null,null,"Change time:","Change time:","Wechselzeit:"]
[null,null,null,null,"Number of fields:","Number of fields:","Anzahl der Spielfelder:"]
[null,null,null,null," "," ","Uhr"]
[null,null,null,null,"Addit. break (min)","Addit. break (min)","Zusätzl. Pause (min)"]
[null,null,null,null,"The playing time per game must be greater than zero!","The playing time per game must be greater than zero!","Die Spielzeit pro Spiel muss größer als null sein!"]
[null,null,null,null,"The change time must be greater than zero!","The change time must be greater than zero!","Die Wechselzeit pro Spiel muss größer als null sein!"]
[null,null,null,null,"The number of fields must be greater than zero!","The number of fields must be greater than zero!","Die Anzahl der Spielfelder muss größer als null sein!"]
[null,null,null,null,"Top criterion for the ranking:","Top criterion for the ranking:","Oberstes Kriterium für die Rangliste:"]
[null,null,null,null,"Points","Points","Punkte"]
[null,null,null,null,"Point diff.","Point diff.","Punktdiff."]
[null,null,null,null,"No other matching pairs found!","No other matching pairs found!","Keine weiteren passenden Paarungen gefunden!"]
[null,null,null,null,"The backup file \"","The backup file \"","Wahrscheinlich ist die Backup-Datei \""]
[null,null,null,null,"\" is probably open.","\" is probably open.","\" geöffnet."]
[null,null,null,null,"Please close this file and try again.","Please close this file and try again.","Diese Datei bitte schließen und es erneut versuchen."]
[null,null,null,null,{"$f":"IF($C$3,F110,IF($C$4,G110,IF($H110<>\"\",$H110,$F110)))","v":"Maximum of "},"Maximum of ","Maximal "]
[null,null,null,null," matches!"," matches!"," Spiele!"]
[null,null,null,null,0]
[null,null,null,null,0]
[null,null,null,null,0]
[null,null,null,null,0]

{"sheet":"Settings","index":5,"n_rows":29,"n_cols":3,"rows_kept":29,"cut":false,"hidden":false,"merged":[[0,1,0,2],[13,1,13,2]]}
[null,{"$f":"Language!$E$7","v":"Settings"}]
[]
[null,{"$f":"Language!$E$39","v":"Number of points for a win:"},2]
[]
[null,{"$f":"Language!$E$103","v":"Top criterion for the ranking:"},"Points"]
[]
[null,{"$f":"Language!$E$41","v":"Number of points for a bye:"},0]
[]
[]
[null,{"$f":"Language!$E$54","v":"Are draws valid?"},"Yes"]
[]
[null,{"$f":"Language!$E$40","v":"Number of points for a draw:"},1]
[]
[null,{"$f":"Language!$E$57","v":"Drawn games are valid and will be counted."}]
[]
[]
[null,{"$f":"Language!$E$58","v":"Automatic saving?"},"No"]
[]
[]
[null,{"$f":"Language!$E$60","v":"Automatic backup after each round?"},"No"]
[]
[]
[]
[null,{"$f":"Language!$E$61","v":"Home games (white pieces in chess):"}]
[]
[null,{"$f":"Language!$E$62","v":"Display the home game statistics to the left of the rankings?"},"No"]
[]
[]
[null,{"$f":"Language!$E$63","v":"If the home game statistics are tied, should the weaker team get home advantage or the stronger team?"},"Weaker team"]

{"sheet":"Help","index":6,"n_rows":77,"n_cols":10,"rows_kept":77,"cut":false,"hidden":false,"merged":[[75,1,75,7],[76,1,76,7],[75,9,75,15],[76,9,76,15]]}
[]
[null,"English",null,null,null,null,null,null,null,"Deutsch"]
[]
[]
[]
[]
[]
[]
[]
[]
[]
[]
[]
[]
[]
[]
[]
[]
[]
[]
[]
[]
[]
[]
[]
[]
[]
[]
[]
[]
[]
[]
[]
[]
[]
[]
[]
[]
[]
[]
[]
[]
[]
[]
[]
[]
[]
[]
[]
[]
[]
[]
[]
[]
[]
[]
[]
[]
[]
[]
[]
[]
[]
[]
[]
[]
[]
[]
[]
[]
[]
[]
[]
[]
[]
[null,"If there are any discrepancies, I am very grateful for notification!",null,null,null,null,null,null,null,"Bei Unstimmigkeiten bin ich für eine entsprechende Benachrichtigung sehr dankbar!"]
[null,"mail@hermann-baum.de",null,null,null,null,null,null,null,"mail@hermann-baum.de"]