{"text_format":"1","workbook":"xlsx","n_sheets":7,"sheets":["Planning","Results","CrossTable","Paarungen","Language","Settings","Help"],"not_rendered":{"charts":0,"images":0,"macros":1,"external_links":0,"defined_names":8,"comments":0,"pivot_tables":0},"unopened":[],"bounds":{"document_bytes":16777216,"sheet_cells":100000,"rows_first":2000,"rows_last":500,"rows_between":2000,"halvings":0,"cell_chars":16384,"cell_head_chars":4096},"cells_cut":0,"cells_raw":0,"read":"whole","date_system":"1900"}

{"sheet":"Planning","index":0,"n_rows":106,"n_cols":22,"rows_kept":106,"cut":false,"hidden":false,"merged":[[4,2,4,3],[5,10,6,10],[7,10,8,10],[9,10,10,10],[11,10,12,10],[13,10,14,10],[5,11,6,11],[7,11,8,11],[9,11,10,11],[11,11,12,11],[13,11,14,11],[5,12,6,12],[7,12,8,12],[9,12,10,12],[11,12,12,12],[13,12,14,12]]}
[]
[null,null,{"$f":"Language!$E$30","v":"Participant list"}]
[null,null,null,{"$f":"Language!$E$29","v":"Number of rounds:"},5,{"$f":"Language!$E$53","v":"recomm.:"},{"$f":"IF($E$4=4,\"2 - 3\",IF($E$4=5,\"3 - 5\",IF($E$4=6,\"4 - 5\",IFERROR(INT(LOG($E$4,2))+2&\" - \"&INT(LOG($E$4,2))+4,\"- -\"))))","v":"5 - 7"},null,null,null,null,null,null,null,null,"Anz. Rnd. Start"]
[null,null,null,{"$f":"Language!$E$31","v":"Number of participants:"},{"$f":"COUNTA($D$7:$D$106)","v":11},11,null,null,null,null,null,null,null,null,null,5]
[null,null,{"$f":"Language!$E$76","v":"Duplicate names"},null,null,null,null,null,null,null,{"$f":"Language!$E$90","v":"Schedule"}]
[null,{"$f":"MAX($B$7:$B$106)","v":1},{"$f":"Language!$E$9","v":"No."},{"$f":"Language!$E$10","v":"Participant or Team"},{"$f":"Language!$E$44","v":"Playing strength"},null,null,null,null,null,{"$f":"Language!$E$91","v":"Start:"},"09:00:00",{"$f":"Language!$E$98","v":" "},null,"Home","Away","Letzte",null,null,null,"Teiln. (Backup)","St. (Backup)"]
[null,{"$f":"COUNTIF($D$7:$D$106,$D7)","v":1},1,"FC Augsburg",null,null,null,null,null,null,null,null,null,null,2,1,1,"1.",{"$f":"IF(D7=\"\",\"\",D7)","v":"FC Augsburg"},null,"FC Augsburg"]
[null,{"$f":"COUNTIF($D$7:$D$106,$D8)","v":1},2,"Hertha BSC",null,null,null,null,null,null,{"$f":"Language!$E$95","v":"Playing time per match:"},20,"min",null,1,1,1,"2.",{"$f":"IF(D8=\"\",\"\",D8)","v":"Hertha BSC"},null,"Hertha BSC"]
[null,1,3,"1. FC Union Berlin",null,null,null,null,null,null,null,null,null,null,1,2,-1,"3.","1. FC Union Berlin",null,"1. FC Union Berlin"]
[null,1,4,"VFL Bochum 1848",null,null,null,null,null,null,{"$f":"Language!$E$96","v":"Change time:"},5,"min",null,2,1,-1,"4.","VFL Bochum 1848",null,"VFL Bochum 1848"]
[null,1,5,"SV Werder Bremen",null,null,null,null,null,null,null,null,null,null,1,2,-2,"5.","SV Werder Bremen",null,"SV Werder Bremen"]
[null,1,6,"Borussia Dortmund",null,null,null,null,null,null,{"$f":"Language!$E$97","v":"Number of fields:"},3,"(max. 100)",null,1,1,1,"6.","Borussia Dortmund",null,"Borussia Dortmund"]
[null,1,7,"Eintracht Frankfurt",null,null,null,null,null,null,null,null,null,null,2,1,1,"7.","Eintracht Frankfurt",null,"Eintracht Frankfurt"]
[null,1,8,"Sport-Club Freiburg",null,null,null,null,null,null,{"$f":"Language!$E$92","v":"End:"},"13:05:00",null,null,1,2,-1,"8.","Sport-Club Freiburg",null,"Sport-Club Freiburg"]
[null,1,9,"TSG Hoffenheim",null,null,null,null,null,null,null,null,null,null,1,1,1,"9.","TSG Hoffenheim",null,"TSG Hoffenheim"]
[null,1,10,"1. FC Köln",null,null,null,null,null,null,null,null,null,null,1,2,-2,"10.","1. FC Köln",null,"1. FC Köln"]
[null,1,11,"RB Leipzig",null,null,null,null,null,null,null,null,null,null,2,1,2,"11.","RB Leipzig",null,"RB Leipzig"]
[null,0,12,null,null,null,null,null,null,null,null,null,null,null,null,null,null,"12.",""]
[null,0,13,null,null,null,null,null,null,null,null,null,null,null,null,null,null,"13.",""]
[null,0,14,null,null,null,null,null,null,null,null,null,null,null,null,null,null,"14.",""]
[null,0,15,null,null,null,null,null,null,null,null,null,null,null,null,null,null,"15.",""]
[null,0,16,null,null,null,null,null,null,null,null,null,null,null,null,null,null,"16.",""]
[null,0,17,null,null,null,null,null,null,null,null,null,null,null,null,null,null,"17.",""]
[null,0,18,null,null,null,null,null,null,null,null,null,null,null,null,null,null,"18.",""]
[null,0,19,null,null,null,null,null,null,null,null,null,null,null,null,null,null,"19.",""]
[null,0,20,null,null,null,null,null,null,null,null,null,null,null,null,null,null,"20.",""]
[null,0,21,null,null,null,null,null,null,null,null,null,null,null,null,null,null,"21.",""]
[null,0,22,null,null,null,null,null,null,null,null,null,null,null,null,null,null,"22.",""]
[null,0,23,null,null,null,null,null,null,null,null,null,null,null,null,null,null,"23.",""]
[null,0,24,null,null,null,null,null,null,null,null,null,null,null,null,null,null,"24.",""]
{"$rows_left_out":77}
{"sheet":"Results","index":1,"n_rows":1008,"n_cols":40,"rows_kept":1008,"cut":false,"hidden":false,"merged":[[7,5,7,6],[0,28,0,29],[1,28,1,29],[7,16,7,17],[7,7,7,9],[7,10,7,12],[7,25,7,27],[2,7,2,19],[3,7,3,19],[5,5,5,6],[1,7,1,19],[6,13,7,13],[6,10,6,12]]}
[null,null,null,null,null,null,null,null,null,null,null,null,null,null,null,null,null,null,null,null,null,null,null,null,null,null,null,null,"Vers.  1.9"]
[null,null,null,null,null,null,null,"Tournament SWISS SYSTEM ",null,null,null,null,null,null,null,null,null,null,null,null,null,null,null,null,null,null,null,null,"2026-01-13"]
[null,null,null,null,null,null,null,"max. 100 Teams"]
[null,null,null,null,null,null,null,"Last updated: 13.01.2026"]
[]
[null,null,null,null,null,{"$f":"Language!$E$46","v":"Bye:"},null,"TSG Hoffenheim",null,{"$f":"Language!$E$42","v":"Current round:"},3,"/",{"$f":"Planning!$E$3","v":5},{"$f":"IF(OR(Planning!$L$14=\"\",$K$6>Planning!$E$3),\"\",Planning!$K$14&\" \"&TEXT(Planning!$L$14,\"hh:mm\"))","v":"End: 13:05"}]
[null,{"$f":"QUOTIENT(Planning!$E$4,2)","v":5},{"$f":"Planning!$E$4*(Planning!$E$4-1)/2","v":55},null,null,null,null,null,null,null,null,null,null,{"$f":"Language!$E$99","v":"Addit. break (min)"}]
[null,{"$f":"Language!$E$43","v":"Round"},{"$f":"Language!$E$9","v":"No."},{"$f":"Language!$E$50","v":"Time"},{"$f":"Language!$E$59","v":"Field"},null,null,{"$f":"Language!$E$14","v":"Matchup"},null,null,{"$f":"Language!$E$15","v":"Result"},null,null,null,null,{"$f":"Language!$E$66","v":"H - A"},null,null,{"$f":"Language!$E$21","v":"Pl"},{"$f":"Language!$E$22","v":"W"},{"$f":"Language!$E$28","v":"D"},{"$f":"Language!$E$24","v":"L"},{"$f":"Language!$E$18","v":"BH"},{"$f":"Language!$E$19","v":"FBH"},{"$f":"Language!$E$45","v":"Byes"},{"$f":"Language!$E$8","v":"Match points"},null,null,{"$f":"Language!$E$23","v":"Diff."},{"$f":"IF(Settings!$C$5=Language!$E$104,Language!$E$27,Language!$E$49)","v":"Pts"},null,"rf","Ranking number","Pool number","rf 1","rf 2","bye","Participant","number of Home","number of Away"]
[null,{"$f":"IF($B$7=0,\"\",IF(OR($B$7=0,QUOTIENT($C9-1,$B$7)+1>MAX($K$6,Planning!$E$3)),\"\",IF(OR($C9>$C$7,MOD($C9-1,$B$7)>0),\"\",QUOTIENT($C9-1,$B$7)+1)))","v":1},1,"09:00:00",2,4,11,"VFL Bochum 1848","-","RB Leipzig",1," : ",3,null,null,{"$f":"IF($AM$9:$AM$108=\"\",\"\",$AM$9:$AM$108&\" - \"&$AN$9:$AN$108)","v":"2 - 1"},1,"Eintracht Frankfurt",3,2,1,0,7,31,null,6," - ",1,5,5,null,7,2050007031.5005093,null,null,null,null,{"$f":"IF(Planning!$D7=\"\",\"\",Planning!$D7)","v":"FC Augsburg"},{"$f":"IFERROR(INDEX(Planning!$O$7:$O$106,MATCH($R$9:$R$108,Planning!$D$7:$D$106,0)),\"\")","v":2},{"$f":"COUNTIF($J$9:$J$108,$R9)","v":1}]
[null,{"$f":"IF($B$7=0,\"\",IF(OR($B$7=0,QUOTIENT($C10-1,$B$7)+1>MAX($K$6,Planning!$E$3)),\"\",IF(OR($C10>$C$7,MOD($C10-1,$B$7)>0),\"\",QUOTIENT($C10-1,$B$7)+1)))","v":""},2,"09:00:00",3,10,2,"1. FC Köln","-","Hertha BSC",3," : ",1,null,null,"1 - 2",2,"1. FC Köln",3,2,0,1,9,21,null,5," - ",3,2,4,null,10,2040009021.5002091,null,null,null,1,{"$f":"IF(Planning!$D8=\"\",\"\",Planning!$D8)","v":"Hertha BSC"},1,{"$f":"COUNTIF($J$9:$J$108,$R10)","v":2}]
[null,{"$f":"IF($B$7=0,\"\",IF(OR($B$7=0,QUOTIENT($C11-1,$B$7)+1>MAX($K$6,Planning!$E$3)),\"\",IF(OR($C11>$C$7,MOD($C11-1,$B$7)>0),\"\",QUOTIENT($C11-1,$B$7)+1)))","v":""},3,"09:00:00",1,7,9,"Eintracht Frankfurt","-","TSG Hoffenheim",3," : ",0,null,null,"1 - 1",3,"Borussia Dortmund",2,2,0,0,7,19,1,7," - ",2,5,4,null,6,2040007019.5005093,null,null,null,null,{"$f":"IF(Planning!$D9=\"\",\"\",Planning!$D9)","v":"1. FC Union Berlin"},1,1]
[null,{"$f":"IF($B$7=0,\"\",IF(OR($B$7=0,QUOTIENT($C12-1,$B$7)+1>MAX($K$6,Planning!$E$3)),\"\",IF(OR($C12>$C$7,MOD($C12-1,$B$7)>0),\"\",QUOTIENT($C12-1,$B$7)+1)))","v":""},4,"09:25:00",2,1,3,"FC Augsburg","-","1. FC Union Berlin",1," : ",2,null,null,"1 - 2",4,"Sport-Club Freiburg",3,2,0,1,6,25,null,5," - ",6,-1,4,null,8,2040006025.4999094,null,null,null,null,{"$f":"IF(Planning!$D10=\"\",\"\",Planning!$D10)","v":"VFL Bochum 1848"},1,2]
[null,{"$f":"IF($B$7=0,\"\",IF(OR($B$7=0,QUOTIENT($C13-1,$B$7)+1>MAX($K$6,Planning!$E$3)),\"\",IF(OR($C13>$C$7,MOD($C13-1,$B$7)>0),\"\",QUOTIENT($C13-1,$B$7)+1)))","v":""},5,"09:25:00",1,5,8,"SV Werder Bremen","-","Sport-Club Freiburg",1," : ",2,null,null,"2 - 1",5,"FC Augsburg",3,2,0,1,5,28,null,7," - ",5,2,4,null,1,2040005028.50021,null,null,null,null,{"$f":"IF(Planning!$D11=\"\",\"\",Planning!$D11)","v":"SV Werder Bremen"},2,1]
[null,{"$f":"IF($B$7=0,\"\",IF(OR($B$7=0,QUOTIENT($C14-1,$B$7)+1>MAX($K$6,Planning!$E$3)),\"\",IF(OR($C14>$C$7,MOD($C14-1,$B$7)>0),\"\",QUOTIENT($C14-1,$B$7)+1)))","v":2},6,"09:50:00",1,11,10,"RB Leipzig","-","1. FC Köln",0," : ",2,null,null,"1 - 2",6,"1. FC Union Berlin",3,1,1,1,13,19,null,4," - ",5,-1,3,null,3,2030013019.4999099,null,null,null,1,{"$f":"IF(Planning!$D12=\"\",\"\",Planning!$D12)","v":"Borussia Dortmund"},1,2]
[null,{"$f":"IF($B$7=0,\"\",IF(OR($B$7=0,QUOTIENT($C15-1,$B$7)+1>MAX($K$6,Planning!$E$3)),\"\",IF(OR($C15>$C$7,MOD($C15-1,$B$7)>0),\"\",QUOTIENT($C15-1,$B$7)+1)))","v":""},7,"09:50:00",2,8,6,"Sport-Club Freiburg","-","Borussia Dortmund",1," : ",4,null,null,"2 - 1",7,"RB Leipzig",3,1,0,2,10,21,null,4," - ",5,-1,2,null,11,2020010021.4999089,null,null,null,null,{"$f":"IF(Planning!$D13=\"\",\"\",Planning!$D13)","v":"Eintracht Frankfurt"},2,1]
[null,{"$f":"IF($B$7=0,\"\",IF(OR($B$7=0,QUOTIENT($C16-1,$B$7)+1>MAX($K$6,Planning!$E$3)),\"\",IF(OR($C16>$C$7,MOD($C16-1,$B$7)>0),\"\",QUOTIENT($C16-1,$B$7)+1)))","v":""},8,"09:50:00",3,9,1,"TSG Hoffenheim","-","FC Augsburg",1," : ",3,null,null,"2 - 1",8,"VFL Bochum 1848",3,1,0,2,6,23,null,6," - ",7,-1,2,null,4,2020006023.4999096,null,null,null,null,{"$f":"IF(Planning!$D14=\"\",\"\",Planning!$D14)","v":"Sport-Club Freiburg"},2,1]
[null,{"$f":"IF($B$7=0,\"\",IF(OR($B$7=0,QUOTIENT($C17-1,$B$7)+1>MAX($K$6,Planning!$E$3)),\"\",IF(OR($C17>$C$7,MOD($C17-1,$B$7)>0),\"\",QUOTIENT($C17-1,$B$7)+1)))","v":""},9,"10:15:00",1,4,5,"VFL Bochum 1848","-","SV Werder Bremen",3," : ",1,null,null,"1 - 1",9,"Hertha BSC",2,1,0,1,4,17,1,3," - ",4,-1,2,null,2,2020004017.4999099,null,null,null,1,{"$f":"IF(Planning!$D15=\"\",\"\",Planning!$D15)","v":"TSG Hoffenheim"},1,1]
[null,{"$f":"IF($B$7=0,\"\",IF(OR($B$7=0,QUOTIENT($C18-1,$B$7)+1>MAX($K$6,Planning!$E$3)),\"\",IF(OR($C18>$C$7,MOD($C18-1,$B$7)>0),\"\",QUOTIENT($C18-1,$B$7)+1)))","v":""},10,"10:15:00",3,3,7,"1. FC Union Berlin","-","Eintracht Frankfurt",1," : ",1,null,null,"1 - 1",10,"TSG Hoffenheim",2,0,0,2,9,12,1,1," - ",6,-5,0,null,9,2000009012.4995091,null,null,null,null,{"$f":"IF(Planning!$D16=\"\",\"\",Planning!$D16)","v":"1. FC Köln"},1,1]
[null,{"$f":"IF($B$7=0,\"\",IF(OR($B$7=0,QUOTIENT($C19-1,$B$7)+1>MAX($K$6,Planning!$E$3)),\"\",IF(OR($C19>$C$7,MOD($C19-1,$B$7)>0),\"\",QUOTIENT($C19-1,$B$7)+1)))","v":3},11,"10:40:00",1,11,8,"RB Leipzig","-","Sport-Club Freiburg",1," : ",2,null,null,"1 - 2",11,"SV Werder Bremen",3,0,0,3,8,16,null,3," - ",7,-4,0,null,5,2000008016.4996095,null,null,null,null,{"$f":"IF(Planning!$D17=\"\",\"\",Planning!$D17)","v":"RB Leipzig"},1,2]
[null,{"$f":"IF($B$7=0,\"\",IF(OR($B$7=0,QUOTIENT($C20-1,$B$7)+1>MAX($K$6,Planning!$E$3)),\"\",IF(OR($C20>$C$7,MOD($C20-1,$B$7)>0),\"\",QUOTIENT($C20-1,$B$7)+1)))","v":""},12,"10:40:00",2,2,5,"Hertha BSC","-","SV Werder Bremen",2," : ",1,null,null,"",null,null,null,null,null,null,null,null,null,null,null,null,null,null,null,null,null,null,null,null,null,{"$f":"IF(Planning!$D18=\"\",\"\",Planning!$D18)","v":""},"",0]
[null,{"$f":"IF($B$7=0,\"\",IF(OR($B$7=0,QUOTIENT($C21-1,$B$7)+1>MAX($K$6,Planning!$E$3)),\"\",IF(OR($C21>$C$7,MOD($C21-1,$B$7)>0),\"\",QUOTIENT($C21-1,$B$7)+1)))","v":""},13,"10:40:00",3,1,4,"FC Augsburg","-","VFL Bochum 1848",3," : ",2,null,null,"",null,null,null,null,null,null,null,null,null,null,null,null,null,null,null,null,null,null,null,null,null,{"$f":"IF(Planning!$D19=\"\",\"\",Planning!$D19)","v":""},"",0]
[null,{"$f":"IF($B$7=0,\"\",IF(OR($B$7=0,QUOTIENT($C22-1,$B$7)+1>MAX($K$6,Planning!$E$3)),\"\",IF(OR($C22>$C$7,MOD($C22-1,$B$7)>0),\"\",QUOTIENT($C22-1,$B$7)+1)))","v":""},14,"11:05:00",2,6,3,"Borussia Dortmund","-","1. FC Union Berlin",3," : ",1,null,null,"",null,null,null,null,null,null,null,null,null,null,null,null,null,null,null,null,null,null,null,null,null,{"$f":"IF(Planning!$D20=\"\",\"\",Planning!$D20)","v":""},"",0]
[null,{"$f":"IF($B$7=0,\"\",IF(OR($B$7=0,QUOTIENT($C23-1,$B$7)+1>MAX($K$6,Planning!$E$3)),\"\",IF(OR($C23>$C$7,MOD($C23-1,$B$7)>0),\"\",QUOTIENT($C23-1,$B$7)+1)))","v":""},15,"11:05:00",1,7,10,"Eintracht Frankfurt","-","1. FC Köln",2," : ",0,null,null,"",null,null,null,null,null,null,null,null,null,null,null,null,null,null,null,null,null,null,null,null,null,{"$f":"IF(Planning!$D21=\"\",\"\",Planning!$D21)","v":""},"",0]
[null,{"$f":"IF($B$7=0,\"\",IF(OR($B$7=0,QUOTIENT($C24-1,$B$7)+1>MAX($K$6,Planning!$E$3)),\"\",IF(OR($C24>$C$7,MOD($C24-1,$B$7)>0),\"\",QUOTIENT($C24-1,$B$7)+1)))","v":4},16,"11:30:00",3,null,null,null,"-",null,null," : ",null,null,null,"",null,null,null,null,null,null,null,null,null,null,null,null,null,null,null,null,null,null,null,null,null,{"$f":"IF(Planning!$D22=\"\",\"\",Planning!$D22)","v":""},"",0]
[null,{"$f":"IF($B$7=0,\"\",IF(OR($B$7=0,QUOTIENT($C25-1,$B$7)+1>MAX($K$6,Planning!$E$3)),\"\",IF(OR($C25>$C$7,MOD($C25-1,$B$7)>0),\"\",QUOTIENT($C25-1,$B$7)+1)))","v":""},17,"11:30:00",2,null,null,null,"-",null,null," : ",null,null,null,"",null,null,null,null,null,null,null,null,null,null,null,null,null,null,null,null,null,null,null,null,null,{"$f":"IF(Planning!$D23=\"\",\"\",Planning!$D23)","v":""},"",0]
[null,{"$f":"IF($B$7=0,\"\",IF(OR($B$7=0,QUOTIENT($C26-1,$B$7)+1>MAX($K$6,Planning!$E$3)),\"\",IF(OR($C26>$C$7,MOD($C26-1,$B$7)>0),\"\",QUOTIENT($C26-1,$B$7)+1)))","v":""},18,"11:30:00",1,null,null,null,"-",null,null," : ",null,null,null,"",null,null,null,null,null,null,null,null,null,null,null,null,null,null,null,null,null,null,null,null,null,{"$f":"IF(Planning!$D24=\"\",\"\",Planning!$D24)","v":""},"",0]
[null,{"$f":"IF($B$7=0,\"\",IF(OR($B$7=0,QUOTIENT($C27-1,$B$7)+1>MAX($K$6,Planning!$E$3)),\"\",IF(OR($C27>$C$7,MOD($C27-1,$B$7)>0),\"\",QUOTIENT($C27-1,$B$7)+1)))","v":""},19,"11:55:00",2,null,null,null,"-",null,null," : ",null,null,null,"",null,null,null,null,null,null,null,null,null,null,null,null,null,null,null,null,null,null,null,null,null,{"$f":"IF(Planning!$D25=\"\",\"\",Planning!$D25)","v":""},"",0]
[null,{"$f":"IF($B$7=0,\"\",IF(OR($B$7=0,QUOTIENT($C28-1,$B$7)+1>MAX($K$6,Planning!$E$3)),\"\",IF(OR($C28>$C$7,MOD($C28-1,$B$7)>0),\"\",QUOTIENT($C28-1,$B$7)+1)))","v":""},20,"11:55:00",1,null,null,null,"-",null,null," : ",null,null,null,"",null,null,null,null,null,null,null,null,null,null,null,null,null,null,null,null,null,null,null,null,null,{"$f":"IF(Planning!$D26=\"\",\"\",Planning!$D26)","v":""},"",0]
[null,{"$f":"IF($B$7=0,\"\",IF(OR($B$7=0,QUOTIENT($C29-1,$B$7)+1>MAX($K$6,Planning!$E$3)),\"\",IF(OR($C29>$C$7,MOD($C29-1,$B$7)>0),\"\",QUOTIENT($C29-1,$B$7)+1)))","v":5},21,"12:20:00",1,null,null,null,"-",null,null," : ",null,null,null,"",null,null,null,null,null,null,null,null,null,null,null,null,null,null,null,null,null,null,null,null,null,{"$f":"IF(Planning!$D27=\"\",\"\",Planning!$D27)","v":""},"",0]
[null,{"$f":"IF($B$7=0,\"\",IF(OR($B$7=0,QUOTIENT($C30-1,$B$7)+1>MAX($K$6,Planning!$E$3)),\"\",IF(OR($C30>$C$7,MOD($C30-1,$B$7)>0),\"\",QUOTIENT($C30-1,$B$7)+1)))","v":""},22,"12:20:00",2,null,null,null,"-",null,null," : ",null,null,null,"",null,null,null,null,null,null,null,null,null,null,null,null,null,null,null,null,null,null,null,null,null,{"$f":"IF(Planning!$D28=\"\",\"\",Planning!$D28)","v":""},"",0]
{"$rows_left_out":979}
{"sheet":"CrossTable","index":2,"n_rows":14,"n_cols":14,"rows_kept":14,"cut":false,"hidden":false,"merged":[]}
[]
[null,null,{"$f":"Language!$E$38","v":"Cross table of match results"}]
[null,null,null,"FC Augsburg","Hertha BSC","1. FC Union Berlin","VFL Bochum 1848","SV Werder Bremen","Borussia Dortmund","Eintracht Frankfurt","Sport-Club Freiburg","TSG Hoffenheim","1. FC Köln","RB Leipzig"]
[null,null,"FC Augsburg",null,null,"1 - 2","3 - 2",null,null,null,null,"3 - 1"]
[null,null,"Hertha BSC",null,null,null,null,"2 - 1",null,null,null,null,"1 - 3"]
[null,null,"1. FC Union Berlin","2 - 1",null,null,null,null,"1 - 3","1 - 1"]
[null,null,"VFL Bochum 1848","2 - 3",null,null,null,"3 - 1",null,null,null,null,null,"1 - 3"]
[null,null,"SV Werder Bremen",null,"1 - 2",null,"1 - 3",null,null,null,"1 - 2"]
[null,null,"Borussia Dortmund",null,null,"3 - 1",null,null,null,null,"4 - 1"]
[null,null,"Eintracht Frankfurt",null,null,"1 - 1",null,null,null,null,null,"3 - 0","2 - 0"]
[null,null,"Sport-Club Freiburg",null,null,null,null,"2 - 1","1 - 4",null,null,null,null,"2 - 1"]
[null,null,"TSG Hoffenheim","1 - 3",null,null,null,null,null,"0 - 3"]
[null,null,"1. FC Köln",null,"3 - 1",null,null,null,null,"0 - 2",null,null,null,"2 - 0"]
[null,null,"RB Leipzig",null,null,null,"3 - 1",null,null,null,"1 - 2",null,"0 - 2"]

{"sheet":"Paarungen","index":3,"n_rows":103,"n_cols":103,"rows_kept":103,"cut":false,"hidden":true,"merged":[[1,2,1,22]]}
[]
[null,null,{"$f":"Language!$E$34","v":"Pairings"}]
[null,null,null,1,2,3,4,5,6,7,8,9,10,11,12,13,14,15,16,17,18,19,20,21,22,23,24,25,26,27,28,29,30,31,32,33,34,35,36,37,38,39,40,41,42,43,44,45,46,47,48,49,50,51,52,53,54,55,56,57,58,59,60,61,62,63,64,65,66,67,68,69,70,71,72,73,74,75,76,77,78,79,80,81,82,83,84,85,86,87,88,89,90,91,92,93,94,95,96,97,98,99,100]
[null,null,1,null,null,"x","x",null,null,null,null,"x"]
[null,null,2,null,null,null,null,"x",null,null,null,null,"x"]
[null,null,3,"x",null,null,null,null,"x","x"]
[null,null,4,"x",null,null,null,"x",null,null,null,null,null,"x"]
[null,null,5,null,"x",null,"x",null,null,null,"x"]
[null,null,6,null,null,"x",null,null,null,null,"x"]
[null,null,7,null,null,"x",null,null,null,null,null,"x","x"]
[null,null,8,null,null,null,null,"x","x",null,null,null,null,"x"]
[null,null,9,"x",null,null,null,null,null,"x"]
[null,null,10,null,"x",null,null,null,null,"x",null,null,null,"x"]
[null,null,11,null,null,null,"x",null,null,null,"x",null,"x"]
[null,null,12]
[null,null,13]
[null,null,14]
[null,null,15]
[null,null,16]
[null,null,17]
[null,null,18]
[null,null,19]
[null,null,20]
[null,null,21]
[null,null,22]
[null,null,23]
[null,null,24]
[null,null,25]
[null,null,26]
[null,null,27]
{"$rows_left_out":74}
{"sheet":"Language","index":4,"n_rows":115,"n_cols":12,"rows_kept":115,"cut":false,"hidden":false,"merged":[[0,5,0,7],[2,7,3,7],[1,5,1,6],[2,3,3,3],[2,4,3,4],[2,5,3,5],[2,6,3,6]]}
[null,null,null,null,null,{"$f":"$E$35","v":"Choose language"},null,null,null,"english",{"$f":"_xlfn.UNICHAR(8592)","v":"←"},{"$f":"$E$75","v":"Click here and choose language"}]
[]
[null,"english",{"$f":"IF(AND($J$1<>B4,$J$1<>B5),1,0)","v":1},null,null,"english","deutsch","my language"]
[null,"deutsch",{"$f":"IF($J$1=B4,1,0)","v":0}]
[null,"my language",{"$f":"IF($J$1=B5,1,0)","v":0},null,null,{"$f":"$E$36","v":"Captions"}]
[null,null,null,null,{"$f":"IF($C$3,F6,IF($C$4,G6,IF($H6<>\"\",$H6,$F6)))","v":"Tie break"},"Tie break","Tie-Break"]
[null,null,null,null,{"$f":"IF($C$3,F7,IF($C$4,G7,IF($H7<>\"\",$H7,$F7)))","v":"Settings"},"Settings","Einstellungen"]
[null,null,null,null,"Match points","Match points","Spielpunkte"]
[null,null,null,null,"No.","No.","Nr."]
[null,null,null,null,"Participant or Team","Participant or Team","Teilnehmer bzw. Mannschaft"]
[null,null,null,null,"Results","Results","Ergebnisse"]
[null,null,null,null,"Table","Table","Tabelle"]
[null,null,null,null,"Matchups","Matchups","Spielpaarungen"]
[null,null,null,null,"Matchup","Matchup","Spielpaarung"]
[null,null,null,null,"Result","Result","Ergebnis"]
[null,null,null,null,"Matchweeks","Matchweeks","Spieltage"]
[null,null,null,null,"Up to round:","Up to round:","Bis Runde:"]
[null,null,null,null,"BH","BH","BH"]
[null,null,null,null,"FBH","FBH","FBH"]
[null,null,null,null,"Name","Name","Name"]
[null,null,null,null,"Pl","Pl","Sp"]
[null,null,null,null,"W","W","G"]
[null,null,null,null,"Diff.","Diff.","Diff."]
[null,null,null,null,"L","L","V"]
[null,null,null,null,"GF  -  GA","GF  -  GA","Tore"]
[null,null,null,null,"GD","GD","TD"]
[null,null,null,null,"Pts","Pts","Pkt"]
[null,null,null,null,"D","D","U"]
[null,null,null,null,"Number of rounds:","Number of rounds:","Anzahl der Runden:"]
[null,null,null,null,"Participant list","Participant list","Teilnehmerliste"]
{"$rows_left_out":86}
{"sheet":"Settings","index":5,"n_rows":29,"n_cols":3,"rows_kept":29,"cut":false,"hidden":false,"merged":[[0,1,0,2],[13,1,13,2]]}
[null,{"$f":"Language!$E$7","v":"Settings"}]
[]
[null,{"$f":"Language!$E$39","v":"Number of points for a win:"},2]
[]
[null,{"$f":"Language!$E$103","v":"Top criterion for the ranking:"},"Points"]
[]
[null,{"$f":"Language!$E$41","v":"Number of points for a bye:"},0]
[]
[]
[null,{"$f":"Language!$E$54","v":"Are draws valid?"},"Yes"]
[]
[null,{"$f":"Language!$E$40","v":"Number of points for a draw:"},1]
[]
[null,{"$f":"Language!$E$57","v":"Drawn games are valid and will be counted."}]
[]
[]
[null,{"$f":"Language!$E$58","v":"Automatic saving?"},"No"]
[]
[]
[null,{"$f":"Language!$E$60","v":"Automatic backup after each round?"},"No"]
[]
[]
[]
[null,{"$f":"Language!$E$61","v":"Home games (white pieces in chess):"}]
[]
[null,{"$f":"Language!$E$62","v":"Display the home game statistics to the left of the rankings?"},"No"]
[]
[]
[null,{"$f":"Language!$E$63","v":"If the home game statistics are tied, should the weaker team get home advantage or the stronger team?"},"Weaker team"]

{"sheet":"Help","index":6,"n_rows":77,"n_cols":10,"rows_kept":77,"cut":false,"hidden":false,"merged":[[75,1,75,7],[76,1,76,7],[75,9,75,15],[76,9,76,15]]}
[]
[null,"English",null,null,null,null,null,null,null,"Deutsch"]
[]
[]
[]
[]
[]
[]
[]
[]
[]
[]
[]
[]
[]
[]
[]
[]
[]
[]
[]
[]
[]
[]
[]
[]
[]
[]
[]
[]
{"$rows_left_out":47}