{"text_format":"1","workbook":"xlsx","n_sheets":3,"sheets":["3 x 4","1 x 40","1 x 200"],"not_rendered":{"charts":0,"images":0,"macros":1,"external_links":0,"defined_names":0,"comments":0,"pivot_tables":0},"unopened":[],"bounds":{"document_bytes":16777216,"sheet_cells":100000,"rows_first":2000,"rows_last":500,"rows_between":2000,"halvings":0,"cell_chars":16384,"cell_head_chars":4096},"cells_cut":0,"cells_raw":0,"read":"whole","date_system":"1900"}

{"sheet":"3 x 4","index":0,"n_rows":76,"n_cols":42,"rows_kept":76,"cut":false,"hidden":false,"merged":[[36,16,36,17],[73,7,73,14],[74,7,74,14],[75,7,75,14],[43,6,44,14],[52,6,53,14],[59,6,60,14],[65,6,66,14],[71,6,71,14],[72,7,72,14],[3,34,3,37],[3,38,3,41],[37,22,37,24],[10,1,10,2],[10,16,10,17],[10,29,10,33],[11,22,11,24],[11,30,11,32],[4,7,4,8],[4,12,4,14],[4,22,4,24],[4,30,4,32],[17,1,17,2],[17,16,17,17],[18,22,18,24],[36,1,36,2],[3,29,3,33],[0,0,0,1],[1,0,1,1],[1,6,1,14],[3,1,3,2],[3,16,3,17]]}
["Version 2.2"]
["2025-09-07",null,null,null,null,null,"Tournament schedule  3 x 4"]
[]
[null,"Group A",null,null,null,null,null,null,null,null,null,null,null,null,null,null,"Table Group A",null,null,null,null,null,null,null,null,null,null,null,null,"Direct comparisons",null,null,null,null,"First legs",null,null,null,"Second legs"]
[null,"No","Team","Tie Break","Pen. pts",null,"No","Pairing",null,null,null,null,"Result",null,null,null,"Rank","Team","Pld","W","D","L","Goals",null,null,"GD","Pts",null,null,"Pts","Goals",null,null,"GD",{"$f":"LEFT($R$6,6)","v":"FC Bar"},{"$f":"LEFT($R$7,6)","v":"Eintra"},{"$f":"LEFT($R$8,6)","v":"Maibac"},{"$f":"LEFT($R$9,6)","v":"1.FC R"},{"$f":"LEFT($R$6,6)","v":"FC Bar"},{"$f":"LEFT($R$7,6)","v":"Eintra"},{"$f":"LEFT($R$8,6)","v":"Maibac"},{"$f":"LEFT($R$9,6)","v":"1.FC R"}]
[null,"A1","1.FC Riedwald",null,null,null,1,"A1","A4",{"$f":"IFERROR(VLOOKUP($H6,$B$6:$C$36,2,0),\"\")","v":"1.FC Riedwald"},"-",{"$f":"IFERROR(VLOOKUP($I6,$B$6:$C$36,2,0),\"\")","v":"Maibach 1822 eV"},2,":",1,null,{"$f":"Group_table(0,3,$J$6:$J$41,$L$6:$L$41,$M$6:$M$41,$O$6:$O$41,$C$6:$C$9,$D$6:$D$9,$E$6:$E$9)","v":1},"FC Barcelona",3,2,0,1,9,":",6,3,6,"","FC Barcelona","","","","","","","1 : 2","5 : 2","3 : 2","","","",""]
[null,"A2","Eintracht Frankfurt",null,null,null,2,"B1","B4","SSV Wildbach","-","FC Grönlingen",1,":",0,null,2,"Eintracht Frankfurt",3,2,0,1,6,":",5,1,6,"","Eintracht Frankfurt","","","","","","2 : 1","","2 : 3","2 : 1","","","",""]
[null,"A3","FC Barcelona",null,null,null,3,"C1","C4","Kickers Offenbach","-","HSV",1,":",2,null,3,"Maibach 1822 eV",4,2,0,2,8,":",9,-1,6,"","Maibach 1822 eV","","","","","","2 : 5","3 : 2","","1 : 2","","","","2 : 0"]
[null,"A4","Maibach 1822 eV",null,null,null,4,"A3","A2","FC Barcelona","-","Eintracht Frankfurt",1,":",2,null,4,"1.FC Riedwald",4,1,0,3,5,":",8,-3,3,"","1.FC Riedwald","","","","","","2 : 3","1 : 2","2 : 1","","","","0 : 2",""]
[null,null,null,null,null,null,5,"B3","B2","Arsenal London","-","Manchester City",2,":",1]
[null,"Group B",null,null,null,null,6,"C3","C2","Borussia Dortmund","-","SSV Wildeck",1,":",2,null,"Table Group B",null,null,null,null,null,null,null,null,null,null,null,null,"Direct comparisons"]
[null,"No","Team","Tie Break","Pen. pts",null,7,"A3","A1","FC Barcelona","-","1.FC Riedwald",3,":",2,null,"Rank","Team","Pld","W","D","L","Goals",null,null,"GD","Pts",null,null,"Pts","Goals",null,null,"GD"]
[null,"B1","SSV Wildbach",null,null,null,8,"B3","B1","Arsenal London","-","SSV Wildbach",2,":",1,null,{"$f":"Group_table(0,3,$J$6:$J$41,$L$6:$L$41,$M$6:$M$41,$O$6:$O$41,$C$13:$C$16,$D$13:$D$16,$E$13:$E$16)","v":1},"Arsenal London",3,3,0,0,7,":",2,5,9,"","Arsenal London","","","","",""]
[null,"B2","Manchester City",null,null,null,9,"C3","C1","Borussia Dortmund","-","Kickers Offenbach",2,":",1,null,2,"Manchester City",3,1,0,2,2,":",3,-1,3,"","Manchester City",3,1,":",0,1]
[null,"B3","Arsenal London",null,null,null,10,"A2","A4","Eintracht Frankfurt","-","Maibach 1822 eV",2,":",3,null,3,"SSV Wildbach",3,1,0,2,2,":",3,-1,3,"","SSV Wildbach",0,0,":",1,-1]
[null,"B4","FC Grönlingen",null,null,null,11,"B2","B4","Manchester City","-","FC Grönlingen",0,":",1,null,4,"FC Grönlingen",3,1,0,2,1,":",4,-3,3,"","FC Grönlingen","","","","",""]
[null,null,null,null,null,null,12,"C2","C4","SSV Wildeck","-","HSV",1,":",1]
[null,"Group C",null,null,null,null,13,"A1","A2","1.FC Riedwald","-","Eintracht Frankfurt",1,":",2,null,"Table Group C"]
[null,"No","Team","Tie Break","Pen. pts",null,14,"B1","B2","SSV Wildbach","-","Manchester City",0,":",1,null,"Rank","Team","Pld","W","D","L","Goals",null,null,"GD","Pts"]
[null,"C1","Kickers Offenbach",null,null,null,15,"C1","C2","Kickers Offenbach","-","SSV Wildeck",2,":",1,null,{"$f":"Group_table(0,3,$J$6:$J$41,$L$6:$L$41,$M$6:$M$41,$O$6:$O$41,$C$20:$C$23,$D$20:$D$23,$E$20:$E$23)","v":1},"Borussia Dortmund",3,2,0,1,6,":",5,1,6]
[null,"C2","SSV Wildeck",null,null,null,16,"A4","A3","Maibach 1822 eV","-","FC Barcelona",2,":",5,null,2,"HSV",3,1,1,1,5,":",5,0,4]
[null,"C3","Borussia Dortmund",null,null,null,17,"B4","B3","FC Grönlingen","-","Arsenal London",0,":",3,null,3,"SSV Wildeck",3,1,1,1,4,":",4,0,4]
[null,"C4","HSV",null,null,null,18,"C4","C3","HSV","-","Borussia Dortmund",2,":",3,null,4,"Kickers Offenbach",3,1,0,2,4,":",5,-1,3]
[null,null,null,null,null,null,19,"A4","A1","Maibach 1822 eV","-","1.FC Riedwald",2,":",0]
[null,null,null,null,null,null,20,"B4","B1","FC Grönlingen","-","SSV Wildbach",null,":"]
[null,null,null,null,null,null,21,"C4","C1","HSV","-","Kickers Offenbach",null,":"]
[null,null,null,null,null,null,22,"A2","A3","Eintracht Frankfurt","-","FC Barcelona",null,":"]
[null,null,null,null,null,null,23,"B2","B3","Manchester City","-","Arsenal London",null,":"]
[null,null,null,null,null,null,24,"C2","C3","SSV Wildeck","-","Borussia Dortmund",null,":"]
[null,null,null,null,null,null,25,"A1","A3","1.FC Riedwald","-","FC Barcelona",null,":"]
[null,null,null,null,null,null,26,"B1","B3","SSV Wildbach","-","Arsenal London",null,":"]
[null,null,null,null,null,null,27,"C1","C3","Kickers Offenbach","-","Borussia Dortmund",null,":"]
[null,null,null,null,null,null,28,"A4","A2","Maibach 1822 eV","-","Eintracht Frankfurt",null,":"]
[null,null,null,null,null,null,29,"B4","B2","FC Grönlingen","-","Manchester City",null,":"]
[null,null,null,null,null,null,30,"C4","C2","HSV","-","SSV Wildeck",null,":",null,null,"Table to determine the two best third-placed teams in the group:"]
[null,null,null,null,null,null,31,"A2","A1","Eintracht Frankfurt","-","1.FC Riedwald",null,":"]
[null,"Third placed",null,null,null,null,32,"B2","B1","Manchester City","-","SSV Wildbach",null,":",null,null,"Table third-placed"]
[null,"No","Team","Tie Break","Pen. pts",null,33,"C2","C1","SSV Wildeck","-","Kickers Offenbach",null,":",null,null,"Rank","Team","Pld","W","D","L","Goals",null,null,"GD","Pts"]
[null,"A3",{"$f":"R8","v":"Maibach 1822 eV"},null,null,null,34,"A3","A4","FC Barcelona","-","Maibach 1822 eV",null,":",null,null,{"$f":"Group_table(0,3,$J$6:$J$41,$L$6:$L$41,$M$6:$M$41,$O$6:$O$41,$C$39:$C$41,$D$39:$D$41,$E$39:$E$41)","v":1},"Maibach 1822 eV",4,2,0,2,8,":",9,-1,6]
[null,"B3",{"$f":"R15","v":"SSV Wildbach"},null,null,null,35,"B3","B4","Arsenal London","-","FC Grönlingen",null,":",null,null,2,"SSV Wildeck",3,1,1,1,4,":",4,0,4]
[null,"C3",{"$f":"R22","v":"SSV Wildeck"},null,null,null,36,"C3","C4","Borussia Dortmund","-","HSV",null,":",null,null,3,"SSV Wildbach",3,1,0,2,2,":",3,-1,3]
[]
[]
[null,null,null,null,null,null,"Quarterfinals"]
[]
[]
[null,null,null,null,null,null,37,"1A","3-1",{"$f":"R6","v":"FC Barcelona"},"-",{"$f":"R39","v":"Maibach 1822 eV"},2,":",1]
[null,null,null,null,null,null,38,"1B","3-2",{"$f":"R13","v":"Arsenal London"},"-",{"$f":"R40","v":"SSV Wildeck"},1,":",3]
[null,null,null,null,null,null,39,"1C","2A",{"$f":"R20","v":"Borussia Dortmund"},"-",{"$f":"R7","v":"Eintracht Frankfurt"},2,":",3]
[null,null,null,null,null,null,40,"2B","2C",{"$f":"R14","v":"Manchester City"},"-",{"$f":"R21","v":"HSV"},4,":",0]
[]
[]
[null,null,null,null,null,null,"Semifinals"]
[]
[]
[null,null,null,null,null,null,41,"W37","W38",{"$f":"IF(OR(M47=\"\",O47=\"\",M47=O47),\"\",IF(M47>O47,J47,L47))","v":"FC Barcelona"},"-",{"$f":"IF(OR(M48=\"\",O48=\"\",M48=O48),\"\",IF(M48>O48,J48,L48))","v":"SSV Wildeck"},2,":",4]
[null,null,null,null,null,null,42,"W39","W40",{"$f":"IF(OR(M49=\"\",O49=\"\",M49=O49),\"\",IF(M49>O49,J49,L49))","v":"Eintracht Frankfurt"},"-",{"$f":"IF(OR(M50=\"\",O50=\"\",M50=O50),\"\",IF(M50>O50,J50,L50))","v":"Manchester City"},1,":",2]
[]
[]
[null,null,null,null,null,null,"Match for 3rd place"]
[]
[]
[null,null,null,null,null,null,43,"L41","L42",{"$f":"IF(OR(M56=\"\",O56=\"\",M56=O56),\"\",IF(M56<O56,J56,L56))","v":"FC Barcelona"},"-",{"$f":"IF(OR(M57=\"\",O57=\"\",M57=O57),\"\",IF(M57<O57,J57,L57))","v":"Eintracht Frankfurt"},1,":",0]
[]
[]
[null,null,null,null,null,null,"Final"]
[]
[]
[null,null,null,null,null,null,44,"W41","W42",{"$f":"IF(OR(M56=\"\",O56=\"\",M56=O56),\"\",IF(M56>O56,J56,L56))","v":"SSV Wildeck"},"-",{"$f":"IF(OR(M57=\"\",O57=\"\",M57=O57),\"\",IF(M57>O57,J57,L57))","v":"Manchester City"},2,":",3]
[]
[]
[null,null,null,null,null,null,"Final table"]
[null,null,null,null,null,null,"1.",{"$f":"IF(OR(M69=\"\",O69=\"\",M69=O69),\"\",IF(M69>O69,J69,L69))","v":"Manchester City"}]
[null,null,null,null,null,null,"2.",{"$f":"IF(OR(M69=\"\",O69=\"\",M69=O69),\"\",IF(M69<O69,J69,L69))","v":"SSV Wildeck"}]
[null,null,null,null,null,null,"3.",{"$f":"IF(OR(M63=\"\",O63=\"\",M63=O63),\"\",IF(M63>O63,J63,L63))","v":"FC Barcelona"}]
[null,null,null,null,null,null,"4.",{"$f":"IF(OR(M63=\"\",O63=\"\",M63=O63),\"\",IF(M63<O63,J63,L63))","v":"Eintracht Frankfurt"}]

{"sheet":"1 x 40","index":1,"n_rows":1565,"n_cols":114,"rows_kept":1565,"cut":false,"hidden":false,"merged":[[0,0,0,1],[1,0,1,1],[3,16,3,17],[3,29,3,33],[3,1,3,2],[1,6,1,14],[2,9,2,11],[3,74,3,77],[3,34,3,37],[4,7,4,8],[4,12,4,14],[4,22,4,24],[4,30,4,32]]}
[]
[null,null,null,null,null,null,"Tournament schedule 1 x 40"]
[null,null,null,null,null,null,null,null,null,"(with second legs)"]
[null,"Group A",null,null,null,null,null,null,null,null,null,null,null,null,null,null,"Table Group A",null,null,null,null,null,null,null,null,null,null,null,null,"Direct comparisons",null,null,null,null,"First legs",null,null,null,null,null,null,null,null,null,null,null,null,null,null,null,null,null,null,null,null,null,null,null,null,null,null,null,null,null,null,null,null,null,null,null,null,null,null,null,"Second legs"]
[null,"No","Team","Tie Break","Pen. pts",null,"No","Pairing",null,null,null,null,"Result",null,null,null,"Rank","Team","Pld","W","D","L","Goals",null,null,"GD","Pts",null,null,"Pts","Goals",null,null,"GD",{"$f":"LEFT($R$6,6)","v":"FC Lil"},{"$f":"LEFT($R$7,6)","v":"FC Ars"},{"$f":"LEFT($R$8,6)","v":"FC Bay"},{"$f":"LEFT($R$9,6)","v":"FC Gir"},{"$f":"LEFT($R$10,6)","v":"FC Liv"},{"$f":"LEFT($R$11,6)","v":"Boruss"},{"$f":"LEFT($R$12,6)","v":"Celtic"},{"$f":"LEFT($R$13,6)","v":"Inter "},{"$f":"LEFT($R$14,6)","v":"Hertha"},{"$f":"LEFT($R$15,6)","v":"Schach"},{"$f":"LEFT($R$16,6)","v":"Young "},{"$f":"LEFT($R$17,6)","v":"Sporti"},{"$f":"LEFT($R$18,6)","v":"Feyeno"},{"$f":"LEFT($R$19,6)","v":"FC Brü"},{"$f":"LEFT($R$20,6)","v":"AS Mon"},{"$f":"LEFT($R$21,6)","v":"Atleti"},{"$f":"LEFT($R$22,6)","v":"Atalan"},{"$f":"LEFT($R$23,6)","v":"Juvent"},{"$f":"LEFT($R$24,6)","v":"Red Bu"},{"$f":"LEFT($R$25,6)","v":"Aston "},{"$f":"LEFT($R$26,6)","v":"Mainz "},{"$f":"LEFT($R$27,6)","v":"Sturm "},{"$f":"LEFT($R$28,6)","v":"PSV Ei"},{"$f":"LEFT($R$29,6)","v":"AC Mai"},{"$f":"LEFT($R$30,6)","v":"Eintra"},{"$f":"LEFT($R$31,6)","v":"Bayer "},{"$f":"LEFT($R$32,6)","v":"RB Lei"},{"$f":"LEFT($R$33,6)","v":"Paris "},{"$f":"LEFT($R$34,6)","v":"FC Bar"},{"$f":"LEFT($R$35,6)","v":"AC Rom"},{"$f":"LEFT($R$36,6)","v":"FC Bas"},{"$f":"LEFT($R$37,6)","v":"Manche"},{"$f":"LEFT($R$38,6)","v":"VfB St"},{"$f":"LEFT($R$39,6)","v":"Stade "},{"$f":"LEFT($R$40,6)","v":"FC Bol"},{"$f":"LEFT($R$41,6)","v":"Benfic"},{"$f":"LEFT($R$42,6)","v":"Real M"},{"$f":"LEFT($R$43,6)","v":"Dinamo"},{"$f":"LEFT($R$44,6)","v":"OSC Li"},{"$f":"LEFT($R$45,6)","v":"Roter "},{"$f":"AI5","v":"FC Lil"},{"$f":"AJ5","v":"FC Ars"},"FC Bay","FC Gir","FC Liv","Boruss","Celtic","Inter ","Hertha","Schach","Young ","Sporti","Feyeno","FC Brü","AS Mon","Atleti","Atalan","Juvent","Red Bu","Aston ","Mainz ","Sturm ","PSV Ei","AC Mai","Eintra","Bayer ","RB Lei","Paris ","FC Bar","AC Rom","FC Bas","Manche","VfB St","Stade ","FC Bol","Benfic","Real M","Dinamo","OSC Li","Roter "]
[null,1,"Real Madrid",null,null,null,1,{"$f":"Match_pairings(40,TRUE,TRUE)","v":4},26,{"$f":"IFERROR(VLOOKUP($H6,$B$6:$C$45,2,0),\"\")","v":"Paris Saint-Germain"},"-",{"$f":"IFERROR(VLOOKUP($I6,$B$6:$C$45,2,0),\"\")","v":"Roter Stern Belgrad"},3,":",1,null,{"$f":"Group_table(0,3,$J$6:$J$1565,$L$6:$L$1565,$M$6:$M$1565,$O$6:$O$1565,$C$6:$C$45,$D$6:$D$45,$E$6:$E$45)","v":1},"FC Lille",40,23,7,10,98,":",42,56,76,"","FC Lille","","","","","","","0 : 2","3 : 0","1 : 5","2 : 0","9 : 2","0 : 0","0 : 3","0 : 0","5 : 1","0 : 3","4 : 0","0 : 1","1 : 2","2 : 0","0 : 0","4 : 0","1 : 3","1 : 3","3 : 1","5 : 2","9 : 2","3 : 0","0 : 0","0 : 0","2 : 5","0 : 0","3 : 0","3 : 1","3 : 0","1 : 3","5 : 1","3 : 0","0 : 0","2 : 0","3 : 0","3 : 0","1 : 0","9 : 2","4 : 0","","","","3 : 0","","","","","","","","","","","","","","","","","","","","","","","","","","","","","","","","","","","",""]
[null,2,"Manchester City",null,null,null,2,25,23,{"$f":"IFERROR(VLOOKUP($H7,$B$6:$C$45,2,0),\"\")","v":"OSC Lille"},"-",{"$f":"IFERROR(VLOOKUP($I7,$B$6:$C$45,2,0),\"\")","v":"Dinamo Zagreb"},0,":",3,null,2,"FC Arsenal",40,22,5,13,83,":",70,13,71,"","FC Arsenal","","","","","","2 : 0","","3 : 0","3 : 0","0 : 0","1 : 5","0 : 3","2 : 9","0 : 3","2 : 9","1 : 3","2 : 1","3 : 1","3 : 0","5 : 1","4 : 0","0 : 3","0 : 3","1 : 5","0 : 0","3 : 0","2 : 5","0 : 0","1 : 0","0 : 0","3 : 0","0 : 3","2 : 0","3 : 1","0 : 3","3 : 0","0 : 0","3 : 1","2 : 0","1 : 5","5 : 1","9 : 2","3 : 1","1 : 0","9 : 2","","","","","","","","","","","","","","","","","","","","","","","","","","","","","","","","","","1 : 0","","","","","",""]
[null,3,"FC Bayern München",null,null,null,3,21,18,"PSV Eindhoven","-","AC Mailand",5,":",2,null,3,"FC Bayern München",40,21,5,14,81,":",53,28,68,"","FC Bayern München","","","","","","0 : 3","0 : 3","","9 : 2","0 : 3","1 : 3","0 : 0","0 : 0","0 : 0","1 : 0","3 : 0","3 : 0","3 : 1","0 : 3","2 : 0","0 : 0","1 : 3","3 : 0","0 : 3","4 : 0","3 : 1","3 : 1","0 : 2","1 : 3","1 : 0","3 : 0","0 : 2","5 : 2","3 : 0","0 : 1","5 : 1","5 : 2","2 : 0","1 : 5","1 : 0","0 : 0","9 : 2","5 : 1","3 : 0","0 : 3","","","","","","","","","","","","1 : 3","","","","","","","","","","","","","","","","","","","","","","","","","","","",""]
[null,4,"Paris Saint-Germain",null,null,null,4,19,36,"Feyenoord Rotterdam","-","Mainz 05",3,":",1,null,4,"FC Girona",40,20,7,13,88,":",65,23,67,"","FC Girona",3,3,":",1,2,"5 : 1","0 : 3","2 : 9","","3 : 1","2 : 5","2 : 9","0 : 1","1 : 3","0 : 0","3 : 1","0 : 3","3 : 0","3 : 1","0 : 3","0 : 0","1 : 0","5 : 1","4 : 0","9 : 2","0 : 0","3 : 1","3 : 0","5 : 2","0 : 3","3 : 0","5 : 1","2 : 0","0 : 0","0 : 0","0 : 0","9 : 2","1 : 3","3 : 0","3 : 0","3 : 0","4 : 0","1 : 5","0 : 2","0 : 0","0 : 3","","","","","","","","","","","","","","","","","","","","","","","","","","","","","","","","","","","","","","",""]
[null,5,"FC Liverpool",null,null,null,5,33,17,"Sturm Graz","-","Schachtjor Donezk",1,":",3,null,5,"FC Liverpool",40,20,7,13,88,":",65,23,67,"","FC Liverpool",0,1,":",3,-2,"0 : 2","0 : 0","3 : 0","1 : 3","","0 : 0","7 : 6","1 : 3","0 : 0","3 : 0","5 : 2","2 : 9","1 : 3","0 : 1","3 : 1","3 : 0","5 : 2","0 : 0","3 : 0","1 : 0","5 : 2","0 : 4","2 : 0","0 : 0","9 : 2","1 : 3","3 : 1","0 : 3","3 : 1","3 : 0","1 : 2","0 : 0","0 : 3","5 : 5","3 : 1","3 : 0","2 : 0","1 : 3","0 : 1","4 : 0","","","","","","","5 : 2","","","","","","","","","","","","","","","","","","","","","","","","","","","","","","","","",""]
[null,6,"Inter Mailand",null,null,null,6,15,34,"FC Arsenal","-","Stade Brest",2,":",0,null,6,"Borussia Dortmund",40,20,7,13,80,":",68,12,67,"","Borussia Dortmund","","","","","","2 : 9","5 : 1","3 : 1","5 : 2","0 : 0","","1 : 0","0 : 3","0 : 0","0 : 0","4 : 0","1 : 5","0 : 3","9 : 2","0 : 1","0 : 3","3 : 1","3 : 0","3 : 0","2 : 5","0 : 2","5 : 1","2 : 0","3 : 0","0 : 0","2 : 0","0 : 0","3 : 1","0 : 4","5 : 2","1 : 5","3 : 1","2 : 9","0 : 4","3 : 0","1 : 3","0 : 0","3 : 0","0 : 0","3 : 0","","","","","","","","","","","","","","","","","","","","","","","","","3 : 0","","","","","","","","","","","","","","",""]
[null,7,"Borussia Dortmund",null,null,null,7,35,7,"Eintracht Frankfurt","-","Borussia Dortmund",0,":",0,null,7,"Celtic Glasgow",40,20,6,14,96,":",62,34,66,"","Celtic Glasgow","","","","","","0 : 0","3 : 0","0 : 0","9 : 2","6 : 7","0 : 1","","1 : 3","1 : 5","1 : 3","1 : 3","3 : 1","1 : 3","0 : 3","4 : 0","5 : 2","3 : 1","0 : 0","0 : 4","3 : 0","3 : 0","1 : 0","1 : 3","5 : 2","1 : 3","3 : 1","9 : 2","5 : 1","2 : 0","0 : 0","0 : 0","3 : 0","3 : 0","5 : 1","4 : 0","4 : 0","1 : 2","3 : 1","0 : 3","0 : 0","","","","","2 : 5","","","","","","","","","","","","","","","","","","","","","","","","","","","","","","","","","","",""]
[null,8,"RB Leipzig",null,null,null,8,12,10,"Atalanta Bergamo","-","Bayer Leverkusen",3,":",0,null,8,"Inter Mailand",40,20,6,14,87,":",61,26,66,"","Inter Mailand","","","","","","3 : 0","9 : 2","0 : 0","1 : 0","3 : 1","3 : 0","3 : 1","","2 : 5","9 : 2","0 : 0","1 : 3","1 : 0","0 : 0","1 : 3","0 : 3","0 : 1","3 : 1","3 : 1","0 : 3","2 : 5","3 : 0","4 : 0","0 : 0","5 : 2","0 : 3","1 : 5","4 : 0","0 : 2","1 : 3","3 : 1","0 : 0","1 : 0","1 : 3","3 : 1","2 : 5","5 : 1","0 : 0","5 : 2","1 : 2","","","","","","","","","","","","","","4 : 0","","","","","","","","","","","","","","","","","","","","","","","","","",""]
[null,9,"FC Barcelona",null,null,null,9,16,6,"FC Brügge","-","Inter Mailand",0,":",0,null,9,"Hertha BSC",40,20,6,14,84,":",59,25,66,"","Hertha BSC","","","","","","0 : 0","3 : 0","0 : 0","3 : 1","0 : 0","0 : 0","5 : 1","5 : 2","","0 : 3","2 : 5","1 : 5","2 : 0","0 : 3","1 : 5","0 : 4","3 : 0","0 : 2","2 : 0","1 : 3","3 : 0","3 : 0","3 : 1","1 : 2","1 : 3","9 : 2","5 : 1","1 : 3","3 : 0","0 : 3","1 : 0","0 : 2","3 : 1","0 : 3","3 : 0","3 : 1","0 : 0","0 : 0","5 : 1","3 : 0","","","","","","","","","","","","","","","","9 : 2","","","","","","","","","","","","","","","","","","","","","","","",""]
[null,10,"Bayer Leverkusen",null,null,null,10,5,22,"FC Liverpool","-","Celtic Glasgow",7,":",6,null,10,"Schachtjor Donezk",40,20,6,14,80,":",59,21,66,"","Schachtjor Donezk","","","","","","1 : 5","9 : 2","0 : 1","0 : 0","0 : 3","0 : 0","3 : 1","2 : 9","3 : 0","","2 : 0","3 : 1","3 : 0","0 : 1","1 : 3","9 : 2","0 : 3","1 : 3","5 : 1","0 : 0","3 : 1","3 : 1","1 : 0","0 : 0","3 : 1","5 : 1","3 : 0","2 : 5","2 : 0","0 : 0","3 : 0","0 : 4","0 : 1","3 : 0","2 : 0","0 : 3","4 : 0","0 : 3","1 : 3","3 : 1","","","","","","","","","","","","","","","","","","","","","","0 : 0","","","","","","","","","","","","","","","","","",""]
[null,11,"Atletico Madrid",null,null,null,11,20,3,"Sporting Lissabon","-","FC Bayern München",0,":",3,null,11,"Young Boys Bern",40,20,5,15,70,":",70,0,65,"","Young Boys Bern","","","","","","3 : 0","3 : 1","0 : 3","1 : 3","2 : 5","0 : 4","3 : 1","0 : 0","5 : 2","0 : 2","","0 : 0","1 : 0","2 : 5","2 : 0","0 : 0","0 : 0","0 : 4","0 : 4","5 : 2","0 : 2","2 : 9","1 : 0","4 : 0","0 : 1","1 : 0","3 : 1","3 : 1","3 : 1","3 : 0","5 : 2","3 : 1","3 : 0","3 : 1","0 : 3","0 : 0","1 : 3","2 : 5","3 : 1","2 : 0","","","","","","","","","","","","","","","","","","","","","","","","","","","","","","","","1 : 3","","","","","","","",""]
[null,12,"Atalanta Bergamo",null,null,null,12,31,39,"FC Girona","-","FC Lille",5,":",1,null,12,"Sporting Lissabon",40,19,7,14,92,":",54,38,64,"","Sporting Lissabon","","","","","","0 : 4","1 : 2","0 : 3","3 : 0","9 : 2","5 : 1","1 : 3","3 : 1","5 : 1","1 : 3","0 : 0","","4 : 0","0 : 4","0 : 2","1 : 3","0 : 0","3 : 0","4 : 0","0 : 1","0 : 0","4 : 0","0 : 0","0 : 0","2 : 0","0 : 1","9 : 2","0 : 2","0 : 0","1 : 0","9 : 2","2 : 5","0 : 3","1 : 3","0 : 0","5 : 1","5 : 2","5 : 2","3 : 0","3 : 0","","","3 : 1","","","","","","","","","","","","","","","","","","","","","","","","","","","","","","","","","","","","",""]
[null,13,"Juventus Turin",null,null,null,13,40,11,"Hertha BSC","-","Atletico Madrid",0,":",4,null,13,"Feyenoord Rotterdam",40,19,6,15,72,":",57,15,63,"","Feyenoord Rotterdam","","","","","","1 : 0","1 : 3","1 : 3","0 : 3","3 : 1","3 : 0","3 : 1","0 : 1","0 : 2","0 : 3","0 : 1","0 : 4","","2 : 0","3 : 1","2 : 0","3 : 0","9 : 2","1 : 3","2 : 5","3 : 1","0 : 0","3 : 0","1 : 3","4 : 0","0 : 0","0 : 0","0 : 3","2 : 5","3 : 1","5 : 2","3 : 0","1 : 0","2 : 5","3 : 1","0 : 0","0 : 1","0 : 0","5 : 2","0 : 0","","","","","","","","","","","","","","","","","","","","","3 : 0","","","","","","","","","","","","","","","","","","",""]
[null,14,"Benfica Lissabon",null,null,null,14,24,28,"Red Bull Salzburg","-","AS Monaco",3,":",2,null,14,"FC Brügge",40,19,5,16,72,":",67,5,62,"","FC Brügge","","","","","","2 : 1","0 : 3","3 : 0","1 : 3","1 : 0","2 : 9","3 : 0","0 : 0","3 : 0","1 : 0","5 : 2","4 : 0","0 : 2","","0 : 3","1 : 5","1 : 3","0 : 0","0 : 0","1 : 3","0 : 3","0 : 0","2 : 5","9 : 2","3 : 0","0 : 2","0 : 3","2 : 1","5 : 2","3 : 1","0 : 1","3 : 1","1 : 3","3 : 0","5 : 1","1 : 3","3 : 0","1 : 0","3 : 1","0 : 0","","","","","","","","0 : 4","","","","","","","","","","","","","","","","","","","","","","","","","","","","","","","",""]
[null,15,"FC Arsenal",null,null,null,15,27,2,"Young Boys Bern","-","Manchester City",3,":",1,null,15,"AS Monaco",40,19,5,16,73,":",69,4,62,"","AS Monaco","","","","","","0 : 2","1 : 5","0 : 2","3 : 0","1 : 3","1 : 0","0 : 4","3 : 1","5 : 1","3 : 1","0 : 2","2 : 0","1 : 3","3 : 0","","2 : 5","0 : 3","4 : 0","2 : 3","1 : 3","0 : 0","0 : 0","3 : 1","3 : 0","3 : 0","0 : 0","2 : 5","0 : 4","0 : 0","0 : 0","1 : 0","3 : 1","2 : 9","0 : 3","1 : 0","9 : 2","3 : 1","3 : 1","5 : 1","2 : 0","","","","","","","","","","","","","","","","","","","1 : 3","","","","","","","","","","","","","","","","","","","","",""]
[null,16,"FC Brügge",null,null,null,16,9,29,"FC Barcelona","-","Aston Villa",0,":",3,null,16,"Atletico Madrid",40,18,7,15,80,":",76,4,61,"","Atletico Madrid","","","","","","0 : 0","0 : 4","0 : 0","0 : 0","0 : 3","3 : 0","2 : 5","3 : 0","4 : 0","2 : 9","0 : 0","3 : 1","0 : 2","5 : 1","5 : 2","","0 : 0","1 : 2","1 : 3","3 : 1","1 : 0","0 : 3","0 : 4","5 : 1","9 : 2","0 : 1","3 : 0","1 : 5","0 : 0","1 : 3","3 : 0","3 : 0","4 : 0","2 : 9","3 : 1","5 : 2","0 : 3","2 : 0","4 : 0","0 : 0","","","","","","","","","2 : 9","","","","","","","","","","","","","","","","","","","","","","","","","","","","","","",""]
[null,17,"Schachtjor Donezk",null,null,null,17,13,30,"Juventus Turin","-","FC Bologna",9,":",2,null,17,"Atalanta Bergamo",40,18,6,16,75,":",70,5,60,"","Atalanta Bergamo","","","","","","0 : 4","3 : 0","3 : 1","0 : 1","2 : 5","1 : 3","1 : 3","1 : 0","0 : 3","3 : 0","0 : 0","0 : 0","0 : 3","3 : 1","3 : 0","0 : 0","","0 : 4","2 : 9","5 : 2","0 : 0","1 : 3","3 : 1","1 : 3","1 : 5","3 : 0","0 : 0","0 : 0","1 : 0","3 : 1","4 : 0","2 : 5","0 : 2","4 : 0","1 : 3","2 : 0","0 : 4","5 : 1","9 : 2","3 : 0","","","","","","","","","","","","","","","","","","","","","","","","","","5 : 1","","","","","","","","","","","","","",""]
[null,18,"AC Mailand",null,null,null,18,14,8,"Benfica Lissabon","-","RB Leipzig",2,":",1,null,18,"Juventus Turin",39,18,4,17,81,":",73,8,58,"","Juventus Turin","","","","","","3 : 1","3 : 0","0 : 3","1 : 5","0 : 0","0 : 3","0 : 0","1 : 3","2 : 0","3 : 1","4 : 0","0 : 3","2 : 9","0 : 0","0 : 4","2 : 1","4 : 0","","9 : 2","1 : 3","0 : 4","1 : 5","3 : 1","3 : 0","3 : 0","5 : 2","4 : 0","0 : 2","0 : 3","0 : 2","0 : 0","3 : 0","5 : 1","3 : 0","9 : 2","0 : 3","0 : 1","1 : 3","1 : 5","5 : 1","","","","","","","","","","","","","","","","","","","","","","","","","","","","","","","","","","","","","","","",""]
[null,19,"Feyenoord Rotterdam",null,null,null,19,32,1,"VfB Stuttgart","-","Real Madrid",1,":",3,null,19,"Red Bull Salzburg",40,17,6,17,80,":",77,3,57,"","Red Bull Salzburg","","","","","","3 : 1","5 : 1","3 : 0","0 : 4","0 : 3","0 : 3","4 : 0","1 : 3","0 : 2","1 : 5","4 : 0","0 : 4","3 : 1","0 : 0","3 : 2","3 : 1","9 : 2","2 : 9","","0 : 1","2 : 5","0 : 0","3 : 1","1 : 3","0 : 3","1 : 3","1 : 3","0 : 0","2 : 5","5 : 2","9 : 2","1 : 0","1 : 0","0 : 0","1 : 3","0 : 0","0 : 0","0 : 3","4 : 0","5 : 1","","","","","","","","","","","","","","","3 : 1","","","","","","","","","","","","","","","","","","","","","","","","",""]
[null,20,"Sporting Lissabon",null,null,null,20,38,37,"FC Basel","-","AC Roma",2,":",0,null,20,"Aston Villa",40,17,6,17,70,":",84,-14,57,"","Aston Villa","","","","","","1 : 3","0 : 0","0 : 4","2 : 9","0 : 1","5 : 2","0 : 3","3 : 0","3 : 1","0 : 0","2 : 5","1 : 0","5 : 2","3 : 1","3 : 1","1 : 3","2 : 5","3 : 1","1 : 0","","3 : 1","2 : 5","1 : 3","3 : 1","0 : 0","3 : 1","0 : 0","1 : 5","3 : 0","4 : 0","1 : 3","1 : 5","5 : 1","0 : 3","2 : 9","0 : 0","3 : 0","3 : 0","0 : 0","0 : 4","","","","","","","","","","","","","","","","","","","","","","","","","","","","","0 : 2","","","","","","","","","","",""]
[null,21,"PSV Eindhoven",null,null,null,21,25,4,"OSC Lille","-","Paris Saint-Germain",0,":",0,null,21,"Mainz 05",40,17,5,18,77,":",67,10,56,"","Mainz 05","","","","","","2 : 5","0 : 3","1 : 3","0 : 0","2 : 5","2 : 0","0 : 3","5 : 2","0 : 3","1 : 3","2 : 0","0 : 0","1 : 3","3 : 0","0 : 0","0 : 1","0 : 0","4 : 0","5 : 2","1 : 3","","3 : 1","0 : 3","0 : 1","1 : 5","4 : 0","4 : 0","5 : 1","1 : 0","3 : 1","0 : 1","1 : 3","0 : 2","3 : 1","0 : 0","9 : 2","5 : 2","3 : 1","5 : 1","1 : 3","","","","","","","","","","","","","0 : 3","","","","","","","","","","","","","","","","","","","","","","","","","","",""]
[null,22,"Celtic Glasgow",null,null,null,22,18,26,"AC Mailand","-","Roter Stern Belgrad",3,":",0,null,22,"Sturm Graz",40,16,6,18,87,":",77,10,54,"","Sturm Graz","","","","","","2 : 9","5 : 2","1 : 3","1 : 3","4 : 0","1 : 5","0 : 1","0 : 3","0 : 3","1 : 3","9 : 2","0 : 4","0 : 0","0 : 0","0 : 0","3 : 0","3 : 1","5 : 1","0 : 0","5 : 2","1 : 3","","0 : 4","4 : 0","5 : 1","9 : 2","0 : 0","9 : 2","2 : 5","0 : 3","4 : 0","3 : 1","3 : 1","0 : 4","3 : 0","0 : 3","1 : 2","0 : 1","1 : 3","2 : 0","","","","","","","","","","0 : 0","","","","","","","","","","","","","","","","","","","","","","","","","","","","","",""]
[null,23,"Dinamo Zagreb",null,null,null,23,23,19,"Dinamo Zagreb","-","Feyenoord Rotterdam",0,":",0,null,23,"PSV Eindhoven",40,16,5,19,63,":",61,2,53,"","PSV Eindhoven","","","","","","0 : 3","0 : 0","2 : 0","0 : 3","0 : 2","0 : 2","3 : 1","0 : 4","1 : 3","0 : 1","0 : 1","0 : 0","0 : 3","5 : 2","1 : 3","4 : 0","1 : 3","1 : 3","1 : 3","3 : 1","3 : 0","4 : 0","","5 : 2","3 : 1","0 : 3","5 : 1","3 : 1","0 : 1","1 : 3","2 : 0","0 : 0","5 : 2","3 : 1","3 : 0","1 : 3","0 : 0","0 : 2","0 : 3","3 : 0","","","","","","","","","","","","","","","","","","","","","","","","0 : 0","","","","","","","","","","","","","","","",""]
[null,24,"Red Bull Salzburg",null,null,null,24,17,21,"Schachtjor Donezk","-","PSV Eindhoven",1,":",0,null,24,"AC Mailand",40,15,8,17,63,":",76,-13,53,"","AC Mailand","","","","","","0 : 0","0 : 1","3 : 1","2 : 5","0 : 0","0 : 3","2 : 5","0 : 0","2 : 1","0 : 0","0 : 4","0 : 0","3 : 1","2 : 9","0 : 3","1 : 5","3 : 1","0 : 3","3 : 1","1 : 3","1 : 0","0 : 4","2 : 5","","0 : 3","0 : 0","3 : 0","4 : 0","1 : 0","1 : 3","0 : 0","1 : 3","2 : 5","5 : 2","3 : 1","3 : 1","3 : 0","9 : 2","0 : 1","3 : 0","","","","","","","","","","","","","","","","","","","","","","","0 : 0","","","","","","","","","","","","","","","","",""]
[null,25,"OSC Lille",null,null,null,25,36,15,"Mainz 05","-","FC Arsenal",0,":",3,null,25,"Eintracht Frankfurt",40,16,5,19,65,":",83,-18,53,"","Eintracht Frankfurt","","","","","","0 : 0","0 : 0","0 : 1","3 : 0","2 : 9","0 : 0","3 : 1","2 : 5","3 : 1","1 : 3","1 : 0","0 : 2","0 : 4","0 : 3","0 : 3","2 : 9","5 : 1","0 : 3","3 : 0","0 : 0","5 : 1","1 : 5","1 : 3","3 : 0","","1 : 5","0 : 4","3 : 1","0 : 0","0 : 2","0 : 2","1 : 0","3 : 0","3 : 1","2 : 0","1 : 5","4 : 0","9 : 2","0 : 3","3 : 1","","","","","","0 : 3","","","","","","","","","","","","","","","","","","","","","","","","","","","","","","","","","",""]
[null,26,"Roter Stern Belgrad",null,null,null,26,7,33,"Borussia Dortmund","-","Sturm Graz",5,":",1,null,26,"Bayer Leverkusen",40,16,5,19,57,":",77,-20,53,"","Bayer Leverkusen","","","","","","5 : 2","0 : 3","0 : 3","0 : 3","3 : 1","0 : 2","1 : 3","3 : 0","2 : 9","1 : 5","0 : 1","1 : 0","0 : 0","2 : 0","0 : 0","1 : 0","0 : 3","2 : 5","3 : 1","1 : 3","0 : 4","2 : 9","3 : 0","0 : 0","5 : 1","","1 : 0","0 : 1","3 : 0","1 : 3","5 : 2","3 : 1","0 : 0","2 : 0","0 : 2","0 : 0","0 : 3","0 : 2","3 : 0","3 : 0","","","","","","","","","","","","","","","","","1 : 5","","","","","","","","","","","","","","","","","","","","","","",""]
[null,27,"Young Boys Bern",null,null,null,27,34,12,"Stade Brest","-","Atalanta Bergamo",0,":",4,null,27,"RB Leipzig",39,15,7,17,73,":",75,-2,52,"","RB Leipzig","","","","","","0 : 0","3 : 0","2 : 0","1 : 5","1 : 3","0 : 0","2 : 9","5 : 1","1 : 5","0 : 3","1 : 3","2 : 9","0 : 0","3 : 0","5 : 2","0 : 3","0 : 0","0 : 4","3 : 1","0 : 0","0 : 4","0 : 0","1 : 5","0 : 3","4 : 0","0 : 1","","3 : 0","5 : 1","2 : 0","0 : 3","3 : 0","0 : 0","9 : 2","0 : 1","1 : 2","1 : 3","2 : 0","4 : 0","9 : 2","","","","","","","","","","","","","","","","","","","","","","","","","","","","","","","","","","","","","","","",""]
[null,28,"AS Monaco",null,null,null,28,6,35,"Inter Mailand","-","Eintracht Frankfurt",5,":",2,null,28,"Paris Saint-Germain",40,16,4,20,66,":",82,-16,52,"","Paris Saint-Germain","","","","","","0 : 3","0 : 2","2 : 5","0 : 2","3 : 0","1 : 3","1 : 5","0 : 4","3 : 1","5 : 2","1 : 3","2 : 0","3 : 0","1 : 2","4 : 0","5 : 1","0 : 0","2 : 0","0 : 0","5 : 1","1 : 5","2 : 9","1 : 3","0 : 4","1 : 3","1 : 0","0 : 3","","3 : 1","4 : 0","0 : 0","0 : 4","3 : 1","0 : 3","2 : 5","0 : 2","5 : 1","1 : 0","0 : 0","3 : 1","","","","","","","","","","","","","","","","","","","","","","","","","","","","","","","","","","","","","","","","1 : 3"]
[null,29,"Aston Villa",null,null,null,29,10,5,"Bayer Leverkusen","-","FC Liverpool",3,":",1,null,29,"FC Barcelona",40,15,6,19,64,":",62,2,51,"","FC Barcelona","","","","","","1 : 3","1 : 3","0 : 3","0 : 0","1 : 3","4 : 0","0 : 2","2 : 0","0 : 3","0 : 2","1 : 3","0 : 0","5 : 2","2 : 5","0 : 0","0 : 0","0 : 1","3 : 0","5 : 2","0 : 3","0 : 1","5 : 2","1 : 0","0 : 1","0 : 0","0 : 3","1 : 5","1 : 3","","0 : 0","3 : 0","3 : 0","1 : 3","1 : 3","3 : 0","3 : 1","3 : 0","1 : 3","2 : 0","9 : 2","","","","","","","","","","","","","","","","","","","","2 : 0","","","","","","","","","","","","","","","","","","","",""]
[null,30,"FC Bologna",null,null,null,30,3,16,"FC Bayern München","-","FC Brügge",0,":",3,null,30,"AC Roma",39,15,6,18,56,":",67,-11,51,"","AC Roma","","","","","","0 : 3","3 : 0","1 : 0","0 : 0","0 : 3","2 : 5","0 : 0","3 : 1","3 : 0","0 : 0","0 : 3","0 : 1","1 : 3","1 : 3","0 : 0","3 : 1","1 : 3","2 : 0","2 : 5","0 : 4","1 : 3","3 : 0","3 : 1","3 : 1","2 : 0","3 : 1","0 : 2","0 : 4","0 : 0","","0 : 2","0 : 0","5 : 1","1 : 5","2 : 5","5 : 2","0 : 3","3 : 1","3 : 0","0 : 1","","","","","","","","","","","","","","","","","","","","","","","","","","","","","","","","","","","","","","","",""]
[null,31,"FC Girona",null,null,null,31,22,31,"Celtic Glasgow","-","FC Girona",9,":",2,null,31,"FC Basel",39,15,6,18,55,":",81,-26,51,"","FC Basel","","","","","","3 : 1","0 : 3","1 : 5","0 : 0","2 : 1","5 : 1","0 : 0","1 : 3","0 : 1","0 : 3","2 : 5","2 : 9","2 : 5","1 : 0","0 : 1","0 : 3","0 : 4","0 : 0","2 : 9","3 : 1","1 : 0","0 : 4","0 : 2","0 : 0","2 : 0","2 : 5","3 : 0","0 : 0","0 : 3","2 : 0","","1 : 3","5 : 2","3 : 1","3 : 0","0 : 4","3 : 1","3 : 1","0 : 0","3 : 0","","","","","","","","","","","","","","","","","","","","","","","","","","","","","","","","","","","","","","","",""]
[null,32,"VfB Stuttgart",null,null,null,32,11,20,"Atletico Madrid","-","Sporting Lissabon",3,":",1,null,32,"Manchester City",40,15,5,20,64,":",74,-10,50,"","Manchester City","","","","","","1 : 5","0 : 0","2 : 5","2 : 9","0 : 0","1 : 3","0 : 3","0 : 0","2 : 0","4 : 0","1 : 3","5 : 2","0 : 3","1 : 3","1 : 3","0 : 3","5 : 2","0 : 3","0 : 1","5 : 1","3 : 1","1 : 3","0 : 0","3 : 1","0 : 1","1 : 3","0 : 3","4 : 0","0 : 3","0 : 0","3 : 1","","0 : 2","3 : 0","0 : 2","1 : 0","3 : 0","3 : 0","1 : 2","5 : 2","","","","","","","","","","","3 : 1","","","","","","","","","","","","","","","","","","","","","","","","","","","","",""]
[null,33,"Sturm Graz",null,null,null,33,39,24,"FC Lille","-","Red Bull Salzburg",1,":",3,null,33,"VfB Stuttgart",39,15,4,20,69,":",74,-5,49,"","VfB Stuttgart","","","","","","0 : 3","1 : 3","0 : 2","3 : 1","3 : 0","9 : 2","0 : 3","0 : 1","1 : 3","1 : 0","0 : 3","3 : 0","0 : 1","3 : 1","9 : 2","0 : 4","2 : 0","1 : 5","0 : 1","1 : 5","2 : 0","1 : 3","2 : 5","5 : 2","0 : 3","0 : 0","0 : 0","1 : 3","3 : 1","1 : 5","2 : 5","2 : 0","","5 : 1","4 : 0","0 : 0","1 : 3","0 : 3","3 : 0","0 : 0","","","","","","","","","","","","","","","","","","","","","","","","","","","","","","","","","","","","","","","",""]
[null,34,"Stade Brest",null,null,null,34,2,40,"Manchester City","-","Hertha BSC",2,":",0,null,34,"Stade Brest",40,14,6,20,76,":",87,-11,48,"","Stade Brest","","","","","","0 : 0","0 : 2","5 : 1","0 : 3","5 : 5","4 : 0","1 : 5","3 : 1","3 : 0","0 : 3","1 : 3","3 : 1","5 : 2","0 : 3","3 : 0","9 : 2","0 : 4","0 : 3","0 : 0","3 : 0","1 : 3","4 : 0","1 : 3","2 : 5","1 : 3","0 : 2","2 : 9","3 : 0","3 : 1","5 : 1","1 : 3","0 : 3","1 : 5","","0 : 4","5 : 1","0 : 0","2 : 5","0 : 0","0 : 0","","0 : 1","","","","","","","","","","","","","","","","","","","","","","","","","","","","","","","","","","","","","",""]
[null,35,"Eintracht Frankfurt",null,null,null,35,28,9,"AS Monaco","-","FC Barcelona",0,":",0,null,35,"FC Bologna",39,13,5,21,62,":",77,-15,44,"","FC Bologna","","","","","","0 : 2","5 : 1","0 : 1","0 : 3","1 : 3","0 : 3","0 : 4","1 : 3","0 : 3","0 : 2","3 : 0","0 : 0","1 : 3","1 : 5","0 : 1","1 : 3","3 : 1","2 : 9","3 : 1","9 : 2","0 : 0","0 : 3","0 : 3","1 : 3","0 : 2","2 : 0","1 : 0","5 : 2","0 : 3","5 : 2","0 : 3","2 : 0","0 : 4","4 : 0","","9 : 2","0 : 0","3 : 0","0 : 0","0 : 0","","","","","","","","","","","","","","","","","","","","","","","","","","","","","","","","","","","","","","","",""]
[null,36,"Mainz 05",null,null,null,36,30,27,"FC Bologna","-","Young Boys Bern",3,":",0,null,36,"Benfica Lissabon",39,12,8,19,55,":",90,-35,44,"","Benfica Lissabon","","","","","","0 : 3","1 : 5","0 : 0","0 : 3","0 : 3","3 : 1","0 : 4","5 : 2","1 : 3","3 : 0","0 : 0","1 : 5","0 : 0","3 : 1","2 : 9","2 : 5","0 : 2","3 : 0","0 : 0","0 : 0","2 : 9","3 : 0","3 : 1","1 : 3","5 : 1","0 : 0","2 : 1","2 : 0","1 : 3","2 : 5","4 : 0","0 : 1","0 : 0","1 : 5","2 : 9","","0 : 0","3 : 0","0 : 3","0 : 3","","","","","","","","","","","","","","","","","","","","","","","","","","","","","","","","","","","","","","","",""]
[null,37,"AC Roma",null,null,null,37,29,14,"Aston Villa","-","Benfica Lissabon",0,":",0,null,37,"Real Madrid",39,12,8,19,51,":",92,-41,44,"","Real Madrid","","","","","","0 : 3","2 : 9","2 : 9","0 : 4","0 : 2","0 : 0","2 : 1","1 : 5","0 : 0","0 : 4","3 : 1","2 : 5","1 : 0","0 : 3","1 : 3","3 : 0","4 : 0","1 : 0","0 : 0","0 : 3","2 : 5","2 : 1","0 : 0","0 : 3","0 : 4","3 : 0","3 : 1","1 : 5","0 : 3","3 : 0","1 : 3","0 : 3","3 : 1","0 : 0","0 : 0","0 : 0","","0 : 0","9 : 2","2 : 9","","","","","","","","","","","","","","","","","","","","","","","","","","","","","","","","","","","","","","","",""]
[null,38,"FC Basel",null,null,null,38,1,13,"Real Madrid","-","Juventus Turin",1,":",0,null,38,"Dinamo Zagreb",40,13,4,23,56,":",88,-32,43,"","Dinamo Zagreb","","","","","","0 : 1","1 : 3","1 : 5","5 : 1","3 : 1","0 : 3","1 : 3","0 : 0","0 : 0","3 : 0","5 : 2","2 : 5","0 : 0","0 : 1","1 : 3","0 : 2","1 : 5","3 : 1","3 : 0","0 : 3","1 : 3","1 : 0","2 : 0","2 : 9","2 : 9","2 : 0","0 : 2","0 : 1","3 : 1","1 : 3","1 : 3","0 : 3","3 : 0","5 : 2","0 : 3","0 : 3","0 : 0","","3 : 0","1 : 5","","","","","","","","","","","","","","","","","","","","","","","","","","","","","","","","","","","","","","","0 : 2",""]
[null,39,"FC Lille",null,null,null,39,8,38,"RB Leipzig","-","FC Basel",0,":",3,null,39,"OSC Lille",40,12,6,22,47,":",97,-50,42,"","OSC Lille","","","","","","2 : 9","0 : 1","0 : 3","2 : 0","1 : 0","0 : 0","3 : 0","2 : 5","1 : 5","3 : 1","1 : 3","0 : 3","2 : 5","1 : 3","1 : 5","0 : 4","2 : 9","5 : 1","0 : 4","0 : 0","1 : 5","3 : 1","3 : 0","1 : 0","3 : 0","0 : 3","0 : 4","0 : 0","0 : 2","0 : 3","0 : 0","2 : 1","0 : 3","0 : 0","0 : 0","3 : 0","2 : 9","0 : 3","","1 : 2","","","","","","","","","","","","","","","","","","","","","","","","","","","","","","","","","","","","","","2 : 0","",""]
[null,40,"Hertha BSC",null,null,null,40,37,32,"AC Roma","-","VfB Stuttgart",5,":",1,null,40,"Roter Stern Belgrad",40,10,8,22,48,":",96,-48,38,"","Roter Stern Belgrad","","","","","","0 : 4","2 : 9","3 : 0","0 : 0","0 : 4","0 : 3","0 : 0","2 : 1","0 : 3","1 : 3","0 : 2","0 : 3","0 : 0","0 : 0","0 : 2","0 : 0","0 : 3","1 : 5","1 : 5","4 : 0","3 : 1","0 : 2","0 : 3","0 : 3","1 : 3","0 : 3","2 : 9","1 : 3","2 : 9","1 : 0","0 : 3","2 : 5","0 : 0","0 : 0","0 : 0","3 : 0","9 : 2","5 : 1","2 : 1","","","","","","","","","","","","","","","","","","","","","","","","","","","","","3 : 1","","","","","","","","","","","",""]
[null,null,null,null,null,null,41,4,18,"Paris Saint-Germain","-","AC Mailand",0,":",4]
[null,null,null,null,null,null,42,19,25,"Feyenoord Rotterdam","-","OSC Lille",5,":",2]
[null,null,null,null,null,null,43,26,17,"Roter Stern Belgrad","-","Schachtjor Donezk",1,":",3]
[null,null,null,null,null,null,44,15,23,"FC Arsenal","-","Dinamo Zagreb",3,":",1]
[null,null,null,null,null,null,45,21,7,"PSV Eindhoven","-","Borussia Dortmund",0,":",2]
[null,null,null,null,null,null,46,12,36,"Atalanta Bergamo","-","Mainz 05",0,":",0]
[null,null,null,null,null,null,47,33,6,"Sturm Graz","-","Inter Mailand",0,":",3]
[null,null,null,null,null,null,48,5,34,"FC Liverpool","-","Stade Brest",5,":",5]
[null,null,null,null,null,null,49,35,3,"Eintracht Frankfurt","-","FC Bayern München",0,":",1]
[null,null,null,null,null,null,50,31,10,"FC Girona","-","Bayer Leverkusen",3,":",0]
[null,null,null,null,null,null,51,16,11,"FC Brügge","-","Atletico Madrid",1,":",5]
[null,null,null,null,null,null,52,24,22,"Red Bull Salzburg","-","Celtic Glasgow",4,":",0]
[null,null,null,null,null,null,53,20,2,"Sporting Lissabon","-","Manchester City",2,":",5]
[null,null,null,null,null,null,54,9,39,"FC Barcelona","-","FC Lille",1,":",3]
[null,null,null,null,null,null,55,40,30,"Hertha BSC","-","FC Bologna",3,":",0]
[null,null,null,null,null,null,56,14,28,"Benfica Lissabon","-","AS Monaco",2,":",9]
[null,null,null,null,null,null,57,27,1,"Young Boys Bern","-","Real Madrid",1,":",3]
[null,null,null,null,null,null,58,38,29,"FC Basel","-","Aston Villa",3,":",1]
[null,null,null,null,null,null,59,13,37,"Juventus Turin","-","AC Roma",0,":",2]
[null,null,null,null,null,null,60,32,8,"VfB Stuttgart","-","RB Leipzig",0,":",0]
[null,null,null,null,null,null,61,19,4,"Feyenoord Rotterdam","-","Paris Saint-Germain",0,":",3]
[null,null,null,null,null,null,62,17,18,"Schachtjor Donezk","-","AC Mailand",0,":",0]
[null,null,null,null,null,null,63,25,15,"OSC Lille","-","FC Arsenal",0,":",1]
[null,null,null,null,null,null,64,7,26,"Borussia Dortmund","-","Roter Stern Belgrad",3,":",0]
[null,null,null,null,null,null,65,23,12,"Dinamo Zagreb","-","Atalanta Bergamo",1,":",5]
[null,null,null,null,null,null,66,6,21,{"$f":"IFERROR(VLOOKUP($H71,$B$6:$C$45,2,0),\"\")","v":"Inter Mailand"},"-",{"$f":"IFERROR(VLOOKUP($I71,$B$6:$C$45,2,0),\"\")","v":"PSV Eindhoven"},4,":",0]
[null,null,null,null,null,null,67,36,5,"Mainz 05","-","FC Liverpool",2,":",5]
[null,null,null,null,null,null,68,3,33,"FC Bayern München","-","Sturm Graz",3,":",1]
[null,null,null,null,null,null,69,34,31,"Stade Brest","-","FC Girona",0,":",3]
[null,null,null,null,null,null,70,11,35,"Atletico Madrid","-","Eintracht Frankfurt",9,":",2]
[null,null,null,null,null,null,71,10,24,"Bayer Leverkusen","-","Red Bull Salzburg",3,":",1]
[null,null,null,null,null,null,72,2,16,"Manchester City","-","FC Brügge",1,":",3]
[null,null,null,null,null,null,73,22,9,"Celtic Glasgow","-","FC Barcelona",2,":",0]
[null,null,null,null,null,null,74,30,20,"FC Bologna","-","Sporting Lissabon",0,":",0]
[null,null,null,null,null,null,75,39,14,"FC Lille","-","Benfica Lissabon",3,":",0]
[null,null,null,null,null,null,76,1,40,"Real Madrid","-","Hertha BSC",0,":",0]
[null,null,null,null,null,null,77,28,38,"AS Monaco","-","FC Basel",1,":",0]
[null,null,null,null,null,null,78,37,27,"AC Roma","-","Young Boys Bern",0,":",3]
[null,null,null,null,null,null,79,29,32,"Aston Villa","-","VfB Stuttgart",5,":",1]
[null,null,null,null,null,null,80,8,13,"RB Leipzig","-","Juventus Turin",0,":",4]
[null,null,null,null,null,null,81,4,17,"Paris Saint-Germain","-","Schachtjor Donezk",5,":",2]
[null,null,null,null,null,null,82,15,19,"FC Arsenal","-","Feyenoord Rotterdam",3,":",1]
[null,null,null,null,null,null,83,18,7,"AC Mailand","-","Borussia Dortmund",0,":",3]
[null,null,null,null,null,null,84,12,25,"Atalanta Bergamo","-","OSC Lille",9,":",2]
[null,null,null,null,null,null,85,26,6,"Roter Stern Belgrad","-","Inter Mailand",2,":",1]
[null,null,null,null,null,null,86,5,23,"FC Liverpool","-","Dinamo Zagreb",1,":",3]
[null,null,null,null,null,null,87,21,3,"PSV Eindhoven","-","FC Bayern München",2,":",0]
[null,null,null,null,null,null,88,31,36,"FC Girona","-","Mainz 05",0,":",0]
[null,null,null,null,null,null,89,33,11,"Sturm Graz","-","Atletico Madrid",3,":",0]
[null,null,null,null,null,null,90,24,34,"Red Bull Salzburg","-","Stade Brest",0,":",0]
[null,null,null,null,null,null,91,35,2,"Eintracht Frankfurt","-","Manchester City",1,":",0]
[null,null,null,null,null,null,92,9,10,"FC Barcelona","-","Bayer Leverkusen",0,":",3]
[null,null,null,null,null,null,93,16,30,"FC Brügge","-","FC Bologna",5,":",1]
[null,null,null,null,null,null,94,14,22,"Benfica Lissabon","-","Celtic Glasgow",0,":",4]
[null,null,null,null,null,null,95,20,1,"Sporting Lissabon","-","Real Madrid",5,":",2]
[null,null,null,null,null,null,96,38,39,"FC Basel","-","FC Lille",3,":",1]
[null,null,null,null,null,null,97,40,37,"Hertha BSC","-","AC Roma",0,":",3]
[null,null,null,null,null,null,98,32,28,"VfB Stuttgart","-","AS Monaco",9,":",2]
[null,null,null,null,null,null,99,27,8,"Young Boys Bern","-","RB Leipzig",3,":",1]
[null,null,null,null,null,null,100,13,29,"Juventus Turin","-","Aston Villa",1,":",3]
[null,null,null,null,null,null,101,15,4,"FC Arsenal","-","Paris Saint-Germain",2,":",0]
[null,null,null,null,null,null,102,7,17,"Borussia Dortmund","-","Schachtjor Donezk",0,":",0]
[null,null,null,null,null,null,103,19,12,"Feyenoord Rotterdam","-","Atalanta Bergamo",3,":",0]
[null,null,null,null,null,null,104,6,18,"Inter Mailand","-","AC Mailand",0,":",0]
[null,null,null,null,null,null,105,25,5,"OSC Lille","-","FC Liverpool",1,":",0]
[null,null,null,null,null,null,106,3,26,"FC Bayern München","-","Roter Stern Belgrad",0,":",3]
[null,null,null,null,null,null,107,23,31,"Dinamo Zagreb","-","FC Girona",5,":",1]
[null,null,null,null,null,null,108,11,21,"Atletico Madrid","-","PSV Eindhoven",0,":",4]
[null,null,null,null,null,null,109,36,24,"Mainz 05","-","Red Bull Salzburg",5,":",2]
[null,null,null,null,null,null,110,2,33,"Manchester City","-","Sturm Graz",1,":",3]
[null,null,null,null,null,null,111,34,9,"Stade Brest","-","FC Barcelona",3,":",1]
[null,null,null,null,null,null,112,30,35,"FC Bologna","-","Eintracht Frankfurt",0,":",2]
[null,null,null,null,null,null,113,10,14,"Bayer Leverkusen","-","Benfica Lissabon",0,":",0]
[null,null,null,null,null,null,114,1,16,"Real Madrid","-","FC Brügge",0,":",3]
[null,null,null,null,null,null,115,22,38,"Celtic Glasgow","-","FC Basel",0,":",0]
[null,null,null,null,null,null,116,37,20,"AC Roma","-","Sporting Lissabon",0,":",1]
[null,null,null,null,null,null,117,39,32,"FC Lille","-","VfB Stuttgart",3,":",0]
[null,null,null,null,null,null,118,8,40,"RB Leipzig","-","Hertha BSC",1,":",5]
[null,null,null,null,null,null,119,28,13,"AS Monaco","-","Juventus Turin",4,":",0]
[null,null,null,null,null,null,120,29,27,"Aston Villa","-","Young Boys Bern",2,":",5]
[null,null,null,null,null,null,121,4,7,"Paris Saint-Germain","-","Borussia Dortmund",1,":",3]
[null,null,null,null,null,null,122,12,15,"Atalanta Bergamo","-","FC Arsenal",3,":",0]
[null,null,null,null,null,null,123,17,6,"Schachtjor Donezk","-","Inter Mailand",2,":",9]
[null,null,null,null,null,null,124,5,19,"FC Liverpool","-","Feyenoord Rotterdam",1,":",3]
[null,null,null,null,null,null,125,18,3,"AC Mailand","-","FC Bayern München",3,":",1]
[null,null,null,null,null,null,126,31,25,"FC Girona","-","OSC Lille",0,":",2]
[null,null,null,null,null,null,127,26,11,"Roter Stern Belgrad","-","Atletico Madrid",0,":",0]
[null,null,null,null,null,null,128,24,23,"Red Bull Salzburg","-","Dinamo Zagreb",0,":",3]
[null,null,null,null,null,null,129,21,2,"PSV Eindhoven","-","Manchester City",0,":",0]
[null,null,null,null,null,null,130,9,36,{"$f":"IFERROR(VLOOKUP($H135,$B$6:$C$45,2,0),\"\")","v":"FC Barcelona"},"-",{"$f":"IFERROR(VLOOKUP($I135,$B$6:$C$45,2,0),\"\")","v":"Mainz 05"},0,":",1]
[null,null,null,null,null,null,131,33,30,"Sturm Graz","-","FC Bologna",3,":",0]
[null,null,null,null,null,null,132,14,34,"Benfica Lissabon","-","Stade Brest",1,":",5]
[null,null,null,null,null,null,133,35,1,"Eintracht Frankfurt","-","Real Madrid",4,":",0]
[null,null,null,null,null,null,134,38,10,"FC Basel","-","Bayer Leverkusen",2,":",5]
[null,null,null,null,null,null,135,16,37,"FC Brügge","-","AC Roma",3,":",1]
[null,null,null,null,null,null,136,32,22,"VfB Stuttgart","-","Celtic Glasgow",0,":",3]
[null,null,null,null,null,null,137,20,8,"Sporting Lissabon","-","RB Leipzig",9,":",2]
[null,null,null,null,null,null,138,13,39,"Juventus Turin","-","FC Lille",3,":",1]
[null,null,null,null,null,null,139,40,29,"Hertha BSC","-","Aston Villa",1,":",3]
[null,null,null,null,null,null,140,27,28,"Young Boys Bern","-","AS Monaco",2,":",0]
[null,null,null,null,null,null,141,12,4,"Atalanta Bergamo","-","Paris Saint-Germain",0,":",0]
[null,null,null,null,null,null,142,6,7,"Inter Mailand","-","Borussia Dortmund",3,":",0]
[null,null,null,null,null,null,143,15,5,"FC Arsenal","-","FC Liverpool",0,":",0]
[null,null,null,null,null,null,144,3,17,"FC Bayern München","-","Schachtjor Donezk",1,":",0]
[null,null,null,null,null,null,145,19,31,"Feyenoord Rotterdam","-","FC Girona",0,":",3]
[null,null,null,null,null,null,146,11,18,"Atletico Madrid","-","AC Mailand",5,":",1]
[null,null,null,null,null,null,147,25,24,"OSC Lille","-","Red Bull Salzburg",0,":",4]
[null,null,null,null,null,null,148,2,26,"Manchester City","-","Roter Stern Belgrad",5,":",2]
[null,null,null,null,null,null,149,23,9,"Dinamo Zagreb","-","FC Barcelona",3,":",1]
[null,null,null,null,null,null,150,30,21,"FC Bologna","-","PSV Eindhoven",0,":",3]
[null,null,null,null,null,null,151,36,14,"Mainz 05","-","Benfica Lissabon",9,":",2]
[null,null,null,null,null,null,152,1,33,"Real Madrid","-","Sturm Graz",2,":",1]
[null,null,null,null,null,null,153,34,38,"Stade Brest","-","FC Basel",1,":",3]
[null,null,null,null,null,null,154,37,35,"AC Roma","-","Eintracht Frankfurt",2,":",0]
[null,null,null,null,null,null,155,10,32,"Bayer Leverkusen","-","VfB Stuttgart",0,":",0]
[null,null,null,null,null,null,156,8,16,"RB Leipzig","-","FC Brügge",3,":",0]
[null,null,null,null,null,null,157,22,13,"Celtic Glasgow","-","Juventus Turin",0,":",0]
[null,null,null,null,null,null,158,29,20,"Aston Villa","-","Sporting Lissabon",1,":",0]
[null,null,null,null,null,null,159,39,27,"FC Lille","-","Young Boys Bern",0,":",3]
[null,null,null,null,null,null,160,28,40,"AS Monaco","-","Hertha BSC",5,":",1]
[null,null,null,null,null,null,161,4,6,"Paris Saint-Germain","-","Inter Mailand",0,":",4]
[null,null,null,null,null,null,162,5,12,"FC Liverpool","-","Atalanta Bergamo",5,":",2]
[null,null,null,null,null,null,163,7,3,"Borussia Dortmund","-","FC Bayern München",3,":",1]
[null,null,null,null,null,null,164,31,15,"FC Girona","-","FC Arsenal",0,":",3]
[null,null,null,null,null,null,165,17,11,"Schachtjor Donezk","-","Atletico Madrid",9,":",2]
[null,null,null,null,null,null,166,24,19,"Red Bull Salzburg","-","Feyenoord Rotterdam",3,":",1]
[null,null,null,null,null,null,167,18,2,"AC Mailand","-","Manchester City",1,":",3]
[null,null,null,null,null,null,168,9,25,"FC Barcelona","-","OSC Lille",2,":",0]
[null,null,null,null,null,null,169,26,30,"Roter Stern Belgrad","-","FC Bologna",0,":",0]
[null,null,null,null,null,null,170,14,23,"Benfica Lissabon","-","Dinamo Zagreb",3,":",0]
[null,null,null,null,null,null,171,21,1,"PSV Eindhoven","-","Real Madrid",0,":",0]
[null,null,null,null,null,null,172,38,36,"FC Basel","-","Mainz 05",1,":",0]
[null,null,null,null,null,null,173,33,37,"Sturm Graz","-","AC Roma",0,":",3]
[null,null,null,null,null,null,174,32,34,"VfB Stuttgart","-","Stade Brest",5,":",1]
[null,null,null,null,null,null,175,35,8,"Eintracht Frankfurt","-","RB Leipzig",0,":",4]
[null,null,null,null,null,null,176,13,10,"Juventus Turin","-","Bayer Leverkusen",5,":",2]
[null,null,null,null,null,null,177,16,29,"FC Brügge","-","Aston Villa",1,":",3]
[null,null,null,null,null,null,178,27,22,"Young Boys Bern","-","Celtic Glasgow",3,":",1]
[null,null,null,null,null,null,179,20,28,"Sporting Lissabon","-","AS Monaco",0,":",2]
[null,null,null,null,null,null,180,40,39,"Hertha BSC","-","FC Lille",0,":",0]
[null,null,null,null,null,null,181,5,4,"FC Liverpool","-","Paris Saint-Germain",0,":",3]
[null,null,null,null,null,null,182,3,6,"FC Bayern München","-","Inter Mailand",0,":",0]
[null,null,null,null,null,null,183,12,31,"Atalanta Bergamo","-","FC Girona",0,":",1]
[null,null,null,null,null,null,184,11,7,"Atletico Madrid","-","Borussia Dortmund",3,":",0]
[null,null,null,null,null,null,185,15,24,"FC Arsenal","-","Red Bull Salzburg",1,":",5]
[null,null,null,null,null,null,186,2,17,"Manchester City","-","Schachtjor Donezk",4,":",0]
[null,null,null,null,null,null,187,19,9,"Feyenoord Rotterdam","-","FC Barcelona",2,":",5]
[null,null,null,null,null,null,188,30,18,"FC Bologna","-","AC Mailand",1,":",3]
[null,null,null,null,null,null,189,25,14,"OSC Lille","-","Benfica Lissabon",3,":",0]
[null,null,null,null,null,null,190,1,26,"Real Madrid","-","Roter Stern Belgrad",2,":",9]
[null,null,null,null,null,null,191,23,38,"Dinamo Zagreb","-","FC Basel",1,":",3]
[null,null,null,null,null,null,192,37,21,"AC Roma","-","PSV Eindhoven",3,":",1]
[null,null,null,null,null,null,193,36,32,"Mainz 05","-","VfB Stuttgart",0,":",2]
[null,null,null,null,null,null,194,8,33,{"$f":"IFERROR(VLOOKUP($H199,$B$6:$C$45,2,0),\"\")","v":"RB Leipzig"},"-",{"$f":"IFERROR(VLOOKUP($I199,$B$6:$C$45,2,0),\"\")","v":"Sturm Graz"},0,":",0]
[null,null,null,null,null,null,195,34,13,"Stade Brest","-","Juventus Turin",0,":",3]
[null,null,null,null,null,null,196,29,35,"Aston Villa","-","Eintracht Frankfurt",0,":",0]
[null,null,null,null,null,null,197,10,27,"Bayer Leverkusen","-","Young Boys Bern",0,":",1]
[null,null,null,null,null,null,198,28,16,"AS Monaco","-","FC Brügge",3,":",0]
[null,null,null,null,null,null,199,22,40,"Celtic Glasgow","-","Hertha BSC",1,":",5]
[null,null,null,null,null,null,200,39,20,"FC Lille","-","Sporting Lissabon",4,":",0]
[null,null,null,null,null,null,201,4,3,"Paris Saint-Germain","-","FC Bayern München",2,":",5]
[null,null,null,null,null,null,202,31,5,"FC Girona","-","FC Liverpool",3,":",1]
[null,null,null,null,null,null,203,6,11,"Inter Mailand","-","Atletico Madrid",0,":",3]
[null,null,null,null,null,null,204,24,12,"Red Bull Salzburg","-","Atalanta Bergamo",9,":",2]
[null,null,null,null,null,null,205,7,2,"Borussia Dortmund","-","Manchester City",3,":",1]
[null,null,null,null,null,null,206,9,15,"FC Barcelona","-","FC Arsenal",1,":",3]
[null,null,null,null,null,null,207,17,30,"Schachtjor Donezk","-","FC Bologna",2,":",0]
[null,null,null,null,null,null,208,14,19,"Benfica Lissabon","-","Feyenoord Rotterdam",0,":",0]
[null,null,null,null,null,null,209,18,1,"AC Mailand","-","Real Madrid",3,":",0]
[null,null,null,null,null,null,210,38,25,"FC Basel","-","OSC Lille",0,":",0]
[null,null,null,null,null,null,211,26,37,"Roter Stern Belgrad","-","AC Roma",1,":",0]
[null,null,null,null,null,null,212,32,23,"VfB Stuttgart","-","Dinamo Zagreb",0,":",3]
[null,null,null,null,null,null,213,21,8,"PSV Eindhoven","-","RB Leipzig",5,":",1]
[null,null,null,null,null,null,214,13,36,"Juventus Turin","-","Mainz 05",0,":",4]
[null,null,null,null,null,null,215,33,29,"Sturm Graz","-","Aston Villa",5,":",2]
[null,null,null,null,null,null,216,27,34,"Young Boys Bern","-","Stade Brest",3,":",1]
[null,null,null,null,null,null,217,35,28,"Eintracht Frankfurt","-","AS Monaco",0,":",3]
[null,null,null,null,null,null,218,40,10,"Hertha BSC","-","Bayer Leverkusen",9,":",2]
[null,null,null,null,null,null,219,16,39,"FC Brügge","-","FC Lille",2,":",1]
[null,null,null,null,null,null,220,20,22,"Sporting Lissabon","-","Celtic Glasgow",1,":",3]
[null,null,null,null,null,null,221,31,4,"FC Girona","-","Paris Saint-Germain",2,":",0]
[null,null,null,null,null,null,222,11,3,"Atletico Madrid","-","FC Bayern München",0,":",0]
[null,null,null,null,null,null,223,5,24,"FC Liverpool","-","Red Bull Salzburg",3,":",0]
[null,null,null,null,null,null,224,2,6,"Manchester City","-","Inter Mailand",0,":",0]
[null,null,null,null,null,null,225,12,9,"Atalanta Bergamo","-","FC Barcelona",1,":",0]
[null,null,null,null,null,null,226,30,7,"FC Bologna","-","Borussia Dortmund",0,":",3]
[null,null,null,null,null,null,227,15,14,"FC Arsenal","-","Benfica Lissabon",5,":",1]
[null,null,null,null,null,null,228,1,17,"Real Madrid","-","Schachtjor Donezk",0,":",4]
[null,null,null,null,null,null,229,19,38,"Feyenoord Rotterdam","-","FC Basel",5,":",2]
[null,null,null,null,null,null,230,37,18,"AC Roma","-","AC Mailand",3,":",1]
[null,null,null,null,null,null,231,25,32,"OSC Lille","-","VfB Stuttgart",0,":",3]
[null,null,null,null,null,null,232,8,26,"RB Leipzig","-","Roter Stern Belgrad",9,":",2]
[null,null,null,null,null,null,233,23,13,"Dinamo Zagreb","-","Juventus Turin",3,":",1]
[null,null,null,null,null,null,234,29,21,"Aston Villa","-","PSV Eindhoven",1,":",3]
[null,null,null,null,null,null,235,36,27,"Mainz 05","-","Young Boys Bern",2,":",0]
[null,null,null,null,null,null,236,28,33,"AS Monaco","-","Sturm Graz",0,":",0]
[null,null,null,null,null,null,237,34,40,"Stade Brest","-","Hertha BSC",3,":",0]
[null,null,null,null,null,null,238,39,35,"FC Lille","-","Eintracht Frankfurt",0,":",0]
[null,null,null,null,null,null,239,10,20,"Bayer Leverkusen","-","Sporting Lissabon",1,":",0]
[null,null,null,null,null,null,240,22,16,"Celtic Glasgow","-","FC Brügge",0,":",3]
[null,null,null,null,null,null,241,4,11,"Paris Saint-Germain","-","Atletico Madrid",5,":",1]
[null,null,null,null,null,null,242,24,31,"Red Bull Salzburg","-","FC Girona",0,":",4]
[null,null,null,null,null,null,243,3,2,"FC Bayern München","-","Manchester City",5,":",2]
[null,null,null,null,null,null,244,9,5,"FC Barcelona","-","FC Liverpool",1,":",3]
[null,null,null,null,null,null,245,6,30,"Inter Mailand","-","FC Bologna",3,":",1]
[null,null,null,null,null,null,246,14,12,"Benfica Lissabon","-","Atalanta Bergamo",0,":",2]
[null,null,null,null,null,null,247,7,1,"Borussia Dortmund","-","Real Madrid",0,":",0]
[null,null,null,null,null,null,248,38,15,"FC Basel","-","FC Arsenal",0,":",3]
[null,null,null,null,null,null,249,17,37,"Schachtjor Donezk","-","AC Roma",0,":",0]
[null,null,null,null,null,null,250,32,19,"VfB Stuttgart","-","Feyenoord Rotterdam",0,":",1]
[null,null,null,null,null,null,251,18,8,"AC Mailand","-","RB Leipzig",3,":",0]
[null,null,null,null,null,null,252,13,25,"Juventus Turin","-","OSC Lille",1,":",5]
[null,null,null,null,null,null,253,26,29,"Roter Stern Belgrad","-","Aston Villa",4,":",0]
[null,null,null,null,null,null,254,27,23,"Young Boys Bern","-","Dinamo Zagreb",2,":",5]
[null,null,null,null,null,null,255,21,28,"PSV Eindhoven","-","AS Monaco",1,":",3]
[null,null,null,null,null,null,256,40,36,"Hertha BSC","-","Mainz 05",3,":",0]
[null,null,null,null,null,null,257,33,39,"Sturm Graz","-","FC Lille",2,":",9]
[null,null,null,null,null,null,258,20,34,{"$f":"IFERROR(VLOOKUP($H263,$B$6:$C$45,2,0),\"\")","v":"Sporting Lissabon"},"-",{"$f":"IFERROR(VLOOKUP($I263,$B$6:$C$45,2,0),\"\")","v":"Stade Brest"},1,":",3]
[null,null,null,null,null,null,259,35,22,"Eintracht Frankfurt","-","Celtic Glasgow",3,":",1]
[null,null,null,null,null,null,260,16,10,"FC Brügge","-","Bayer Leverkusen",0,":",2]
[null,null,null,null,null,null,261,24,4,"Red Bull Salzburg","-","Paris Saint-Germain",0,":",0]
[null,null,null,null,null,null,262,2,11,"Manchester City","-","Atletico Madrid",0,":",3]
[null,null,null,null,null,null,263,31,9,"FC Girona","-","FC Barcelona",0,":",0]
[null,null,null,null,null,null,264,30,3,"FC Bologna","-","FC Bayern München",0,":",1]
[null,null,null,null,null,null,265,5,14,"FC Liverpool","-","Benfica Lissabon",3,":",0]
[null,null,null,null,null,null,266,1,6,"Real Madrid","-","Inter Mailand",1,":",5]
[null,null,null,null,null,null,267,12,38,"Atalanta Bergamo","-","FC Basel",4,":",0]
[null,null,null,null,null,null,268,37,7,"AC Roma","-","Borussia Dortmund",2,":",5]
[null,null,null,null,null,null,269,15,32,"FC Arsenal","-","VfB Stuttgart",3,":",1]
[null,null,null,null,null,null,270,8,17,"RB Leipzig","-","Schachtjor Donezk",0,":",3]
[null,null,null,null,null,null,271,19,13,"Feyenoord Rotterdam","-","Juventus Turin",9,":",2]
[null,null,null,null,null,null,272,29,18,"Aston Villa","-","AC Mailand",3,":",1]
[null,null,null,null,null,null,273,25,27,"OSC Lille","-","Young Boys Bern",1,":",3]
[null,null,null,null,null,null,274,28,26,"AS Monaco","-","Roter Stern Belgrad",2,":",0]
[null,null,null,null,null,null,275,23,40,"Dinamo Zagreb","-","Hertha BSC",0,":",0]
[null,null,null,null,null,null,276,39,21,"FC Lille","-","PSV Eindhoven",3,":",0]
[null,null,null,null,null,null,277,36,20,"Mainz 05","-","Sporting Lissabon",0,":",0]
[null,null,null,null,null,null,278,22,33,"Celtic Glasgow","-","Sturm Graz",1,":",0]
[null,null,null,null,null,null,279,34,16,"Stade Brest","-","FC Brügge",0,":",3]
[null,null,null,null,null,null,280,10,35,"Bayer Leverkusen","-","Eintracht Frankfurt",5,":",1]
[null,null,null,null,null,null,281,4,2,"Paris Saint-Germain","-","Manchester City",0,":",4]
[null,null,null,null,null,null,282,9,24,"FC Barcelona","-","Red Bull Salzburg",5,":",2]
[null,null,null,null,null,null,283,11,30,"Atletico Madrid","-","FC Bologna",3,":",1]
[null,null,null,null,null,null,284,14,31,"Benfica Lissabon","-","FC Girona",0,":",3]
[null,null,null,null,null,null,285,3,1,"FC Bayern München","-","Real Madrid",9,":",2]
[null,null,null,null,null,null,286,38,5,"FC Basel","-","FC Liverpool",2,":",1]
[null,null,null,null,null,null,287,6,37,"Inter Mailand","-","AC Roma",1,":",3]
[null,null,null,null,null,null,288,32,12,"VfB Stuttgart","-","Atalanta Bergamo",2,":",0]
[null,null,null,null,null,null,289,7,8,"Borussia Dortmund","-","RB Leipzig",0,":",0]
[null,null,null,null,null,null,290,13,15,"Juventus Turin","-","FC Arsenal",3,":",0]
[null,null,null,null,null,null,291,17,29,"Schachtjor Donezk","-","Aston Villa",0,":",0]
[null,null,null,null,null,null,292,27,19,"Young Boys Bern","-","Feyenoord Rotterdam",1,":",0]
[null,null,null,null,null,null,293,18,28,"AC Mailand","-","AS Monaco",0,":",3]
[null,null,null,null,null,null,294,40,25,"Hertha BSC","-","OSC Lille",5,":",1]
[null,null,null,null,null,null,295,26,39,"Roter Stern Belgrad","-","FC Lille",0,":",4]
[null,null,null,null,null,null,296,20,23,"Sporting Lissabon","-","Dinamo Zagreb",5,":",2]
[null,null,null,null,null,null,297,21,22,"PSV Eindhoven","-","Celtic Glasgow",3,":",1]
[null,null,null,null,null,null,298,16,36,"FC Brügge","-","Mainz 05",0,":",3]
[null,null,null,null,null,null,299,33,10,"Sturm Graz","-","Bayer Leverkusen",9,":",2]
[null,null,null,null,null,null,300,35,34,"Eintracht Frankfurt","-","Stade Brest",3,":",1]
[null,null,null,null,null,null,301,9,4,"FC Barcelona","-","Paris Saint-Germain",1,":",3]
[null,null,null,null,null,null,302,30,2,"FC Bologna","-","Manchester City",2,":",0]
[null,null,null,null,null,null,303,24,14,"Red Bull Salzburg","-","Benfica Lissabon",0,":",0]
[null,null,null,null,null,null,304,1,11,"Real Madrid","-","Atletico Madrid",3,":",0]
[null,null,null,null,null,null,305,31,38,"FC Girona","-","FC Basel",0,":",0]
[null,null,null,null,null,null,306,37,3,"AC Roma","-","FC Bayern München",1,":",0]
[null,null,null,null,null,null,307,5,32,"FC Liverpool","-","VfB Stuttgart",0,":",3]
[null,null,null,null,null,null,308,8,6,"RB Leipzig","-","Inter Mailand",5,":",1]
[null,null,null,null,null,null,309,12,13,"Atalanta Bergamo","-","Juventus Turin",0,":",4]
[null,null,null,null,null,null,310,29,7,"Aston Villa","-","Borussia Dortmund",5,":",2]
[null,null,null,null,null,null,311,15,27,"FC Arsenal","-","Young Boys Bern",1,":",3]
[null,null,null,null,null,null,312,28,17,"AS Monaco","-","Schachtjor Donezk",3,":",1]
[null,null,null,null,null,null,313,19,40,"Feyenoord Rotterdam","-","Hertha BSC",0,":",2]
[null,null,null,null,null,null,314,39,18,"FC Lille","-","AC Mailand",0,":",0]
[null,null,null,null,null,null,315,25,20,"OSC Lille","-","Sporting Lissabon",0,":",3]
[null,null,null,null,null,null,316,22,26,"Celtic Glasgow","-","Roter Stern Belgrad",0,":",0]
[null,null,null,null,null,null,317,23,16,"Dinamo Zagreb","-","FC Brügge",0,":",1]
[null,null,null,null,null,null,318,10,21,"Bayer Leverkusen","-","PSV Eindhoven",3,":",0]
[null,null,null,null,null,null,319,36,35,"Mainz 05","-","Eintracht Frankfurt",1,":",5]
[null,null,null,null,null,null,320,34,33,"Stade Brest","-","Sturm Graz",4,":",0]
[null,null,null,null,null,null,321,4,30,"Paris Saint-Germain","-","FC Bologna",2,":",5]
[null,null,null,null,null,null,322,14,9,{"$f":"IFERROR(VLOOKUP($H327,$B$6:$C$45,2,0),\"\")","v":"Benfica Lissabon"},"-",{"$f":"IFERROR(VLOOKUP($I327,$B$6:$C$45,2,0),\"\")","v":"FC Barcelona"},1,":",3]
[null,null,null,null,null,null,323,2,1,"Manchester City","-","Real Madrid",3,":",0]
[null,null,null,null,null,null,324,38,24,"FC Basel","-","Red Bull Salzburg",2,":",9]
[null,null,null,null,null,null,325,11,37,"Atletico Madrid","-","AC Roma",1,":",3]
[null,null,null,null,null,null,326,32,31,"VfB Stuttgart","-","FC Girona",3,":",1]
[null,null,null,null,null,null,327,3,8,"FC Bayern München","-","RB Leipzig",0,":",2]
[null,null,null,null,null,null,328,13,5,"Juventus Turin","-","FC Liverpool",0,":",0]
[null,null,null,null,null,null,329,6,29,"Inter Mailand","-","Aston Villa",0,":",3]
[null,null,null,null,null,null,330,27,12,"Young Boys Bern","-","Atalanta Bergamo",0,":",0]
[null,null,null,null,null,null,331,7,28,"Borussia Dortmund","-","AS Monaco",0,":",1]
[null,null,null,null,null,null,332,40,15,"Hertha BSC","-","FC Arsenal",3,":",0]
[null,null,null,null,null,null,333,17,39,"Schachtjor Donezk","-","FC Lille",1,":",5]
[null,null,null,null,null,null,334,20,19,"Sporting Lissabon","-","Feyenoord Rotterdam",4,":",0]
[null,null,null,null,null,null,335,18,22,"AC Mailand","-","Celtic Glasgow",2,":",5]
[null,null,null,null,null,null,336,16,25,"FC Brügge","-","OSC Lille",3,":",1]
[null,null,null,null,null,null,337,26,10,"Roter Stern Belgrad","-","Bayer Leverkusen",0,":",3]
[null,null,null,null,null,null,338,35,23,"Eintracht Frankfurt","-","Dinamo Zagreb",9,":",2]
[null,null,null,null,null,null,339,21,34,"PSV Eindhoven","-","Stade Brest",3,":",1]
[null,null,null,null,null,null,340,33,36,"Sturm Graz","-","Mainz 05",1,":",3]
[null,null,null,null,null,null,341,14,4,"Benfica Lissabon","-","Paris Saint-Germain",2,":",0]
[null,null,null,null,null,null,342,1,30,"Real Madrid","-","FC Bologna",0,":",0]
[null,null,null,null,null,null,343,9,38,"FC Barcelona","-","FC Basel",3,":",0]
[null,null,null,null,null,null,344,37,2,"AC Roma","-","Manchester City",0,":",0]
[null,null,null,null,null,null,345,24,32,"Red Bull Salzburg","-","VfB Stuttgart",1,":",0]
[null,null,null,null,null,null,346,8,11,"RB Leipzig","-","Atletico Madrid",0,":",3]
[null,null,null,null,null,null,347,31,13,"FC Girona","-","Juventus Turin",5,":",1]
[null,null,null,null,null,null,348,29,3,"Aston Villa","-","FC Bayern München",0,":",4]
[null,null,null,null,null,null,349,5,27,"FC Liverpool","-","Young Boys Bern",5,":",2]
[null,null,null,null,null,null,350,28,6,"AS Monaco","-","Inter Mailand",3,":",1]
[null,null,null,null,null,null,351,12,40,"Atalanta Bergamo","-","Hertha BSC",0,":",3]
[null,null,null,null,null,null,352,39,7,"FC Lille","-","Borussia Dortmund",9,":",2]
[null,null,null,null,null,null,353,15,20,"FC Arsenal","-","Sporting Lissabon",2,":",1]
[null,null,null,null,null,null,354,22,17,"Celtic Glasgow","-","Schachtjor Donezk",1,":",3]
[null,null,null,null,null,null,355,19,16,"Feyenoord Rotterdam","-","FC Brügge",2,":",0]
[null,null,null,null,null,null,356,10,18,"Bayer Leverkusen","-","AC Mailand",0,":",0]
[null,null,null,null,null,null,357,25,35,"OSC Lille","-","Eintracht Frankfurt",3,":",0]
[null,null,null,null,null,null,358,34,26,"Stade Brest","-","Roter Stern Belgrad",0,":",0]
[null,null,null,null,null,null,359,23,33,"Dinamo Zagreb","-","Sturm Graz",1,":",0]
[null,null,null,null,null,null,360,36,21,"Mainz 05","-","PSV Eindhoven",0,":",3]
[null,null,null,null,null,null,361,4,1,"Paris Saint-Germain","-","Real Madrid",5,":",1]
[null,null,null,null,null,null,362,38,14,"FC Basel","-","Benfica Lissabon",0,":",4]
[null,null,null,null,null,null,363,30,37,"FC Bologna","-","AC Roma",5,":",2]
[null,null,null,null,null,null,364,32,9,"VfB Stuttgart","-","FC Barcelona",3,":",1]
[null,null,null,null,null,null,365,2,8,"Manchester City","-","RB Leipzig",0,":",3]
[null,null,null,null,null,null,366,13,24,"Juventus Turin","-","Red Bull Salzburg",9,":",2]
[null,null,null,null,null,null,367,11,29,"Atletico Madrid","-","Aston Villa",3,":",1]
[null,null,null,null,null,null,368,27,31,"Young Boys Bern","-","FC Girona",1,":",3]
[null,null,null,null,null,null,369,3,28,"FC Bayern München","-","AS Monaco",2,":",0]
[null,null,null,null,null,null,370,40,5,"Hertha BSC","-","FC Liverpool",0,":",0]
[null,null,null,null,null,null,371,6,39,"Inter Mailand","-","FC Lille",3,":",0]
[null,null,null,null,null,null,372,20,12,"Sporting Lissabon","-","Atalanta Bergamo",0,":",0]
[null,null,null,null,null,null,373,7,22,"Borussia Dortmund","-","Celtic Glasgow",1,":",0]
[null,null,null,null,null,null,374,16,15,"FC Brügge","-","FC Arsenal",0,":",3]
[null,null,null,null,null,null,375,17,10,"Schachtjor Donezk","-","Bayer Leverkusen",5,":",1]
[null,null,null,null,null,null,376,35,19,"Eintracht Frankfurt","-","Feyenoord Rotterdam",0,":",4]
[null,null,null,null,null,null,377,18,34,"AC Mailand","-","Stade Brest",5,":",2]
[null,null,null,null,null,null,378,33,25,"Sturm Graz","-","OSC Lille",1,":",3]
[null,null,null,null,null,null,379,26,36,"Roter Stern Belgrad","-","Mainz 05",3,":",1]
[null,null,null,null,null,null,380,21,23,"PSV Eindhoven","-","Dinamo Zagreb",0,":",2]
[null,null,null,null,null,null,381,38,4,"FC Basel","-","Paris Saint-Germain",0,":",0]
[null,null,null,null,null,null,382,37,1,"AC Roma","-","Real Madrid",0,":",3]
[null,null,null,null,null,null,383,14,32,"Benfica Lissabon","-","VfB Stuttgart",0,":",0]
[null,null,null,null,null,null,384,8,30,"RB Leipzig","-","FC Bologna",0,":",1]
[null,null,null,null,null,null,385,9,13,"FC Barcelona","-","Juventus Turin",3,":",0]
[null,null,null,null,null,null,386,29,2,{"$f":"IFERROR(VLOOKUP($H391,$B$6:$C$45,2,0),\"\")","v":"Aston Villa"},"-",{"$f":"IFERROR(VLOOKUP($I391,$B$6:$C$45,2,0),\"\")","v":"Manchester City"},1,":",5]
[null,null,null,null,null,null,387,24,27,"Red Bull Salzburg","-","Young Boys Bern",4,":",0]
[null,null,null,null,null,null,388,28,11,"AS Monaco","-","Atletico Madrid",2,":",5]
[null,null,null,null,null,null,389,31,40,"FC Girona","-","Hertha BSC",1,":",3]
[null,null,null,null,null,null,390,39,3,"FC Lille","-","FC Bayern München",3,":",0]
[null,null,null,null,null,null,391,5,20,"FC Liverpool","-","Sporting Lissabon",2,":",9]
[null,null,null,null,null,null,392,22,6,"Celtic Glasgow","-","Inter Mailand",1,":",3]
[null,null,null,null,null,null,393,12,16,"Atalanta Bergamo","-","FC Brügge",3,":",1]
[null,null,null,null,null,null,394,10,7,"Bayer Leverkusen","-","Borussia Dortmund",0,":",2]
[null,null,null,null,null,null,395,15,35,"FC Arsenal","-","Eintracht Frankfurt",0,":",0]
[null,null,null,null,null,null,396,34,17,"Stade Brest","-","Schachtjor Donezk",0,":",3]
[null,null,null,null,null,null,397,19,33,"Feyenoord Rotterdam","-","Sturm Graz",0,":",0]
[null,null,null,null,null,null,398,36,18,"Mainz 05","-","AC Mailand",0,":",1]
[null,null,null,null,null,null,399,25,21,"OSC Lille","-","PSV Eindhoven",3,":",0]
[null,null,null,null,null,null,400,23,26,"Dinamo Zagreb","-","Roter Stern Belgrad",1,":",5]
[null,null,null,null,null,null,401,4,37,"Paris Saint-Germain","-","AC Roma",4,":",0]
[null,null,null,null,null,null,402,32,38,"VfB Stuttgart","-","FC Basel",2,":",5]
[null,null,null,null,null,null,403,1,8,"Real Madrid","-","RB Leipzig",3,":",1]
[null,null,null,null,null,null,404,13,14,"Juventus Turin","-","Benfica Lissabon",0,":",3]
[null,null,null,null,null,null,405,30,29,"FC Bologna","-","Aston Villa",9,":",2]
[null,null,null,null,null,null,406,27,9,"Young Boys Bern","-","FC Barcelona",3,":",1]
[null,null,null,null,null,null,407,2,28,"Manchester City","-","AS Monaco",1,":",3]
[null,null,null,null,null,null,408,40,24,"Hertha BSC","-","Red Bull Salzburg",2,":",0]
[null,null,null,null,null,null,409,11,39,"Atletico Madrid","-","FC Lille",0,":",0]
[null,null,null,null,null,null,410,20,31,"Sporting Lissabon","-","FC Girona",3,":",0]
[null,null,null,null,null,null,411,3,22,"FC Bayern München","-","Celtic Glasgow",0,":",0]
[null,null,null,null,null,null,412,16,5,"FC Brügge","-","FC Liverpool",1,":",0]
[null,null,null,null,null,null,413,6,10,"Inter Mailand","-","Bayer Leverkusen",0,":",3]
[null,null,null,null,null,null,414,35,12,"Eintracht Frankfurt","-","Atalanta Bergamo",5,":",1]
[null,null,null,null,null,null,415,7,34,"Borussia Dortmund","-","Stade Brest",0,":",4]
[null,null,null,null,null,null,416,33,15,"Sturm Graz","-","FC Arsenal",5,":",2]
[null,null,null,null,null,null,417,17,36,"Schachtjor Donezk","-","Mainz 05",3,":",1]
[null,null,null,null,null,null,418,21,19,"PSV Eindhoven","-","Feyenoord Rotterdam",0,":",3]
[null,null,null,null,null,null,419,18,23,"AC Mailand","-","Dinamo Zagreb",9,":",2]
[null,null,null,null,null,null,420,26,25,"Roter Stern Belgrad","-","OSC Lille",2,":",1]
[null,null,null,null,null,null,421,32,4,"VfB Stuttgart","-","Paris Saint-Germain",1,":",3]
[null,null,null,null,null,null,422,8,37,"RB Leipzig","-","AC Roma",2,":",0]
[null,null,null,null,null,null,423,38,13,"FC Basel","-","Juventus Turin",0,":",0]
[null,null,null,null,null,null,424,29,1,"Aston Villa","-","Real Madrid",3,":",0]
[null,null,null,null,null,null,425,14,27,"Benfica Lissabon","-","Young Boys Bern",0,":",0]
[null,null,null,null,null,null,426,28,30,"AS Monaco","-","FC Bologna",1,":",0]
[null,null,null,null,null,null,427,9,40,"FC Barcelona","-","Hertha BSC",0,":",3]
[null,null,null,null,null,null,428,39,2,"FC Lille","-","Manchester City",5,":",1]
[null,null,null,null,null,null,429,24,20,"Red Bull Salzburg","-","Sporting Lissabon",0,":",4]
[null,null,null,null,null,null,430,22,11,"Celtic Glasgow","-","Atletico Madrid",5,":",2]
[null,null,null,null,null,null,431,31,16,"FC Girona","-","FC Brügge",3,":",1]
[null,null,null,null,null,null,432,10,3,"Bayer Leverkusen","-","FC Bayern München",0,":",3]
[null,null,null,null,null,null,433,5,35,"FC Liverpool","-","Eintracht Frankfurt",9,":",2]
[null,null,null,null,null,null,434,34,6,"Stade Brest","-","Inter Mailand",3,":",1]
[null,null,null,null,null,null,435,12,33,"Atalanta Bergamo","-","Sturm Graz",1,":",3]
[null,null,null,null,null,null,436,36,7,"Mainz 05","-","Borussia Dortmund",2,":",0]
[null,null,null,null,null,null,437,15,21,"FC Arsenal","-","PSV Eindhoven",0,":",0]
[null,null,null,null,null,null,438,23,17,"Dinamo Zagreb","-","Schachtjor Donezk",3,":",0]
[null,null,null,null,null,null,439,19,26,"Feyenoord Rotterdam","-","Roter Stern Belgrad",0,":",0]
[null,null,null,null,null,null,440,25,18,"OSC Lille","-","AC Mailand",1,":",0]
[null,null,null,null,null,null,441,4,8,"Paris Saint-Germain","-","RB Leipzig",0,":",3]
[null,null,null,null,null,null,442,13,32,"Juventus Turin","-","VfB Stuttgart",5,":",1]
[null,null,null,null,null,null,443,37,29,"AC Roma","-","Aston Villa",0,":",4]
[null,null,null,null,null,null,444,27,38,"Young Boys Bern","-","FC Basel",5,":",2]
[null,null,null,null,null,null,445,1,28,"Real Madrid","-","AS Monaco",1,":",3]
[null,null,null,null,null,null,446,40,14,"Hertha BSC","-","Benfica Lissabon",3,":",1]
[null,null,null,null,null,null,447,30,39,"FC Bologna","-","FC Lille",0,":",2]
[null,null,null,null,null,null,448,20,9,"Sporting Lissabon","-","FC Barcelona",0,":",0]
[null,null,null,null,null,null,449,2,22,"Manchester City","-","Celtic Glasgow",0,":",3]
[null,null,null,null,null,null,450,16,24,{"$f":"IFERROR(VLOOKUP($H455,$B$6:$C$45,2,0),\"\")","v":"FC Brügge"},"-",{"$f":"IFERROR(VLOOKUP($I455,$B$6:$C$45,2,0),\"\")","v":"Red Bull Salzburg"},0,":",0]
[null,null,null,null,null,null,451,11,10,"Atletico Madrid","-","Bayer Leverkusen",0,":",1]
[null,null,null,null,null,null,452,35,31,"Eintracht Frankfurt","-","FC Girona",3,":",0]
[null,null,null,null,null,null,453,3,34,"FC Bayern München","-","Stade Brest",1,":",5]
[null,null,null,null,null,null,454,33,5,"Sturm Graz","-","FC Liverpool",4,":",0]
[null,null,null,null,null,null,455,6,36,"Inter Mailand","-","Mainz 05",2,":",5]
[null,null,null,null,null,null,456,21,12,"PSV Eindhoven","-","Atalanta Bergamo",1,":",3]
[null,null,null,null,null,null,457,7,23,"Borussia Dortmund","-","Dinamo Zagreb",3,":",0]
[null,null,null,null,null,null,458,26,15,"Roter Stern Belgrad","-","FC Arsenal",2,":",9]
[null,null,null,null,null,null,459,17,25,"Schachtjor Donezk","-","OSC Lille",1,":",3]
[null,null,null,null,null,null,460,18,19,"AC Mailand","-","Feyenoord Rotterdam",3,":",1]
[null,null,null,null,null,null,461,13,4,"Juventus Turin","-","Paris Saint-Germain",0,":",2]
[null,null,null,null,null,null,462,29,8,"Aston Villa","-","RB Leipzig",0,":",0]
[null,null,null,null,null,null,463,32,27,"VfB Stuttgart","-","Young Boys Bern",0,":",3]
[null,null,null,null,null,null,464,28,37,"AS Monaco","-","AC Roma",0,":",0]
[null,null,null,null,null,null,465,38,40,"FC Basel","-","Hertha BSC",0,":",1]
[null,null,null,null,null,null,466,39,1,"FC Lille","-","Real Madrid",3,":",0]
[null,null,null,null,null,null,467,14,20,"Benfica Lissabon","-","Sporting Lissabon",1,":",5]
[null,null,null,null,null,null,468,22,30,"Celtic Glasgow","-","FC Bologna",4,":",0]
[null,null,null,null,null,null,469,9,16,"FC Barcelona","-","FC Brügge",2,":",5]
[null,null,null,null,null,null,470,10,2,"Bayer Leverkusen","-","Manchester City",3,":",1]
[null,null,null,null,null,null,471,24,35,"Red Bull Salzburg","-","Eintracht Frankfurt",0,":",3]
[null,null,null,null,null,null,472,34,11,"Stade Brest","-","Atletico Madrid",9,":",2]
[null,null,null,null,null,null,473,31,33,"FC Girona","-","Sturm Graz",3,":",1]
[null,null,null,null,null,null,474,36,3,"Mainz 05","-","FC Bayern München",1,":",3]
[null,null,null,null,null,null,475,5,21,"FC Liverpool","-","PSV Eindhoven",2,":",0]
[null,null,null,null,null,null,476,23,6,"Dinamo Zagreb","-","Inter Mailand",0,":",0]
[null,null,null,null,null,null,477,12,26,"Atalanta Bergamo","-","Roter Stern Belgrad",3,":",0]
[null,null,null,null,null,null,478,25,7,"OSC Lille","-","Borussia Dortmund",0,":",0]
[null,null,null,null,null,null,479,15,18,"FC Arsenal","-","AC Mailand",1,":",0]
[null,null,null,null,null,null,480,19,17,"Feyenoord Rotterdam","-","Schachtjor Donezk",0,":",3]
[null,null,null,null,null,null,481,4,29,"Paris Saint-Germain","-","Aston Villa",5,":",1]
[null,null,null,null,null,null,482,27,13,"Young Boys Bern","-","Juventus Turin",0,":",4]
[null,null,null,null,null,null,483,8,28,"RB Leipzig","-","AS Monaco",5,":",2]
[null,null,null,null,null,null,484,40,32,"Hertha BSC","-","VfB Stuttgart",3,":",1]
[null,null,null,null,null,null,485,37,39,"AC Roma","-","FC Lille",0,":",3]
[null,null,null,null,null,null,486,20,38,"Sporting Lissabon","-","FC Basel",9,":",2]
[null,null,null,null,null,null,487,1,22,"Real Madrid","-","Celtic Glasgow",2,":",1]
[null,null,null,null,null,null,488,16,14,"FC Brügge","-","Benfica Lissabon",1,":",3]
[null,null,null,null,null,null,489,30,10,"FC Bologna","-","Bayer Leverkusen",2,":",0]
[null,null,null,null,null,null,490,35,9,"Eintracht Frankfurt","-","FC Barcelona",0,":",0]
[null,null,null,null,null,null,491,2,34,"Manchester City","-","Stade Brest",3,":",0]
[null,null,null,null,null,null,492,33,24,"Sturm Graz","-","Red Bull Salzburg",0,":",0]
[null,null,null,null,null,null,493,11,36,"Atletico Madrid","-","Mainz 05",1,":",0]
[null,null,null,null,null,null,494,21,31,"PSV Eindhoven","-","FC Girona",0,":",3]
[null,null,null,null,null,null,495,3,23,"FC Bayern München","-","Dinamo Zagreb",5,":",1]
[null,null,null,null,null,null,496,26,5,"Roter Stern Belgrad","-","FC Liverpool",0,":",4]
[null,null,null,null,null,null,497,6,25,"Inter Mailand","-","OSC Lille",5,":",2]
[null,null,null,null,null,null,498,18,12,"AC Mailand","-","Atalanta Bergamo",3,":",1]
[null,null,null,null,null,null,499,7,19,"Borussia Dortmund","-","Feyenoord Rotterdam",0,":",3]
[null,null,null,null,null,null,500,17,15,"Schachtjor Donezk","-","FC Arsenal",9,":",2]
[null,null,null,null,null,null,501,27,4,"Young Boys Bern","-","Paris Saint-Germain",3,":",1]
[null,null,null,null,null,null,502,28,29,"AS Monaco","-","Aston Villa",1,":",3]
[null,null,null,null,null,null,503,13,40,"Juventus Turin","-","Hertha BSC",2,":",0]
[null,null,null,null,null,null,504,39,8,"FC Lille","-","RB Leipzig",0,":",0]
[null,null,null,null,null,null,505,32,20,"VfB Stuttgart","-","Sporting Lissabon",3,":",0]
[null,null,null,null,null,null,506,22,37,"Celtic Glasgow","-","AC Roma",0,":",0]
[null,null,null,null,null,null,507,38,16,"FC Basel","-","FC Brügge",1,":",0]
[null,null,null,null,null,null,508,10,1,"Bayer Leverkusen","-","Real Madrid",0,":",3]
[null,null,null,null,null,null,509,14,35,"Benfica Lissabon","-","Eintracht Frankfurt",5,":",1]
[null,null,null,null,null,null,510,34,30,"Stade Brest","-","FC Bologna",0,":",4]
[null,null,null,null,null,null,511,9,33,"FC Barcelona","-","Sturm Graz",5,":",2]
[null,null,null,null,null,null,512,36,2,"Mainz 05","-","Manchester City",1,":",3]
[null,null,null,null,null,null,513,24,21,"Red Bull Salzburg","-","PSV Eindhoven",3,":",1]
[null,null,null,null,null,null,514,23,11,{"$f":"IFERROR(VLOOKUP($H519,$B$6:$C$45,2,0),\"\")","v":"Dinamo Zagreb"},"-",{"$f":"IFERROR(VLOOKUP($I519,$B$6:$C$45,2,0),\"\")","v":"Atletico Madrid"},0,":",2]
[null,null,null,null,null,null,515,31,26,"FC Girona","-","Roter Stern Belgrad",0,":",0]
[null,null,null,null,null,null,516,25,3,"OSC Lille","-","FC Bayern München",0,":",3]
[null,null,null,null,null,null,517,5,18,"FC Liverpool","-","AC Mailand",0,":",0]
[null,null,null,null,null,null,518,19,6,"Feyenoord Rotterdam","-","Inter Mailand",0,":",1]
[null,null,null,null,null,null,519,12,17,"Atalanta Bergamo","-","Schachtjor Donezk",3,":",0]
[null,null,null,null,null,null,520,15,7,"FC Arsenal","-","Borussia Dortmund",1,":",5]
[null,null,null,null,null,null,521,4,28,"Paris Saint-Germain","-","AS Monaco",4,":",0]
[null,null,null,null,null,null,522,40,27,"Hertha BSC","-","Young Boys Bern",2,":",5]
[null,null,null,null,null,null,523,29,39,"Aston Villa","-","FC Lille",1,":",3]
[null,null,null,null,null,null,524,20,13,"Sporting Lissabon","-","Juventus Turin",3,":",0]
[null,null,null,null,null,null,525,8,22,"RB Leipzig","-","Celtic Glasgow",2,":",9]
[null,null,null,null,null,null,526,16,32,"FC Brügge","-","VfB Stuttgart",1,":",3]
[null,null,null,null,null,null,527,37,10,"AC Roma","-","Bayer Leverkusen",3,":",1]
[null,null,null,null,null,null,528,35,38,"Eintracht Frankfurt","-","FC Basel",0,":",2]
[null,null,null,null,null,null,529,1,34,"Real Madrid","-","Stade Brest",0,":",0]
[null,null,null,null,null,null,530,33,14,"Sturm Graz","-","Benfica Lissabon",0,":",3]
[null,null,null,null,null,null,531,30,36,"FC Bologna","-","Mainz 05",0,":",0]
[null,null,null,null,null,null,532,21,9,"PSV Eindhoven","-","FC Barcelona",0,":",1]
[null,null,null,null,null,null,533,2,23,"Manchester City","-","Dinamo Zagreb",3,":",0]
[null,null,null,null,null,null,534,26,24,"Roter Stern Belgrad","-","Red Bull Salzburg",1,":",5]
[null,null,null,null,null,null,535,11,25,"Atletico Madrid","-","OSC Lille",4,":",0]
[null,null,null,null,null,null,536,18,31,"AC Mailand","-","FC Girona",2,":",5]
[null,null,null,null,null,null,537,3,19,"FC Bayern München","-","Feyenoord Rotterdam",3,":",1]
[null,null,null,null,null,null,538,17,5,"Schachtjor Donezk","-","FC Liverpool",0,":",3]
[null,null,null,null,null,null,539,6,15,"Inter Mailand","-","FC Arsenal",9,":",2]
[null,null,null,null,null,null,540,7,12,"Borussia Dortmund","-","Atalanta Bergamo",3,":",1]
[null,null,null,null,null,null,541,40,4,"Hertha BSC","-","Paris Saint-Germain",1,":",3]
[null,null,null,null,null,null,542,39,28,"FC Lille","-","AS Monaco",2,":",0]
[null,null,null,null,null,null,543,27,20,"Young Boys Bern","-","Sporting Lissabon",0,":",0]
[null,null,null,null,null,null,544,22,29,"Celtic Glasgow","-","Aston Villa",3,":",0]
[null,null,null,null,null,null,545,13,16,"Juventus Turin","-","FC Brügge",0,":",0]
[null,null,null,null,null,null,546,10,8,"Bayer Leverkusen","-","RB Leipzig",1,":",0]
[null,null,null,null,null,null,547,32,35,"VfB Stuttgart","-","Eintracht Frankfurt",0,":",3]
[null,null,null,null,null,null,548,34,37,"Stade Brest","-","AC Roma",5,":",1]
[null,null,null,null,null,null,549,38,33,"FC Basel","-","Sturm Graz",0,":",4]
[null,null,null,null,null,null,550,36,1,"Mainz 05","-","Real Madrid",5,":",2]
[null,null,null,null,null,null,551,14,21,"Benfica Lissabon","-","PSV Eindhoven",3,":",1]
[null,null,null,null,null,null,552,23,30,"Dinamo Zagreb","-","FC Bologna",0,":",3]
[null,null,null,null,null,null,553,9,26,"FC Barcelona","-","Roter Stern Belgrad",9,":",2]
[null,null,null,null,null,null,554,25,2,"OSC Lille","-","Manchester City",2,":",1]
[null,null,null,null,null,null,555,24,18,"Red Bull Salzburg","-","AC Mailand",1,":",3]
[null,null,null,null,null,null,556,19,11,"Feyenoord Rotterdam","-","Atletico Madrid",2,":",0]
[null,null,null,null,null,null,557,31,17,"FC Girona","-","Schachtjor Donezk",0,":",0]
[null,null,null,null,null,null,558,15,3,"FC Arsenal","-","FC Bayern München",3,":",0]
[null,null,null,null,null,null,559,5,7,"FC Liverpool","-","Borussia Dortmund",0,":",0]
[null,null,null,null,null,null,560,12,6,"Atalanta Bergamo","-","Inter Mailand",1,":",0]
[null,null,null,null,null,null,561,4,39,"Paris Saint-Germain","-","FC Lille",0,":",3]
[null,null,null,null,null,null,562,20,40,"Sporting Lissabon","-","Hertha BSC",5,":",1]
[null,null,null,null,null,null,563,28,22,"AS Monaco","-","Celtic Glasgow",0,":",4]
[null,null,null,null,null,null,564,16,27,"FC Brügge","-","Young Boys Bern",5,":",2]
[null,null,null,null,null,null,565,29,10,"Aston Villa","-","Bayer Leverkusen",3,":",1]
[null,null,null,null,null,null,566,35,13,"Eintracht Frankfurt","-","Juventus Turin",0,":",3]
[null,null,null,null,null,null,567,8,34,"RB Leipzig","-","Stade Brest",9,":",2]
[null,null,null,null,null,null,568,33,32,"Sturm Graz","-","VfB Stuttgart",3,":",1]
[null,null,null,null,null,null,569,37,36,"AC Roma","-","Mainz 05",1,":",3]
[null,null,null,null,null,null,570,21,38,"PSV Eindhoven","-","FC Basel",2,":",0]
[null,null,null,null,null,null,571,1,23,"Real Madrid","-","Dinamo Zagreb",0,":",0]
[null,null,null,null,null,null,572,26,14,"Roter Stern Belgrad","-","Benfica Lissabon",3,":",0]
[null,null,null,null,null,null,573,30,25,"FC Bologna","-","OSC Lille",0,":",0]
[null,null,null,null,null,null,574,18,9,"AC Mailand","-","FC Barcelona",1,":",0]
[null,null,null,null,null,null,575,2,19,"Manchester City","-","Feyenoord Rotterdam",0,":",3]
[null,null,null,null,null,null,576,17,24,"Schachtjor Donezk","-","Red Bull Salzburg",5,":",1]
[null,null,null,null,null,null,577,11,15,"Atletico Madrid","-","FC Arsenal",0,":",4]
[null,null,null,null,null,null,578,7,31,{"$f":"IFERROR(VLOOKUP($H583,$B$6:$C$45,2,0),\"\")","v":"Borussia Dortmund"},"-",{"$f":"IFERROR(VLOOKUP($I583,$B$6:$C$45,2,0),\"\")","v":"FC Girona"},5,":",2]
[null,null,null,null,null,null,579,3,12,"FC Bayern München","-","Atalanta Bergamo",1,":",3]
[null,null,null,null,null,null,580,6,5,"Inter Mailand","-","FC Liverpool",3,":",1]
[null,null,null,null,null,null,581,20,4,"Sporting Lissabon","-","Paris Saint-Germain",0,":",2]
[null,null,null,null,null,null,582,22,39,"Celtic Glasgow","-","FC Lille",0,":",0]
[null,null,null,null,null,null,583,40,16,"Hertha BSC","-","FC Brügge",0,":",3]
[null,null,null,null,null,null,584,10,28,"Bayer Leverkusen","-","AS Monaco",0,":",0]
[null,null,null,null,null,null,585,27,35,"Young Boys Bern","-","Eintracht Frankfurt",0,":",1]
[null,null,null,null,null,null,586,34,29,"Stade Brest","-","Aston Villa",3,":",0]
[null,null,null,null,null,null,587,13,33,"Juventus Turin","-","Sturm Graz",1,":",5]
[null,null,null,null,null,null,588,36,8,"Mainz 05","-","RB Leipzig",4,":",0]
[null,null,null,null,null,null,589,32,21,"VfB Stuttgart","-","PSV Eindhoven",2,":",5]
[null,null,null,null,null,null,590,23,37,"Dinamo Zagreb","-","AC Roma",1,":",3]
[null,null,null,null,null,null,591,38,26,"FC Basel","-","Roter Stern Belgrad",3,":",0]
[null,null,null,null,null,null,592,25,1,"OSC Lille","-","Real Madrid",2,":",9]
[null,null,null,null,null,null,593,14,18,"Benfica Lissabon","-","AC Mailand",1,":",3]
[null,null,null,null,null,null,594,19,30,"Feyenoord Rotterdam","-","FC Bologna",3,":",1]
[null,null,null,null,null,null,595,9,17,"FC Barcelona","-","Schachtjor Donezk",0,":",2]
[null,null,null,null,null,null,596,15,2,"FC Arsenal","-","Manchester City",0,":",0]
[null,null,null,null,null,null,597,24,7,"Red Bull Salzburg","-","Borussia Dortmund",0,":",3]
[null,null,null,null,null,null,598,12,11,"Atalanta Bergamo","-","Atletico Madrid",0,":",0]
[null,null,null,null,null,null,599,31,6,"FC Girona","-","Inter Mailand",0,":",1]
[null,null,null,null,null,null,600,5,3,"FC Liverpool","-","FC Bayern München",3,":",0]
[null,null,null,null,null,null,601,4,22,"Paris Saint-Germain","-","Celtic Glasgow",1,":",5]
[null,null,null,null,null,null,602,16,20,"FC Brügge","-","Sporting Lissabon",4,":",0]
[null,null,null,null,null,null,603,39,10,"FC Lille","-","Bayer Leverkusen",2,":",5]
[null,null,null,null,null,null,604,35,40,"Eintracht Frankfurt","-","Hertha BSC",3,":",1]
[null,null,null,null,null,null,605,28,34,"AS Monaco","-","Stade Brest",0,":",3]
[null,null,null,null,null,null,606,33,27,"Sturm Graz","-","Young Boys Bern",9,":",2]
[null,null,null,null,null,null,607,29,36,"Aston Villa","-","Mainz 05",3,":",1]
[null,null,null,null,null,null,608,21,13,"PSV Eindhoven","-","Juventus Turin",1,":",3]
[null,null,null,null,null,null,609,8,23,"RB Leipzig","-","Dinamo Zagreb",2,":",0]
[null,null,null,null,null,null,610,26,32,"Roter Stern Belgrad","-","VfB Stuttgart",0,":",0]
[null,null,null,null,null,null,611,37,25,"AC Roma","-","OSC Lille",3,":",0]
[null,null,null,null,null,null,612,18,38,"AC Mailand","-","FC Basel",0,":",0]
[null,null,null,null,null,null,613,1,19,"Real Madrid","-","Feyenoord Rotterdam",1,":",0]
[null,null,null,null,null,null,614,17,14,"Schachtjor Donezk","-","Benfica Lissabon",0,":",3]
[null,null,null,null,null,null,615,30,15,"FC Bologna","-","FC Arsenal",5,":",1]
[null,null,null,null,null,null,616,7,9,"Borussia Dortmund","-","FC Barcelona",0,":",4]
[null,null,null,null,null,null,617,2,12,"Manchester City","-","Atalanta Bergamo",5,":",2]
[null,null,null,null,null,null,618,6,24,"Inter Mailand","-","Red Bull Salzburg",3,":",1]
[null,null,null,null,null,null,619,11,5,"Atletico Madrid","-","FC Liverpool",0,":",3]
[null,null,null,null,null,null,620,3,31,"FC Bayern München","-","FC Girona",9,":",2]
[null,null,null,null,null,null,621,16,4,"FC Brügge","-","Paris Saint-Germain",2,":",1]
[null,null,null,null,null,null,622,10,22,"Bayer Leverkusen","-","Celtic Glasgow",1,":",3]
[null,null,null,null,null,null,623,20,35,"Sporting Lissabon","-","Eintracht Frankfurt",2,":",0]
[null,null,null,null,null,null,624,34,39,"Stade Brest","-","FC Lille",0,":",0]
[null,null,null,null,null,null,625,40,33,"Hertha BSC","-","Sturm Graz",3,":",0]
[null,null,null,null,null,null,626,36,28,"Mainz 05","-","AS Monaco",0,":",0]
[null,null,null,null,null,null,627,27,21,"Young Boys Bern","-","PSV Eindhoven",1,":",0]
[null,null,null,null,null,null,628,23,29,"Dinamo Zagreb","-","Aston Villa",0,":",3]
[null,null,null,null,null,null,629,13,26,"Juventus Turin","-","Roter Stern Belgrad",5,":",1]
[null,null,null,null,null,null,630,25,8,"OSC Lille","-","RB Leipzig",0,":",4]
[null,null,null,null,null,null,631,32,18,"VfB Stuttgart","-","AC Mailand",5,":",2]
[null,null,null,null,null,null,632,19,37,"Feyenoord Rotterdam","-","AC Roma",3,":",1]
[null,null,null,null,null,null,633,38,17,"FC Basel","-","Schachtjor Donezk",0,":",3]
[null,null,null,null,null,null,634,15,1,"FC Arsenal","-","Real Madrid",9,":",2]
[null,null,null,null,null,null,635,14,7,"Benfica Lissabon","-","Borussia Dortmund",3,":",1]
[null,null,null,null,null,null,636,12,30,"Atalanta Bergamo","-","FC Bologna",1,":",3]
[null,null,null,null,null,null,637,9,6,"FC Barcelona","-","Inter Mailand",2,":",0]
[null,null,null,null,null,null,638,5,2,"FC Liverpool","-","Manchester City",0,":",0]
[null,null,null,null,null,null,639,24,3,"Red Bull Salzburg","-","FC Bayern München",3,":",0]
[null,null,null,null,null,null,640,31,11,"FC Girona","-","Atletico Madrid",0,":",0]
[null,null,null,null,null,null,641,4,10,"Paris Saint-Germain","-","Bayer Leverkusen",1,":",0]
[null,null,null,null,null,null,642,35,16,{"$f":"IFERROR(VLOOKUP($H647,$B$6:$C$45,2,0),\"\")","v":"Eintracht Frankfurt"},"-",{"$f":"IFERROR(VLOOKUP($I647,$B$6:$C$45,2,0),\"\")","v":"FC Brügge"},0,":",3]
[null,null,null,null,null,null,643,22,34,"Celtic Glasgow","-","Stade Brest",5,":",1]
[null,null,null,null,null,null,644,33,20,"Sturm Graz","-","Sporting Lissabon",0,":",4]
[null,null,null,null,null,null,645,39,36,"FC Lille","-","Mainz 05",5,":",2]
[null,null,null,null,null,null,646,21,40,"PSV Eindhoven","-","Hertha BSC",1,":",3]
[null,null,null,null,null,null,647,28,23,"AS Monaco","-","Dinamo Zagreb",3,":",1]
[null,null,null,null,null,null,648,26,27,"Roter Stern Belgrad","-","Young Boys Bern",0,":",2]
[null,null,null,null,null,null,649,29,25,"Aston Villa","-","OSC Lille",0,":",0]
[null,null,null,null,null,null,650,18,13,"AC Mailand","-","Juventus Turin",0,":",3]
[null,null,null,null,null,null,651,8,19,"RB Leipzig","-","Feyenoord Rotterdam",0,":",0]
[null,null,null,null,null,null,652,17,32,"Schachtjor Donezk","-","VfB Stuttgart",0,":",1]
[null,null,null,null,null,null,653,37,15,"AC Roma","-","FC Arsenal",3,":",0]
[null,null,null,null,null,null,654,7,38,"Borussia Dortmund","-","FC Basel",1,":",5]
[null,null,null,null,null,null,655,1,12,"Real Madrid","-","Atalanta Bergamo",4,":",0]
[null,null,null,null,null,null,656,6,14,"Inter Mailand","-","Benfica Lissabon",2,":",5]
[null,null,null,null,null,null,657,30,5,"FC Bologna","-","FC Liverpool",1,":",3]
[null,null,null,null,null,null,658,3,9,"FC Bayern München","-","FC Barcelona",3,":",0]
[null,null,null,null,null,null,659,2,31,"Manchester City","-","FC Girona",2,":",9]
[null,null,null,null,null,null,660,11,24,"Atletico Madrid","-","Red Bull Salzburg",1,":",3]
[null,null,null,null,null,null,661,35,4,"Eintracht Frankfurt","-","Paris Saint-Germain",3,":",1]
[null,null,null,null,null,null,662,34,10,"Stade Brest","-","Bayer Leverkusen",0,":",2]
[null,null,null,null,null,null,663,16,33,"FC Brügge","-","Sturm Graz",0,":",0]
[null,null,null,null,null,null,664,36,22,"Mainz 05","-","Celtic Glasgow",0,":",3]
[null,null,null,null,null,null,665,20,21,"Sporting Lissabon","-","PSV Eindhoven",0,":",0]
[null,null,null,null,null,null,666,23,39,"Dinamo Zagreb","-","FC Lille",0,":",1]
[null,null,null,null,null,null,667,40,26,"Hertha BSC","-","Roter Stern Belgrad",3,":",0]
[null,null,null,null,null,null,668,25,28,"OSC Lille","-","AS Monaco",1,":",5]
[null,null,null,null,null,null,669,27,18,"Young Boys Bern","-","AC Mailand",4,":",0]
[null,null,null,null,null,null,670,19,29,"Feyenoord Rotterdam","-","Aston Villa",2,":",5]
[null,null,null,null,null,null,671,13,17,"Juventus Turin","-","Schachtjor Donezk",3,":",1]
[null,null,null,null,null,null,672,15,8,"FC Arsenal","-","RB Leipzig",0,":",3]
[null,null,null,null,null,null,673,32,7,"VfB Stuttgart","-","Borussia Dortmund",9,":",2]
[null,null,null,null,null,null,674,12,37,"Atalanta Bergamo","-","AC Roma",3,":",1]
[null,null,null,null,null,null,675,38,6,"FC Basel","-","Inter Mailand",1,":",3]
[null,null,null,null,null,null,676,5,1,"FC Liverpool","-","Real Madrid",2,":",0]
[null,null,null,null,null,null,677,14,3,"Benfica Lissabon","-","FC Bayern München",0,":",0]
[null,null,null,null,null,null,678,31,30,"FC Girona","-","FC Bologna",3,":",0]
[null,null,null,null,null,null,679,9,11,"FC Barcelona","-","Atletico Madrid",0,":",0]
[null,null,null,null,null,null,680,24,2,"Red Bull Salzburg","-","Manchester City",1,":",0]
[null,null,null,null,null,null,681,4,34,"Paris Saint-Germain","-","Stade Brest",0,":",3]
[null,null,null,null,null,null,682,33,35,"Sturm Graz","-","Eintracht Frankfurt",5,":",1]
[null,null,null,null,null,null,683,10,36,"Bayer Leverkusen","-","Mainz 05",0,":",4]
[null,null,null,null,null,null,684,21,16,"PSV Eindhoven","-","FC Brügge",5,":",2]
[null,null,null,null,null,null,685,22,23,"Celtic Glasgow","-","Dinamo Zagreb",3,":",1]
[null,null,null,null,null,null,686,26,20,"Roter Stern Belgrad","-","Sporting Lissabon",0,":",3]
[null,null,null,null,null,null,687,39,25,"FC Lille","-","OSC Lille",9,":",2]
[null,null,null,null,null,null,688,18,40,"AC Mailand","-","Hertha BSC",2,":",1]
[null,null,null,null,null,null,689,28,19,"AS Monaco","-","Feyenoord Rotterdam",1,":",3]
[null,null,null,null,null,null,690,17,27,"Schachtjor Donezk","-","Young Boys Bern",2,":",0]
[null,null,null,null,null,null,691,29,15,"Aston Villa","-","FC Arsenal",0,":",0]
[null,null,null,null,null,null,692,7,13,"Borussia Dortmund","-","Juventus Turin",3,":",0]
[null,null,null,null,null,null,693,8,12,"RB Leipzig","-","Atalanta Bergamo",0,":",0]
[null,null,null,null,null,null,694,6,32,"Inter Mailand","-","VfB Stuttgart",1,":",0]
[null,null,null,null,null,null,695,37,5,"AC Roma","-","FC Liverpool",0,":",3]
[null,null,null,null,null,null,696,3,38,"FC Bayern München","-","FC Basel",5,":",1]
[null,null,null,null,null,null,697,1,31,"Real Madrid","-","FC Girona",0,":",4]
[null,null,null,null,null,null,698,11,14,"Atletico Madrid","-","Benfica Lissabon",5,":",2]
[null,null,null,null,null,null,699,30,24,"FC Bologna","-","Red Bull Salzburg",3,":",1]
[null,null,null,null,null,null,700,2,9,"Manchester City","-","FC Barcelona",0,":",3]
[null,null,null,null,null,null,701,33,4,"Sturm Graz","-","Paris Saint-Germain",9,":",2]
[null,null,null,null,null,null,702,36,34,"Mainz 05","-","Stade Brest",3,":",1]
[null,null,null,null,null,null,703,35,21,"Eintracht Frankfurt","-","PSV Eindhoven",1,":",3]
[null,null,null,null,null,null,704,23,10,"Dinamo Zagreb","-","Bayer Leverkusen",2,":",0]
[null,null,null,null,null,null,705,16,26,"FC Brügge","-","Roter Stern Belgrad",0,":",0]
[null,null,null,null,null,null,706,25,22,{"$f":"IFERROR(VLOOKUP($H711,$B$6:$C$45,2,0),\"\")","v":"OSC Lille"},"-",{"$f":"IFERROR(VLOOKUP($I711,$B$6:$C$45,2,0),\"\")","v":"Celtic Glasgow"},3,":",0]
[null,null,null,null,null,null,707,20,18,"Sporting Lissabon","-","AC Mailand",0,":",0]
[null,null,null,null,null,null,708,19,39,"Feyenoord Rotterdam","-","FC Lille",1,":",0]
[null,null,null,null,null,null,709,40,17,"Hertha BSC","-","Schachtjor Donezk",0,":",3]
[null,null,null,null,null,null,710,15,28,"FC Arsenal","-","AS Monaco",5,":",1]
[null,null,null,null,null,null,711,27,7,"Young Boys Bern","-","Borussia Dortmund",0,":",4]
[null,null,null,null,null,null,712,12,29,"Atalanta Bergamo","-","Aston Villa",5,":",2]
[null,null,null,null,null,null,713,13,6,"Juventus Turin","-","Inter Mailand",1,":",3]
[null,null,null,null,null,null,714,5,8,"FC Liverpool","-","RB Leipzig",3,":",1]
[null,null,null,null,null,null,715,32,3,"VfB Stuttgart","-","FC Bayern München",0,":",2]
[null,null,null,null,null,null,716,31,37,"FC Girona","-","AC Roma",0,":",0]
[null,null,null,null,null,null,717,38,11,"FC Basel","-","Atletico Madrid",0,":",3]
[null,null,null,null,null,null,718,24,1,"Red Bull Salzburg","-","Real Madrid",0,":",0]
[null,null,null,null,null,null,719,14,2,"Benfica Lissabon","-","Manchester City",0,":",1]
[null,null,null,null,null,null,720,9,30,"FC Barcelona","-","FC Bologna",3,":",0]
[null,null,null,null,null,null,721,4,36,"Paris Saint-Germain","-","Mainz 05",1,":",5]
[null,null,null,null,null,null,722,21,33,"PSV Eindhoven","-","Sturm Graz",4,":",0]
[null,null,null,null,null,null,723,34,23,"Stade Brest","-","Dinamo Zagreb",2,":",5]
[null,null,null,null,null,null,724,26,35,"Roter Stern Belgrad","-","Eintracht Frankfurt",1,":",3]
[null,null,null,null,null,null,725,10,25,"Bayer Leverkusen","-","OSC Lille",3,":",0]
[null,null,null,null,null,null,726,18,16,"AC Mailand","-","FC Brügge",2,":",9]
[null,null,null,null,null,null,727,22,19,"Celtic Glasgow","-","Feyenoord Rotterdam",1,":",3]
[null,null,null,null,null,null,728,17,20,"Schachtjor Donezk","-","Sporting Lissabon",3,":",1]
[null,null,null,null,null,null,729,39,15,"FC Lille","-","FC Arsenal",0,":",2]
[null,null,null,null,null,null,730,7,40,"Borussia Dortmund","-","Hertha BSC",0,":",0]
[null,null,null,null,null,null,731,28,12,"AS Monaco","-","Atalanta Bergamo",0,":",3]
[null,null,null,null,null,null,732,6,27,"Inter Mailand","-","Young Boys Bern",0,":",0]
[null,null,null,null,null,null,733,29,5,"Aston Villa","-","FC Liverpool",0,":",1]
[null,null,null,null,null,null,734,3,13,"FC Bayern München","-","Juventus Turin",3,":",0]
[null,null,null,null,null,null,735,8,31,"RB Leipzig","-","FC Girona",1,":",5]
[null,null,null,null,null,null,736,11,32,"Atletico Madrid","-","VfB Stuttgart",4,":",0]
[null,null,null,null,null,null,737,37,24,"AC Roma","-","Red Bull Salzburg",2,":",5]
[null,null,null,null,null,null,738,2,38,"Manchester City","-","FC Basel",3,":",1]
[null,null,null,null,null,null,739,1,9,"Real Madrid","-","FC Barcelona",0,":",3]
[null,null,null,null,null,null,740,30,14,"FC Bologna","-","Benfica Lissabon",9,":",2]
[null,null,null,null,null,null,741,21,4,"PSV Eindhoven","-","Paris Saint-Germain",3,":",1]
[null,null,null,null,null,null,742,23,36,"Dinamo Zagreb","-","Mainz 05",1,":",3]
[null,null,null,null,null,null,743,33,26,"Sturm Graz","-","Roter Stern Belgrad",2,":",0]
[null,null,null,null,null,null,744,25,34,"OSC Lille","-","Stade Brest",0,":",0]
[null,null,null,null,null,null,745,35,18,"Eintracht Frankfurt","-","AC Mailand",3,":",0]
[null,null,null,null,null,null,746,19,10,"Feyenoord Rotterdam","-","Bayer Leverkusen",0,":",0]
[null,null,null,null,null,null,747,16,17,"FC Brügge","-","Schachtjor Donezk",1,":",0]
[null,null,null,null,null,null,748,15,22,"FC Arsenal","-","Celtic Glasgow",0,":",3]
[null,null,null,null,null,null,749,20,7,"Sporting Lissabon","-","Borussia Dortmund",5,":",1]
[null,null,null,null,null,null,750,12,39,"Atalanta Bergamo","-","FC Lille",0,":",4]
[null,null,null,null,null,null,751,40,6,"Hertha BSC","-","Inter Mailand",5,":",2]
[null,null,null,null,null,null,752,5,28,"FC Liverpool","-","AS Monaco",3,":",1]
[null,null,null,null,null,null,753,27,3,"Young Boys Bern","-","FC Bayern München",0,":",3]
[null,null,null,null,null,null,754,31,29,"FC Girona","-","Aston Villa",9,":",2]
[null,null,null,null,null,null,755,13,11,"Juventus Turin","-","Atletico Madrid",2,":",1]
[null,null,null,null,null,null,756,24,8,"Red Bull Salzburg","-","RB Leipzig",1,":",3]
[null,null,null,null,null,null,757,32,2,"VfB Stuttgart","-","Manchester City",2,":",0]
[null,null,null,null,null,null,758,9,37,"FC Barcelona","-","AC Roma",0,":",0]
[null,null,null,null,null,null,759,38,30,"FC Basel","-","FC Bologna",3,":",0]
[null,null,null,null,null,null,760,14,1,"Benfica Lissabon","-","Real Madrid",0,":",0]
[null,null,null,null,null,null,761,4,23,"Paris Saint-Germain","-","Dinamo Zagreb",1,":",0]
[null,null,null,null,null,null,762,26,21,"Roter Stern Belgrad","-","PSV Eindhoven",0,":",3]
[null,null,null,null,null,null,763,36,25,"Mainz 05","-","OSC Lille",5,":",1]
[null,null,null,null,null,null,764,18,33,"AC Mailand","-","Sturm Graz",0,":",4]
[null,null,null,null,null,null,765,34,19,"Stade Brest","-","Feyenoord Rotterdam",5,":",2]
[null,null,null,null,null,null,766,17,35,"Schachtjor Donezk","-","Eintracht Frankfurt",3,":",1]
[null,null,null,null,null,null,767,10,15,"Bayer Leverkusen","-","FC Arsenal",0,":",3]
[null,null,null,null,null,null,768,7,16,"Borussia Dortmund","-","FC Brügge",9,":",2]
[null,null,null,null,null,null,769,22,12,"Celtic Glasgow","-","Atalanta Bergamo",3,":",1]
[null,null,null,null,null,null,770,6,20,{"$f":"IFERROR(VLOOKUP($H775,$B$6:$C$45,2,0),\"\")","v":"Inter Mailand"},"-",{"$f":"IFERROR(VLOOKUP($I775,$B$6:$C$45,2,0),\"\")","v":"Sporting Lissabon"},1,":",3]
[null,null,null,null,null,null,771,39,5,"FC Lille","-","FC Liverpool",2,":",0]
[null,null,null,null,null,null,772,3,40,"FC Bayern München","-","Hertha BSC",0,":",0]
[null,null,null,null,null,null,773,28,31,"AS Monaco","-","FC Girona",3,":",0]
[null,null,null,null,null,null,774,11,27,"Atletico Madrid","-","Young Boys Bern",0,":",0]
[null,null,null,null,null,null,775,29,24,"Aston Villa","-","Red Bull Salzburg",1,":",0]
[null,null,null,null,null,null,776,2,13,"Manchester City","-","Juventus Turin",0,":",3]
[null,null,null,null,null,null,777,8,9,"RB Leipzig","-","FC Barcelona",5,":",1]
[null,null,null,null,null,null,778,30,32,"FC Bologna","-","VfB Stuttgart",0,":",4]
[null,null,null,null,null,null,779,37,14,"AC Roma","-","Benfica Lissabon",5,":",2]
[null,null,null,null,null,null,780,1,38,"Real Madrid","-","FC Basel",1,":",3]
[null,null,null,null,null,null,781,26,4,"Roter Stern Belgrad","-","Paris Saint-Germain",3,":",1]
[null,null,null,null,null,null,782,23,25,"Dinamo Zagreb","-","OSC Lille",0,":",2]
[null,null,null,null,null,null,783,18,21,"AC Mailand","-","PSV Eindhoven",0,":",0]
[null,null,null,null,null,null,784,36,19,"Mainz 05","-","Feyenoord Rotterdam",0,":",3]
[null,null,null,null,null,null,785,17,33,"Schachtjor Donezk","-","Sturm Graz",0,":",0]
[null,null,null,null,null,null,786,34,15,"Stade Brest","-","FC Arsenal",0,":",1]
[null,null,null,null,null,null,787,7,35,"Borussia Dortmund","-","Eintracht Frankfurt",3,":",0]
[null,null,null,null,null,null,788,10,12,"Bayer Leverkusen","-","Atalanta Bergamo",1,":",5]
[null,null,null,null,null,null,789,6,16,"Inter Mailand","-","FC Brügge",4,":",0]
[null,null,null,null,null,null,790,22,5,"Celtic Glasgow","-","FC Liverpool",2,":",5]
[null,null,null,null,null,null,791,3,20,"FC Bayern München","-","Sporting Lissabon",1,":",3]
[null,null,null,null,null,null,792,39,31,"FC Lille","-","FC Girona",3,":",0]
[null,null,null,null,null,null,793,11,40,"Atletico Madrid","-","Hertha BSC",2,":",9]
[null,null,null,null,null,null,794,28,24,"AS Monaco","-","Red Bull Salzburg",1,":",3]
[null,null,null,null,null,null,795,2,27,"Manchester City","-","Young Boys Bern",3,":",1]
[null,null,null,null,null,null,796,29,9,"Aston Villa","-","FC Barcelona",0,":",2]
[null,null,null,null,null,null,797,30,13,"FC Bologna","-","Juventus Turin",null,":"]
[null,null,null,null,null,null,798,8,14,"RB Leipzig","-","Benfica Lissabon",null,":"]
[null,null,null,null,null,null,799,1,32,"Real Madrid","-","VfB Stuttgart",null,":"]
[null,null,null,null,null,null,800,37,38,"AC Roma","-","FC Basel",null,":"]
[null,null,null,null,null,null,801,4,25,"Paris Saint-Germain","-","OSC Lille",null,":"]
[null,null,null,null,null,null,802,26,18,"Roter Stern Belgrad","-","AC Mailand",null,":"]
[null,null,null,null,null,null,803,19,23,"Feyenoord Rotterdam","-","Dinamo Zagreb",null,":"]
[null,null,null,null,null,null,804,21,17,"PSV Eindhoven","-","Schachtjor Donezk",null,":"]
[null,null,null,null,null,null,805,15,36,"FC Arsenal","-","Mainz 05",null,":"]
[null,null,null,null,null,null,806,33,7,"Sturm Graz","-","Borussia Dortmund",null,":"]
[null,null,null,null,null,null,807,12,34,"Atalanta Bergamo","-","Stade Brest",null,":"]
[null,null,null,null,null,null,808,35,6,"Eintracht Frankfurt","-","Inter Mailand",null,":"]
[null,null,null,null,null,null,809,5,10,"FC Liverpool","-","Bayer Leverkusen",null,":"]
[null,null,null,null,null,null,810,16,3,"FC Brügge","-","FC Bayern München",null,":"]
[null,null,null,null,null,null,811,31,22,"FC Girona","-","Celtic Glasgow",null,":"]
[null,null,null,null,null,null,812,20,11,"Sporting Lissabon","-","Atletico Madrid",null,":"]
[null,null,null,null,null,null,813,24,39,"Red Bull Salzburg","-","FC Lille",null,":"]
[null,null,null,null,null,null,814,40,2,"Hertha BSC","-","Manchester City",null,":"]
[null,null,null,null,null,null,815,9,28,"FC Barcelona","-","AS Monaco",null,":"]
[null,null,null,null,null,null,816,27,30,"Young Boys Bern","-","FC Bologna",null,":"]
[null,null,null,null,null,null,817,14,29,"Benfica Lissabon","-","Aston Villa",null,":"]
[null,null,null,null,null,null,818,13,1,"Juventus Turin","-","Real Madrid",null,":"]
[null,null,null,null,null,null,819,38,8,"FC Basel","-","RB Leipzig",null,":"]
[null,null,null,null,null,null,820,32,37,"VfB Stuttgart","-","AC Roma",null,":"]
[null,null,null,null,null,null,821,18,4,"AC Mailand","-","Paris Saint-Germain",null,":"]
[null,null,null,null,null,null,822,25,19,"OSC Lille","-","Feyenoord Rotterdam",null,":"]
[null,null,null,null,null,null,823,17,26,"Schachtjor Donezk","-","Roter Stern Belgrad",null,":"]
[null,null,null,null,null,null,824,23,15,"Dinamo Zagreb","-","FC Arsenal",null,":"]
[null,null,null,null,null,null,825,7,21,"Borussia Dortmund","-","PSV Eindhoven",null,":"]
[null,null,null,null,null,null,826,36,12,"Mainz 05","-","Atalanta Bergamo",null,":"]
[null,null,null,null,null,null,827,6,33,"Inter Mailand","-","Sturm Graz",null,":"]
[null,null,null,null,null,null,828,34,5,"Stade Brest","-","FC Liverpool",null,":"]
[null,null,null,null,null,null,829,3,35,"FC Bayern München","-","Eintracht Frankfurt",null,":"]
[null,null,null,null,null,null,830,10,31,"Bayer Leverkusen","-","FC Girona",null,":"]
[null,null,null,null,null,null,831,11,16,"Atletico Madrid","-","FC Brügge",null,":"]
[null,null,null,null,null,null,832,22,24,"Celtic Glasgow","-","Red Bull Salzburg",null,":"]
[null,null,null,null,null,null,833,2,20,"Manchester City","-","Sporting Lissabon",null,":"]
[null,null,null,null,null,null,834,39,9,{"$f":"IFERROR(VLOOKUP($H839,$B$6:$C$45,2,0),\"\")","v":"FC Lille"},"-",{"$f":"IFERROR(VLOOKUP($I839,$B$6:$C$45,2,0),\"\")","v":"FC Barcelona"},null,":"]
[null,null,null,null,null,null,835,30,40,"FC Bologna","-","Hertha BSC",null,":"]
[null,null,null,null,null,null,836,28,14,"AS Monaco","-","Benfica Lissabon",null,":"]
[null,null,null,null,null,null,837,1,27,"Real Madrid","-","Young Boys Bern",null,":"]
[null,null,null,null,null,null,838,29,38,"Aston Villa","-","FC Basel",null,":"]
[null,null,null,null,null,null,839,37,13,"AC Roma","-","Juventus Turin",null,":"]
[null,null,null,null,null,null,840,8,32,"RB Leipzig","-","VfB Stuttgart",null,":"]
[null,null,null,null,null,null,841,4,19,"Paris Saint-Germain","-","Feyenoord Rotterdam",null,":"]
[null,null,null,null,null,null,842,18,17,"AC Mailand","-","Schachtjor Donezk",null,":"]
[null,null,null,null,null,null,843,15,25,"FC Arsenal","-","OSC Lille",null,":"]
[null,null,null,null,null,null,844,26,7,"Roter Stern Belgrad","-","Borussia Dortmund",null,":"]
[null,null,null,null,null,null,845,12,23,"Atalanta Bergamo","-","Dinamo Zagreb",null,":"]
[null,null,null,null,null,null,846,21,6,"PSV Eindhoven","-","Inter Mailand",null,":"]
[null,null,null,null,null,null,847,5,36,"FC Liverpool","-","Mainz 05",null,":"]
[null,null,null,null,null,null,848,33,3,"Sturm Graz","-","FC Bayern München",null,":"]
[null,null,null,null,null,null,849,31,34,"FC Girona","-","Stade Brest",null,":"]
[null,null,null,null,null,null,850,35,11,"Eintracht Frankfurt","-","Atletico Madrid",null,":"]
[null,null,null,null,null,null,851,24,10,"Red Bull Salzburg","-","Bayer Leverkusen",null,":"]
[null,null,null,null,null,null,852,16,2,"FC Brügge","-","Manchester City",null,":"]
[null,null,null,null,null,null,853,9,22,"FC Barcelona","-","Celtic Glasgow",null,":"]
[null,null,null,null,null,null,854,20,30,"Sporting Lissabon","-","FC Bologna",null,":"]
[null,null,null,null,null,null,855,14,39,"Benfica Lissabon","-","FC Lille",null,":"]
[null,null,null,null,null,null,856,40,1,"Hertha BSC","-","Real Madrid",null,":"]
[null,null,null,null,null,null,857,38,28,"FC Basel","-","AS Monaco",null,":"]
[null,null,null,null,null,null,858,27,37,"Young Boys Bern","-","AC Roma",null,":"]
[null,null,null,null,null,null,859,32,29,"VfB Stuttgart","-","Aston Villa",null,":"]
[null,null,null,null,null,null,860,13,8,"Juventus Turin","-","RB Leipzig",null,":"]
[null,null,null,null,null,null,861,17,4,"Schachtjor Donezk","-","Paris Saint-Germain",null,":"]
[null,null,null,null,null,null,862,19,15,"Feyenoord Rotterdam","-","FC Arsenal",null,":"]
[null,null,null,null,null,null,863,7,18,"Borussia Dortmund","-","AC Mailand",null,":"]
[null,null,null,null,null,null,864,25,12,"OSC Lille","-","Atalanta Bergamo",null,":"]
[null,null,null,null,null,null,865,6,26,"Inter Mailand","-","Roter Stern Belgrad",null,":"]
[null,null,null,null,null,null,866,23,5,"Dinamo Zagreb","-","FC Liverpool",null,":"]
[null,null,null,null,null,null,867,3,21,"FC Bayern München","-","PSV Eindhoven",null,":"]
[null,null,null,null,null,null,868,36,31,"Mainz 05","-","FC Girona",null,":"]
[null,null,null,null,null,null,869,11,33,"Atletico Madrid","-","Sturm Graz",null,":"]
[null,null,null,null,null,null,870,34,24,"Stade Brest","-","Red Bull Salzburg",null,":"]
[null,null,null,null,null,null,871,2,35,"Manchester City","-","Eintracht Frankfurt",null,":"]
[null,null,null,null,null,null,872,10,9,"Bayer Leverkusen","-","FC Barcelona",null,":"]
[null,null,null,null,null,null,873,30,16,"FC Bologna","-","FC Brügge",null,":"]
[null,null,null,null,null,null,874,22,14,"Celtic Glasgow","-","Benfica Lissabon",null,":"]
[null,null,null,null,null,null,875,1,20,"Real Madrid","-","Sporting Lissabon",null,":"]
[null,null,null,null,null,null,876,39,38,"FC Lille","-","FC Basel",null,":"]
[null,null,null,null,null,null,877,37,40,"AC Roma","-","Hertha BSC",null,":"]
[null,null,null,null,null,null,878,28,32,"AS Monaco","-","VfB Stuttgart",null,":"]
[null,null,null,null,null,null,879,8,27,"RB Leipzig","-","Young Boys Bern",null,":"]
[null,null,null,null,null,null,880,29,13,"Aston Villa","-","Juventus Turin",null,":"]
[null,null,null,null,null,null,881,4,15,"Paris Saint-Germain","-","FC Arsenal",null,":"]
[null,null,null,null,null,null,882,17,7,"Schachtjor Donezk","-","Borussia Dortmund",null,":"]
[null,null,null,null,null,null,883,12,19,"Atalanta Bergamo","-","Feyenoord Rotterdam",null,":"]
[null,null,null,null,null,null,884,18,6,"AC Mailand","-","Inter Mailand",null,":"]
[null,null,null,null,null,null,885,5,25,"FC Liverpool","-","OSC Lille",null,":"]
[null,null,null,null,null,null,886,26,3,"Roter Stern Belgrad","-","FC Bayern München",null,":"]
[null,null,null,null,null,null,887,31,23,"FC Girona","-","Dinamo Zagreb",null,":"]
[null,null,null,null,null,null,888,21,11,"PSV Eindhoven","-","Atletico Madrid",null,":"]
[null,null,null,null,null,null,889,24,36,"Red Bull Salzburg","-","Mainz 05",null,":"]
[null,null,null,null,null,null,890,33,2,"Sturm Graz","-","Manchester City",null,":"]
[null,null,null,null,null,null,891,9,34,"FC Barcelona","-","Stade Brest",null,":"]
[null,null,null,null,null,null,892,35,30,"Eintracht Frankfurt","-","FC Bologna",null,":"]
[null,null,null,null,null,null,893,14,10,"Benfica Lissabon","-","Bayer Leverkusen",null,":"]
[null,null,null,null,null,null,894,16,1,"FC Brügge","-","Real Madrid",null,":"]
[null,null,null,null,null,null,895,38,22,"FC Basel","-","Celtic Glasgow",null,":"]
[null,null,null,null,null,null,896,20,37,"Sporting Lissabon","-","AC Roma",null,":"]
[null,null,null,null,null,null,897,32,39,"VfB Stuttgart","-","FC Lille",null,":"]
[null,null,null,null,null,null,898,40,8,{"$f":"IFERROR(VLOOKUP($H903,$B$6:$C$45,2,0),\"\")","v":"Hertha BSC"},"-",{"$f":"IFERROR(VLOOKUP($I903,$B$6:$C$45,2,0),\"\")","v":"RB Leipzig"},null,":"]
[null,null,null,null,null,null,899,13,28,"Juventus Turin","-","AS Monaco",null,":"]
[null,null,null,null,null,null,900,27,29,"Young Boys Bern","-","Aston Villa",null,":"]
[null,null,null,null,null,null,901,7,4,"Borussia Dortmund","-","Paris Saint-Germain",null,":"]
[null,null,null,null,null,null,902,15,12,"FC Arsenal","-","Atalanta Bergamo",null,":"]
[null,null,null,null,null,null,903,6,17,"Inter Mailand","-","Schachtjor Donezk",null,":"]
[null,null,null,null,null,null,904,19,5,"Feyenoord Rotterdam","-","FC Liverpool",null,":"]
[null,null,null,null,null,null,905,3,18,"FC Bayern München","-","AC Mailand",null,":"]
[null,null,null,null,null,null,906,25,31,"OSC Lille","-","FC Girona",null,":"]
[null,null,null,null,null,null,907,11,26,"Atletico Madrid","-","Roter Stern Belgrad",null,":"]
[null,null,null,null,null,null,908,23,24,"Dinamo Zagreb","-","Red Bull Salzburg",null,":"]
[null,null,null,null,null,null,909,2,21,"Manchester City","-","PSV Eindhoven",null,":"]
[null,null,null,null,null,null,910,36,9,"Mainz 05","-","FC Barcelona",null,":"]
[null,null,null,null,null,null,911,30,33,"FC Bologna","-","Sturm Graz",null,":"]
[null,null,null,null,null,null,912,34,14,"Stade Brest","-","Benfica Lissabon",null,":"]
[null,null,null,null,null,null,913,1,35,"Real Madrid","-","Eintracht Frankfurt",null,":"]
[null,null,null,null,null,null,914,10,38,"Bayer Leverkusen","-","FC Basel",null,":"]
[null,null,null,null,null,null,915,37,16,"AC Roma","-","FC Brügge",null,":"]
[null,null,null,null,null,null,916,22,32,"Celtic Glasgow","-","VfB Stuttgart",null,":"]
[null,null,null,null,null,null,917,8,20,"RB Leipzig","-","Sporting Lissabon",null,":"]
[null,null,null,null,null,null,918,39,13,"FC Lille","-","Juventus Turin",null,":"]
[null,null,null,null,null,null,919,29,40,"Aston Villa","-","Hertha BSC",null,":"]
[null,null,null,null,null,null,920,28,27,"AS Monaco","-","Young Boys Bern",null,":"]
[null,null,null,null,null,null,921,4,12,"Paris Saint-Germain","-","Atalanta Bergamo",null,":"]
[null,null,null,null,null,null,922,7,6,"Borussia Dortmund","-","Inter Mailand",null,":"]
[null,null,null,null,null,null,923,5,15,"FC Liverpool","-","FC Arsenal",null,":"]
[null,null,null,null,null,null,924,17,3,"Schachtjor Donezk","-","FC Bayern München",null,":"]
[null,null,null,null,null,null,925,31,19,"FC Girona","-","Feyenoord Rotterdam",null,":"]
[null,null,null,null,null,null,926,18,11,"AC Mailand","-","Atletico Madrid",null,":"]
[null,null,null,null,null,null,927,24,25,"Red Bull Salzburg","-","OSC Lille",null,":"]
[null,null,null,null,null,null,928,26,2,"Roter Stern Belgrad","-","Manchester City",null,":"]
[null,null,null,null,null,null,929,9,23,"FC Barcelona","-","Dinamo Zagreb",null,":"]
[null,null,null,null,null,null,930,21,30,"PSV Eindhoven","-","FC Bologna",null,":"]
[null,null,null,null,null,null,931,14,36,"Benfica Lissabon","-","Mainz 05",null,":"]
[null,null,null,null,null,null,932,33,1,"Sturm Graz","-","Real Madrid",null,":"]
[null,null,null,null,null,null,933,38,34,"FC Basel","-","Stade Brest",null,":"]
[null,null,null,null,null,null,934,35,37,"Eintracht Frankfurt","-","AC Roma",null,":"]
[null,null,null,null,null,null,935,32,10,"VfB Stuttgart","-","Bayer Leverkusen",null,":"]
[null,null,null,null,null,null,936,16,8,"FC Brügge","-","RB Leipzig",null,":"]
[null,null,null,null,null,null,937,13,22,"Juventus Turin","-","Celtic Glasgow",null,":"]
[null,null,null,null,null,null,938,20,29,"Sporting Lissabon","-","Aston Villa",null,":"]
[null,null,null,null,null,null,939,27,39,"Young Boys Bern","-","FC Lille",null,":"]
[null,null,null,null,null,null,940,40,28,"Hertha BSC","-","AS Monaco",null,":"]
[null,null,null,null,null,null,941,6,4,"Inter Mailand","-","Paris Saint-Germain",null,":"]
[null,null,null,null,null,null,942,12,5,"Atalanta Bergamo","-","FC Liverpool",null,":"]
[null,null,null,null,null,null,943,3,7,"FC Bayern München","-","Borussia Dortmund",null,":"]
[null,null,null,null,null,null,944,15,31,"FC Arsenal","-","FC Girona",null,":"]
[null,null,null,null,null,null,945,11,17,"Atletico Madrid","-","Schachtjor Donezk",null,":"]
[null,null,null,null,null,null,946,19,24,"Feyenoord Rotterdam","-","Red Bull Salzburg",null,":"]
[null,null,null,null,null,null,947,2,18,"Manchester City","-","AC Mailand",null,":"]
[null,null,null,null,null,null,948,25,9,"OSC Lille","-","FC Barcelona",null,":"]
[null,null,null,null,null,null,949,30,26,"FC Bologna","-","Roter Stern Belgrad",null,":"]
[null,null,null,null,null,null,950,23,14,"Dinamo Zagreb","-","Benfica Lissabon",null,":"]
[null,null,null,null,null,null,951,1,21,"Real Madrid","-","PSV Eindhoven",null,":"]
[null,null,null,null,null,null,952,36,38,"Mainz 05","-","FC Basel",null,":"]
[null,null,null,null,null,null,953,37,33,"AC Roma","-","Sturm Graz",null,":"]
[null,null,null,null,null,null,954,34,32,"Stade Brest","-","VfB Stuttgart",null,":"]
[null,null,null,null,null,null,955,8,35,"RB Leipzig","-","Eintracht Frankfurt",null,":"]
[null,null,null,null,null,null,956,10,13,"Bayer Leverkusen","-","Juventus Turin",null,":"]
[null,null,null,null,null,null,957,29,16,"Aston Villa","-","FC Brügge",null,":"]
[null,null,null,null,null,null,958,22,27,"Celtic Glasgow","-","Young Boys Bern",null,":"]
[null,null,null,null,null,null,959,28,20,"AS Monaco","-","Sporting Lissabon",null,":"]
[null,null,null,null,null,null,960,39,40,"FC Lille","-","Hertha BSC",null,":"]
[null,null,null,null,null,null,961,4,5,"Paris Saint-Germain","-","FC Liverpool",null,":"]
[null,null,null,null,null,null,962,6,3,{"$f":"IFERROR(VLOOKUP($H967,$B$6:$C$45,2,0),\"\")","v":"Inter Mailand"},"-",{"$f":"IFERROR(VLOOKUP($I967,$B$6:$C$45,2,0),\"\")","v":"FC Bayern München"},null,":"]
[null,null,null,null,null,null,963,31,12,"FC Girona","-","Atalanta Bergamo",null,":"]
[null,null,null,null,null,null,964,7,11,"Borussia Dortmund","-","Atletico Madrid",null,":"]
[null,null,null,null,null,null,965,24,15,"Red Bull Salzburg","-","FC Arsenal",null,":"]
[null,null,null,null,null,null,966,17,2,"Schachtjor Donezk","-","Manchester City",null,":"]
[null,null,null,null,null,null,967,9,19,"FC Barcelona","-","Feyenoord Rotterdam",null,":"]
[null,null,null,null,null,null,968,18,30,"AC Mailand","-","FC Bologna",null,":"]
[null,null,null,null,null,null,969,14,25,"Benfica Lissabon","-","OSC Lille",null,":"]
[null,null,null,null,null,null,970,26,1,"Roter Stern Belgrad","-","Real Madrid",null,":"]
[null,null,null,null,null,null,971,38,23,"FC Basel","-","Dinamo Zagreb",null,":"]
[null,null,null,null,null,null,972,21,37,"PSV Eindhoven","-","AC Roma",null,":"]
[null,null,null,null,null,null,973,32,36,"VfB Stuttgart","-","Mainz 05",null,":"]
[null,null,null,null,null,null,974,33,8,"Sturm Graz","-","RB Leipzig",null,":"]
[null,null,null,null,null,null,975,13,34,"Juventus Turin","-","Stade Brest",null,":"]
[null,null,null,null,null,null,976,35,29,"Eintracht Frankfurt","-","Aston Villa",null,":"]
[null,null,null,null,null,null,977,27,10,"Young Boys Bern","-","Bayer Leverkusen",null,":"]
[null,null,null,null,null,null,978,16,28,"FC Brügge","-","AS Monaco",null,":"]
[null,null,null,null,null,null,979,40,22,"Hertha BSC","-","Celtic Glasgow",null,":"]
[null,null,null,null,null,null,980,20,39,"Sporting Lissabon","-","FC Lille",null,":"]
[null,null,null,null,null,null,981,3,4,"FC Bayern München","-","Paris Saint-Germain",null,":"]
[null,null,null,null,null,null,982,5,31,"FC Liverpool","-","FC Girona",null,":"]
[null,null,null,null,null,null,983,11,6,"Atletico Madrid","-","Inter Mailand",null,":"]
[null,null,null,null,null,null,984,12,24,"Atalanta Bergamo","-","Red Bull Salzburg",null,":"]
[null,null,null,null,null,null,985,2,7,"Manchester City","-","Borussia Dortmund",null,":"]
[null,null,null,null,null,null,986,15,9,"FC Arsenal","-","FC Barcelona",null,":"]
[null,null,null,null,null,null,987,30,17,"FC Bologna","-","Schachtjor Donezk",null,":"]
[null,null,null,null,null,null,988,19,14,"Feyenoord Rotterdam","-","Benfica Lissabon",null,":"]
[null,null,null,null,null,null,989,1,18,"Real Madrid","-","AC Mailand",null,":"]
[null,null,null,null,null,null,990,25,38,"OSC Lille","-","FC Basel",null,":"]
[null,null,null,null,null,null,991,37,26,"AC Roma","-","Roter Stern Belgrad",null,":"]
[null,null,null,null,null,null,992,23,32,"Dinamo Zagreb","-","VfB Stuttgart",null,":"]
[null,null,null,null,null,null,993,8,21,"RB Leipzig","-","PSV Eindhoven",null,":"]
[null,null,null,null,null,null,994,36,13,"Mainz 05","-","Juventus Turin",null,":"]
[null,null,null,null,null,null,995,29,33,"Aston Villa","-","Sturm Graz",null,":"]
[null,null,null,null,null,null,996,34,27,"Stade Brest","-","Young Boys Bern",null,":"]
[null,null,null,null,null,null,997,28,35,"AS Monaco","-","Eintracht Frankfurt",null,":"]
[null,null,null,null,null,null,998,10,40,"Bayer Leverkusen","-","Hertha BSC",null,":"]
[null,null,null,null,null,null,999,39,16,"FC Lille","-","FC Brügge",null,":"]
[null,null,null,null,null,null,1000,22,20,"Celtic Glasgow","-","Sporting Lissabon",null,":"]
[null,null,null,null,null,null,1001,4,31,"Paris Saint-Germain","-","FC Girona",null,":"]
[null,null,null,null,null,null,1002,3,11,"FC Bayern München","-","Atletico Madrid",null,":"]
[null,null,null,null,null,null,1003,24,5,"Red Bull Salzburg","-","FC Liverpool",null,":"]
[null,null,null,null,null,null,1004,6,2,"Inter Mailand","-","Manchester City",null,":"]
[null,null,null,null,null,null,1005,9,12,"FC Barcelona","-","Atalanta Bergamo",null,":"]
[null,null,null,null,null,null,1006,7,30,"Borussia Dortmund","-","FC Bologna",null,":"]
[null,null,null,null,null,null,1007,14,15,"Benfica Lissabon","-","FC Arsenal",null,":"]
[null,null,null,null,null,null,1008,17,1,"Schachtjor Donezk","-","Real Madrid",null,":"]
[null,null,null,null,null,null,1009,38,19,"FC Basel","-","Feyenoord Rotterdam",null,":"]
[null,null,null,null,null,null,1010,18,37,"AC Mailand","-","AC Roma",null,":"]
[null,null,null,null,null,null,1011,32,25,"VfB Stuttgart","-","OSC Lille",null,":"]
[null,null,null,null,null,null,1012,26,8,"Roter Stern Belgrad","-","RB Leipzig",null,":"]
[null,null,null,null,null,null,1013,13,23,"Juventus Turin","-","Dinamo Zagreb",null,":"]
[null,null,null,null,null,null,1014,21,29,"PSV Eindhoven","-","Aston Villa",null,":"]
[null,null,null,null,null,null,1015,27,36,"Young Boys Bern","-","Mainz 05",null,":"]
[null,null,null,null,null,null,1016,33,28,"Sturm Graz","-","AS Monaco",null,":"]
[null,null,null,null,null,null,1017,40,34,"Hertha BSC","-","Stade Brest",null,":"]
[null,null,null,null,null,null,1018,35,39,"Eintracht Frankfurt","-","FC Lille",null,":"]
[null,null,null,null,null,null,1019,20,10,"Sporting Lissabon","-","Bayer Leverkusen",null,":"]
[null,null,null,null,null,null,1020,16,22,"FC Brügge","-","Celtic Glasgow",null,":"]
[null,null,null,null,null,null,1021,11,4,"Atletico Madrid","-","Paris Saint-Germain",null,":"]
[null,null,null,null,null,null,1022,31,24,"FC Girona","-","Red Bull Salzburg",null,":"]
[null,null,null,null,null,null,1023,2,3,"Manchester City","-","FC Bayern München",null,":"]
[null,null,null,null,null,null,1024,5,9,"FC Liverpool","-","FC Barcelona",null,":"]
[null,null,null,null,null,null,1025,30,6,"FC Bologna","-","Inter Mailand",null,":"]
[null,null,null,null,null,null,1026,12,14,{"$f":"IFERROR(VLOOKUP($H1031,$B$6:$C$45,2,0),\"\")","v":"Atalanta Bergamo"},"-",{"$f":"IFERROR(VLOOKUP($I1031,$B$6:$C$45,2,0),\"\")","v":"Benfica Lissabon"},null,":"]
[null,null,null,null,null,null,1027,1,7,"Real Madrid","-","Borussia Dortmund",null,":"]
[null,null,null,null,null,null,1028,15,38,"FC Arsenal","-","FC Basel",null,":"]
[null,null,null,null,null,null,1029,37,17,"AC Roma","-","Schachtjor Donezk",null,":"]
[null,null,null,null,null,null,1030,19,32,"Feyenoord Rotterdam","-","VfB Stuttgart",null,":"]
[null,null,null,null,null,null,1031,8,18,"RB Leipzig","-","AC Mailand",null,":"]
[null,null,null,null,null,null,1032,25,13,"OSC Lille","-","Juventus Turin",null,":"]
[null,null,null,null,null,null,1033,29,26,"Aston Villa","-","Roter Stern Belgrad",null,":"]
[null,null,null,null,null,null,1034,23,27,"Dinamo Zagreb","-","Young Boys Bern",null,":"]
[null,null,null,null,null,null,1035,28,21,"AS Monaco","-","PSV Eindhoven",null,":"]
[null,null,null,null,null,null,1036,36,40,"Mainz 05","-","Hertha BSC",null,":"]
[null,null,null,null,null,null,1037,39,33,"FC Lille","-","Sturm Graz",null,":"]
[null,null,null,null,null,null,1038,34,20,"Stade Brest","-","Sporting Lissabon",null,":"]
[null,null,null,null,null,null,1039,22,35,"Celtic Glasgow","-","Eintracht Frankfurt",null,":"]
[null,null,null,null,null,null,1040,10,16,"Bayer Leverkusen","-","FC Brügge",null,":"]
[null,null,null,null,null,null,1041,4,24,"Paris Saint-Germain","-","Red Bull Salzburg",null,":"]
[null,null,null,null,null,null,1042,11,2,"Atletico Madrid","-","Manchester City",null,":"]
[null,null,null,null,null,null,1043,9,31,"FC Barcelona","-","FC Girona",null,":"]
[null,null,null,null,null,null,1044,3,30,"FC Bayern München","-","FC Bologna",null,":"]
[null,null,null,null,null,null,1045,14,5,"Benfica Lissabon","-","FC Liverpool",null,":"]
[null,null,null,null,null,null,1046,6,1,"Inter Mailand","-","Real Madrid",null,":"]
[null,null,null,null,null,null,1047,38,12,"FC Basel","-","Atalanta Bergamo",null,":"]
[null,null,null,null,null,null,1048,7,37,"Borussia Dortmund","-","AC Roma",null,":"]
[null,null,null,null,null,null,1049,32,15,"VfB Stuttgart","-","FC Arsenal",null,":"]
[null,null,null,null,null,null,1050,17,8,"Schachtjor Donezk","-","RB Leipzig",null,":"]
[null,null,null,null,null,null,1051,13,19,"Juventus Turin","-","Feyenoord Rotterdam",null,":"]
[null,null,null,null,null,null,1052,18,29,"AC Mailand","-","Aston Villa",null,":"]
[null,null,null,null,null,null,1053,27,25,"Young Boys Bern","-","OSC Lille",null,":"]
[null,null,null,null,null,null,1054,26,28,"Roter Stern Belgrad","-","AS Monaco",null,":"]
[null,null,null,null,null,null,1055,40,23,"Hertha BSC","-","Dinamo Zagreb",null,":"]
[null,null,null,null,null,null,1056,21,39,"PSV Eindhoven","-","FC Lille",null,":"]
[null,null,null,null,null,null,1057,20,36,"Sporting Lissabon","-","Mainz 05",null,":"]
[null,null,null,null,null,null,1058,33,22,"Sturm Graz","-","Celtic Glasgow",null,":"]
[null,null,null,null,null,null,1059,16,34,"FC Brügge","-","Stade Brest",null,":"]
[null,null,null,null,null,null,1060,35,10,"Eintracht Frankfurt","-","Bayer Leverkusen",null,":"]
[null,null,null,null,null,null,1061,2,4,"Manchester City","-","Paris Saint-Germain",null,":"]
[null,null,null,null,null,null,1062,24,9,"Red Bull Salzburg","-","FC Barcelona",null,":"]
[null,null,null,null,null,null,1063,30,11,"FC Bologna","-","Atletico Madrid",null,":"]
[null,null,null,null,null,null,1064,31,14,"FC Girona","-","Benfica Lissabon",null,":"]
[null,null,null,null,null,null,1065,1,3,"Real Madrid","-","FC Bayern München",null,":"]
[null,null,null,null,null,null,1066,5,38,"FC Liverpool","-","FC Basel",null,":"]
[null,null,null,null,null,null,1067,37,6,"AC Roma","-","Inter Mailand",null,":"]
[null,null,null,null,null,null,1068,12,32,"Atalanta Bergamo","-","VfB Stuttgart",null,":"]
[null,null,null,null,null,null,1069,8,7,"RB Leipzig","-","Borussia Dortmund",null,":"]
[null,null,null,null,null,null,1070,15,13,"FC Arsenal","-","Juventus Turin",null,":"]
[null,null,null,null,null,null,1071,29,17,"Aston Villa","-","Schachtjor Donezk",null,":"]
[null,null,null,null,null,null,1072,19,27,"Feyenoord Rotterdam","-","Young Boys Bern",null,":"]
[null,null,null,null,null,null,1073,28,18,"AS Monaco","-","AC Mailand",null,":"]
[null,null,null,null,null,null,1074,25,40,"OSC Lille","-","Hertha BSC",null,":"]
[null,null,null,null,null,null,1075,39,26,"FC Lille","-","Roter Stern Belgrad",null,":"]
[null,null,null,null,null,null,1076,23,20,"Dinamo Zagreb","-","Sporting Lissabon",null,":"]
[null,null,null,null,null,null,1077,22,21,"Celtic Glasgow","-","PSV Eindhoven",null,":"]
[null,null,null,null,null,null,1078,36,16,"Mainz 05","-","FC Brügge",null,":"]
[null,null,null,null,null,null,1079,10,33,"Bayer Leverkusen","-","Sturm Graz",null,":"]
[null,null,null,null,null,null,1080,34,35,"Stade Brest","-","Eintracht Frankfurt",null,":"]
[null,null,null,null,null,null,1081,4,9,"Paris Saint-Germain","-","FC Barcelona",null,":"]
[null,null,null,null,null,null,1082,2,30,"Manchester City","-","FC Bologna",null,":"]
[null,null,null,null,null,null,1083,14,24,"Benfica Lissabon","-","Red Bull Salzburg",null,":"]
[null,null,null,null,null,null,1084,11,1,"Atletico Madrid","-","Real Madrid",null,":"]
[null,null,null,null,null,null,1085,38,31,"FC Basel","-","FC Girona",null,":"]
[null,null,null,null,null,null,1086,3,37,"FC Bayern München","-","AC Roma",null,":"]
[null,null,null,null,null,null,1087,32,5,"VfB Stuttgart","-","FC Liverpool",null,":"]
[null,null,null,null,null,null,1088,6,8,"Inter Mailand","-","RB Leipzig",null,":"]
[null,null,null,null,null,null,1089,13,12,"Juventus Turin","-","Atalanta Bergamo",null,":"]
[null,null,null,null,null,null,1090,7,29,{"$f":"IFERROR(VLOOKUP($H1095,$B$6:$C$45,2,0),\"\")","v":"Borussia Dortmund"},"-",{"$f":"IFERROR(VLOOKUP($I1095,$B$6:$C$45,2,0),\"\")","v":"Aston Villa"},null,":"]
[null,null,null,null,null,null,1091,27,15,"Young Boys Bern","-","FC Arsenal",null,":"]
[null,null,null,null,null,null,1092,17,28,"Schachtjor Donezk","-","AS Monaco",null,":"]
[null,null,null,null,null,null,1093,40,19,"Hertha BSC","-","Feyenoord Rotterdam",null,":"]
[null,null,null,null,null,null,1094,18,39,"AC Mailand","-","FC Lille",null,":"]
[null,null,null,null,null,null,1095,20,25,"Sporting Lissabon","-","OSC Lille",null,":"]
[null,null,null,null,null,null,1096,26,22,"Roter Stern Belgrad","-","Celtic Glasgow",null,":"]
[null,null,null,null,null,null,1097,16,23,"FC Brügge","-","Dinamo Zagreb",null,":"]
[null,null,null,null,null,null,1098,21,10,"PSV Eindhoven","-","Bayer Leverkusen",null,":"]
[null,null,null,null,null,null,1099,35,36,"Eintracht Frankfurt","-","Mainz 05",null,":"]
[null,null,null,null,null,null,1100,33,34,"Sturm Graz","-","Stade Brest",null,":"]
[null,null,null,null,null,null,1101,30,4,"FC Bologna","-","Paris Saint-Germain",null,":"]
[null,null,null,null,null,null,1102,9,14,"FC Barcelona","-","Benfica Lissabon",null,":"]
[null,null,null,null,null,null,1103,1,2,"Real Madrid","-","Manchester City",null,":"]
[null,null,null,null,null,null,1104,24,38,"Red Bull Salzburg","-","FC Basel",null,":"]
[null,null,null,null,null,null,1105,37,11,"AC Roma","-","Atletico Madrid",null,":"]
[null,null,null,null,null,null,1106,31,32,"FC Girona","-","VfB Stuttgart",null,":"]
[null,null,null,null,null,null,1107,8,3,"RB Leipzig","-","FC Bayern München",null,":"]
[null,null,null,null,null,null,1108,5,13,"FC Liverpool","-","Juventus Turin",null,":"]
[null,null,null,null,null,null,1109,29,6,"Aston Villa","-","Inter Mailand",null,":"]
[null,null,null,null,null,null,1110,12,27,"Atalanta Bergamo","-","Young Boys Bern",null,":"]
[null,null,null,null,null,null,1111,28,7,"AS Monaco","-","Borussia Dortmund",null,":"]
[null,null,null,null,null,null,1112,15,40,"FC Arsenal","-","Hertha BSC",null,":"]
[null,null,null,null,null,null,1113,39,17,"FC Lille","-","Schachtjor Donezk",null,":"]
[null,null,null,null,null,null,1114,19,20,"Feyenoord Rotterdam","-","Sporting Lissabon",null,":"]
[null,null,null,null,null,null,1115,22,18,"Celtic Glasgow","-","AC Mailand",null,":"]
[null,null,null,null,null,null,1116,25,16,"OSC Lille","-","FC Brügge",null,":"]
[null,null,null,null,null,null,1117,10,26,"Bayer Leverkusen","-","Roter Stern Belgrad",null,":"]
[null,null,null,null,null,null,1118,23,35,"Dinamo Zagreb","-","Eintracht Frankfurt",null,":"]
[null,null,null,null,null,null,1119,34,21,"Stade Brest","-","PSV Eindhoven",null,":"]
[null,null,null,null,null,null,1120,36,33,"Mainz 05","-","Sturm Graz",null,":"]
[null,null,null,null,null,null,1121,4,14,"Paris Saint-Germain","-","Benfica Lissabon",null,":"]
[null,null,null,null,null,null,1122,30,1,"FC Bologna","-","Real Madrid",null,":"]
[null,null,null,null,null,null,1123,38,9,"FC Basel","-","FC Barcelona",null,":"]
[null,null,null,null,null,null,1124,2,37,"Manchester City","-","AC Roma",null,":"]
[null,null,null,null,null,null,1125,32,24,"VfB Stuttgart","-","Red Bull Salzburg",null,":"]
[null,null,null,null,null,null,1126,11,8,"Atletico Madrid","-","RB Leipzig",null,":"]
[null,null,null,null,null,null,1127,13,31,"Juventus Turin","-","FC Girona",null,":"]
[null,null,null,null,null,null,1128,3,29,"FC Bayern München","-","Aston Villa",null,":"]
[null,null,null,null,null,null,1129,27,5,"Young Boys Bern","-","FC Liverpool",null,":"]
[null,null,null,null,null,null,1130,6,28,"Inter Mailand","-","AS Monaco",null,":"]
[null,null,null,null,null,null,1131,40,12,"Hertha BSC","-","Atalanta Bergamo",null,":"]
[null,null,null,null,null,null,1132,7,39,"Borussia Dortmund","-","FC Lille",null,":"]
[null,null,null,null,null,null,1133,20,15,"Sporting Lissabon","-","FC Arsenal",null,":"]
[null,null,null,null,null,null,1134,17,22,"Schachtjor Donezk","-","Celtic Glasgow",null,":"]
[null,null,null,null,null,null,1135,16,19,"FC Brügge","-","Feyenoord Rotterdam",null,":"]
[null,null,null,null,null,null,1136,18,10,"AC Mailand","-","Bayer Leverkusen",null,":"]
[null,null,null,null,null,null,1137,35,25,"Eintracht Frankfurt","-","OSC Lille",null,":"]
[null,null,null,null,null,null,1138,26,34,"Roter Stern Belgrad","-","Stade Brest",null,":"]
[null,null,null,null,null,null,1139,33,23,"Sturm Graz","-","Dinamo Zagreb",null,":"]
[null,null,null,null,null,null,1140,21,36,"PSV Eindhoven","-","Mainz 05",null,":"]
[null,null,null,null,null,null,1141,1,4,"Real Madrid","-","Paris Saint-Germain",null,":"]
[null,null,null,null,null,null,1142,14,38,"Benfica Lissabon","-","FC Basel",null,":"]
[null,null,null,null,null,null,1143,37,30,"AC Roma","-","FC Bologna",null,":"]
[null,null,null,null,null,null,1144,9,32,"FC Barcelona","-","VfB Stuttgart",null,":"]
[null,null,null,null,null,null,1145,8,2,"RB Leipzig","-","Manchester City",null,":"]
[null,null,null,null,null,null,1146,24,13,"Red Bull Salzburg","-","Juventus Turin",null,":"]
[null,null,null,null,null,null,1147,29,11,"Aston Villa","-","Atletico Madrid",null,":"]
[null,null,null,null,null,null,1148,31,27,"FC Girona","-","Young Boys Bern",null,":"]
[null,null,null,null,null,null,1149,28,3,"AS Monaco","-","FC Bayern München",null,":"]
[null,null,null,null,null,null,1150,5,40,"FC Liverpool","-","Hertha BSC",null,":"]
[null,null,null,null,null,null,1151,39,6,"FC Lille","-","Inter Mailand",null,":"]
[null,null,null,null,null,null,1152,12,20,"Atalanta Bergamo","-","Sporting Lissabon",null,":"]
[null,null,null,null,null,null,1153,22,7,"Celtic Glasgow","-","Borussia Dortmund",null,":"]
[null,null,null,null,null,null,1154,15,16,{"$f":"IFERROR(VLOOKUP($H1159,$B$6:$C$45,2,0),\"\")","v":"FC Arsenal"},"-",{"$f":"IFERROR(VLOOKUP($I1159,$B$6:$C$45,2,0),\"\")","v":"FC Brügge"},null,":"]
[null,null,null,null,null,null,1155,10,17,"Bayer Leverkusen","-","Schachtjor Donezk",null,":"]
[null,null,null,null,null,null,1156,19,35,"Feyenoord Rotterdam","-","Eintracht Frankfurt",null,":"]
[null,null,null,null,null,null,1157,34,18,"Stade Brest","-","AC Mailand",null,":"]
[null,null,null,null,null,null,1158,25,33,"OSC Lille","-","Sturm Graz",null,":"]
[null,null,null,null,null,null,1159,36,26,"Mainz 05","-","Roter Stern Belgrad",null,":"]
[null,null,null,null,null,null,1160,23,21,"Dinamo Zagreb","-","PSV Eindhoven",null,":"]
[null,null,null,null,null,null,1161,4,38,"Paris Saint-Germain","-","FC Basel",null,":"]
[null,null,null,null,null,null,1162,1,37,"Real Madrid","-","AC Roma",null,":"]
[null,null,null,null,null,null,1163,32,14,"VfB Stuttgart","-","Benfica Lissabon",null,":"]
[null,null,null,null,null,null,1164,30,8,"FC Bologna","-","RB Leipzig",null,":"]
[null,null,null,null,null,null,1165,13,9,"Juventus Turin","-","FC Barcelona",null,":"]
[null,null,null,null,null,null,1166,2,29,"Manchester City","-","Aston Villa",null,":"]
[null,null,null,null,null,null,1167,27,24,"Young Boys Bern","-","Red Bull Salzburg",null,":"]
[null,null,null,null,null,null,1168,11,28,"Atletico Madrid","-","AS Monaco",null,":"]
[null,null,null,null,null,null,1169,40,31,"Hertha BSC","-","FC Girona",null,":"]
[null,null,null,null,null,null,1170,3,39,"FC Bayern München","-","FC Lille",null,":"]
[null,null,null,null,null,null,1171,20,5,"Sporting Lissabon","-","FC Liverpool",null,":"]
[null,null,null,null,null,null,1172,6,22,"Inter Mailand","-","Celtic Glasgow",null,":"]
[null,null,null,null,null,null,1173,16,12,"FC Brügge","-","Atalanta Bergamo",null,":"]
[null,null,null,null,null,null,1174,7,10,"Borussia Dortmund","-","Bayer Leverkusen",null,":"]
[null,null,null,null,null,null,1175,35,15,"Eintracht Frankfurt","-","FC Arsenal",null,":"]
[null,null,null,null,null,null,1176,17,34,"Schachtjor Donezk","-","Stade Brest",null,":"]
[null,null,null,null,null,null,1177,33,19,"Sturm Graz","-","Feyenoord Rotterdam",null,":"]
[null,null,null,null,null,null,1178,18,36,"AC Mailand","-","Mainz 05",null,":"]
[null,null,null,null,null,null,1179,21,25,"PSV Eindhoven","-","OSC Lille",null,":"]
[null,null,null,null,null,null,1180,26,23,"Roter Stern Belgrad","-","Dinamo Zagreb",null,":"]
[null,null,null,null,null,null,1181,37,4,"AC Roma","-","Paris Saint-Germain",null,":"]
[null,null,null,null,null,null,1182,38,32,"FC Basel","-","VfB Stuttgart",null,":"]
[null,null,null,null,null,null,1183,8,1,"RB Leipzig","-","Real Madrid",null,":"]
[null,null,null,null,null,null,1184,14,13,"Benfica Lissabon","-","Juventus Turin",null,":"]
[null,null,null,null,null,null,1185,29,30,"Aston Villa","-","FC Bologna",null,":"]
[null,null,null,null,null,null,1186,9,27,"FC Barcelona","-","Young Boys Bern",null,":"]
[null,null,null,null,null,null,1187,28,2,"AS Monaco","-","Manchester City",null,":"]
[null,null,null,null,null,null,1188,24,40,"Red Bull Salzburg","-","Hertha BSC",null,":"]
[null,null,null,null,null,null,1189,39,11,"FC Lille","-","Atletico Madrid",null,":"]
[null,null,null,null,null,null,1190,31,20,"FC Girona","-","Sporting Lissabon",null,":"]
[null,null,null,null,null,null,1191,22,3,"Celtic Glasgow","-","FC Bayern München",null,":"]
[null,null,null,null,null,null,1192,5,16,"FC Liverpool","-","FC Brügge",null,":"]
[null,null,null,null,null,null,1193,10,6,"Bayer Leverkusen","-","Inter Mailand",null,":"]
[null,null,null,null,null,null,1194,12,35,"Atalanta Bergamo","-","Eintracht Frankfurt",null,":"]
[null,null,null,null,null,null,1195,34,7,"Stade Brest","-","Borussia Dortmund",null,":"]
[null,null,null,null,null,null,1196,15,33,"FC Arsenal","-","Sturm Graz",null,":"]
[null,null,null,null,null,null,1197,36,17,"Mainz 05","-","Schachtjor Donezk",null,":"]
[null,null,null,null,null,null,1198,19,21,"Feyenoord Rotterdam","-","PSV Eindhoven",null,":"]
[null,null,null,null,null,null,1199,23,18,"Dinamo Zagreb","-","AC Mailand",null,":"]
[null,null,null,null,null,null,1200,25,26,"OSC Lille","-","Roter Stern Belgrad",null,":"]
[null,null,null,null,null,null,1201,4,32,"Paris Saint-Germain","-","VfB Stuttgart",null,":"]
[null,null,null,null,null,null,1202,37,8,"AC Roma","-","RB Leipzig",null,":"]
[null,null,null,null,null,null,1203,13,38,"Juventus Turin","-","FC Basel",null,":"]
[null,null,null,null,null,null,1204,1,29,"Real Madrid","-","Aston Villa",null,":"]
[null,null,null,null,null,null,1205,27,14,"Young Boys Bern","-","Benfica Lissabon",null,":"]
[null,null,null,null,null,null,1206,30,28,"FC Bologna","-","AS Monaco",null,":"]
[null,null,null,null,null,null,1207,40,9,"Hertha BSC","-","FC Barcelona",null,":"]
[null,null,null,null,null,null,1208,2,39,"Manchester City","-","FC Lille",null,":"]
[null,null,null,null,null,null,1209,20,24,"Sporting Lissabon","-","Red Bull Salzburg",null,":"]
[null,null,null,null,null,null,1210,11,22,"Atletico Madrid","-","Celtic Glasgow",null,":"]
[null,null,null,null,null,null,1211,16,31,"FC Brügge","-","FC Girona",null,":"]
[null,null,null,null,null,null,1212,3,10,"FC Bayern München","-","Bayer Leverkusen",null,":"]
[null,null,null,null,null,null,1213,35,5,"Eintracht Frankfurt","-","FC Liverpool",null,":"]
[null,null,null,null,null,null,1214,6,34,"Inter Mailand","-","Stade Brest",null,":"]
[null,null,null,null,null,null,1215,33,12,"Sturm Graz","-","Atalanta Bergamo",null,":"]
[null,null,null,null,null,null,1216,7,36,"Borussia Dortmund","-","Mainz 05",null,":"]
[null,null,null,null,null,null,1217,21,15,"PSV Eindhoven","-","FC Arsenal",null,":"]
[null,null,null,null,null,null,1218,17,23,{"$f":"IFERROR(VLOOKUP($H1223,$B$6:$C$45,2,0),\"\")","v":"Schachtjor Donezk"},"-",{"$f":"IFERROR(VLOOKUP($I1223,$B$6:$C$45,2,0),\"\")","v":"Dinamo Zagreb"},null,":"]
[null,null,null,null,null,null,1219,26,19,"Roter Stern Belgrad","-","Feyenoord Rotterdam",null,":"]
[null,null,null,null,null,null,1220,18,25,"AC Mailand","-","OSC Lille",null,":"]
[null,null,null,null,null,null,1221,8,4,"RB Leipzig","-","Paris Saint-Germain",null,":"]
[null,null,null,null,null,null,1222,32,13,"VfB Stuttgart","-","Juventus Turin",null,":"]
[null,null,null,null,null,null,1223,29,37,"Aston Villa","-","AC Roma",null,":"]
[null,null,null,null,null,null,1224,38,27,"FC Basel","-","Young Boys Bern",null,":"]
[null,null,null,null,null,null,1225,28,1,"AS Monaco","-","Real Madrid",null,":"]
[null,null,null,null,null,null,1226,14,40,"Benfica Lissabon","-","Hertha BSC",null,":"]
[null,null,null,null,null,null,1227,39,30,"FC Lille","-","FC Bologna",null,":"]
[null,null,null,null,null,null,1228,9,20,"FC Barcelona","-","Sporting Lissabon",null,":"]
[null,null,null,null,null,null,1229,22,2,"Celtic Glasgow","-","Manchester City",null,":"]
[null,null,null,null,null,null,1230,24,16,"Red Bull Salzburg","-","FC Brügge",null,":"]
[null,null,null,null,null,null,1231,10,11,"Bayer Leverkusen","-","Atletico Madrid",null,":"]
[null,null,null,null,null,null,1232,31,35,"FC Girona","-","Eintracht Frankfurt",null,":"]
[null,null,null,null,null,null,1233,34,3,"Stade Brest","-","FC Bayern München",null,":"]
[null,null,null,null,null,null,1234,5,33,"FC Liverpool","-","Sturm Graz",null,":"]
[null,null,null,null,null,null,1235,36,6,"Mainz 05","-","Inter Mailand",null,":"]
[null,null,null,null,null,null,1236,12,21,"Atalanta Bergamo","-","PSV Eindhoven",null,":"]
[null,null,null,null,null,null,1237,23,7,"Dinamo Zagreb","-","Borussia Dortmund",null,":"]
[null,null,null,null,null,null,1238,15,26,"FC Arsenal","-","Roter Stern Belgrad",null,":"]
[null,null,null,null,null,null,1239,25,17,"OSC Lille","-","Schachtjor Donezk",null,":"]
[null,null,null,null,null,null,1240,19,18,"Feyenoord Rotterdam","-","AC Mailand",null,":"]
[null,null,null,null,null,null,1241,4,13,"Paris Saint-Germain","-","Juventus Turin",null,":"]
[null,null,null,null,null,null,1242,8,29,"RB Leipzig","-","Aston Villa",null,":"]
[null,null,null,null,null,null,1243,27,32,"Young Boys Bern","-","VfB Stuttgart",null,":"]
[null,null,null,null,null,null,1244,37,28,"AC Roma","-","AS Monaco",null,":"]
[null,null,null,null,null,null,1245,40,38,"Hertha BSC","-","FC Basel",null,":"]
[null,null,null,null,null,null,1246,1,39,"Real Madrid","-","FC Lille",null,":"]
[null,null,null,null,null,null,1247,20,14,"Sporting Lissabon","-","Benfica Lissabon",null,":"]
[null,null,null,null,null,null,1248,30,22,"FC Bologna","-","Celtic Glasgow",null,":"]
[null,null,null,null,null,null,1249,16,9,"FC Brügge","-","FC Barcelona",null,":"]
[null,null,null,null,null,null,1250,2,10,"Manchester City","-","Bayer Leverkusen",null,":"]
[null,null,null,null,null,null,1251,35,24,"Eintracht Frankfurt","-","Red Bull Salzburg",null,":"]
[null,null,null,null,null,null,1252,11,34,"Atletico Madrid","-","Stade Brest",null,":"]
[null,null,null,null,null,null,1253,33,31,"Sturm Graz","-","FC Girona",null,":"]
[null,null,null,null,null,null,1254,3,36,"FC Bayern München","-","Mainz 05",null,":"]
[null,null,null,null,null,null,1255,21,5,"PSV Eindhoven","-","FC Liverpool",null,":"]
[null,null,null,null,null,null,1256,6,23,"Inter Mailand","-","Dinamo Zagreb",null,":"]
[null,null,null,null,null,null,1257,26,12,"Roter Stern Belgrad","-","Atalanta Bergamo",null,":"]
[null,null,null,null,null,null,1258,7,25,"Borussia Dortmund","-","OSC Lille",null,":"]
[null,null,null,null,null,null,1259,18,15,"AC Mailand","-","FC Arsenal",null,":"]
[null,null,null,null,null,null,1260,17,19,"Schachtjor Donezk","-","Feyenoord Rotterdam",null,":"]
[null,null,null,null,null,null,1261,29,4,"Aston Villa","-","Paris Saint-Germain",null,":"]
[null,null,null,null,null,null,1262,13,27,"Juventus Turin","-","Young Boys Bern",null,":"]
[null,null,null,null,null,null,1263,28,8,"AS Monaco","-","RB Leipzig",null,":"]
[null,null,null,null,null,null,1264,32,40,"VfB Stuttgart","-","Hertha BSC",null,":"]
[null,null,null,null,null,null,1265,39,37,"FC Lille","-","AC Roma",null,":"]
[null,null,null,null,null,null,1266,38,20,"FC Basel","-","Sporting Lissabon",null,":"]
[null,null,null,null,null,null,1267,22,1,"Celtic Glasgow","-","Real Madrid",null,":"]
[null,null,null,null,null,null,1268,14,16,"Benfica Lissabon","-","FC Brügge",null,":"]
[null,null,null,null,null,null,1269,10,30,"Bayer Leverkusen","-","FC Bologna",null,":"]
[null,null,null,null,null,null,1270,9,35,"FC Barcelona","-","Eintracht Frankfurt",null,":"]
[null,null,null,null,null,null,1271,34,2,"Stade Brest","-","Manchester City",null,":"]
[null,null,null,null,null,null,1272,24,33,"Red Bull Salzburg","-","Sturm Graz",null,":"]
[null,null,null,null,null,null,1273,36,11,"Mainz 05","-","Atletico Madrid",null,":"]
[null,null,null,null,null,null,1274,31,21,"FC Girona","-","PSV Eindhoven",null,":"]
[null,null,null,null,null,null,1275,23,3,"Dinamo Zagreb","-","FC Bayern München",null,":"]
[null,null,null,null,null,null,1276,5,26,"FC Liverpool","-","Roter Stern Belgrad",null,":"]
[null,null,null,null,null,null,1277,25,6,"OSC Lille","-","Inter Mailand",null,":"]
[null,null,null,null,null,null,1278,12,18,"Atalanta Bergamo","-","AC Mailand",null,":"]
[null,null,null,null,null,null,1279,19,7,"Feyenoord Rotterdam","-","Borussia Dortmund",null,":"]
[null,null,null,null,null,null,1280,15,17,"FC Arsenal","-","Schachtjor Donezk",null,":"]
[null,null,null,null,null,null,1281,4,27,"Paris Saint-Germain","-","Young Boys Bern",null,":"]
[null,null,null,null,null,null,1282,29,28,{"$f":"IFERROR(VLOOKUP($H1287,$B$6:$C$45,2,0),\"\")","v":"Aston Villa"},"-",{"$f":"IFERROR(VLOOKUP($I1287,$B$6:$C$45,2,0),\"\")","v":"AS Monaco"},null,":"]
[null,null,null,null,null,null,1283,40,13,"Hertha BSC","-","Juventus Turin",null,":"]
[null,null,null,null,null,null,1284,8,39,"RB Leipzig","-","FC Lille",null,":"]
[null,null,null,null,null,null,1285,20,32,"Sporting Lissabon","-","VfB Stuttgart",null,":"]
[null,null,null,null,null,null,1286,37,22,"AC Roma","-","Celtic Glasgow",null,":"]
[null,null,null,null,null,null,1287,16,38,"FC Brügge","-","FC Basel",null,":"]
[null,null,null,null,null,null,1288,1,10,"Real Madrid","-","Bayer Leverkusen",null,":"]
[null,null,null,null,null,null,1289,35,14,"Eintracht Frankfurt","-","Benfica Lissabon",null,":"]
[null,null,null,null,null,null,1290,30,34,"FC Bologna","-","Stade Brest",null,":"]
[null,null,null,null,null,null,1291,33,9,"Sturm Graz","-","FC Barcelona",null,":"]
[null,null,null,null,null,null,1292,2,36,"Manchester City","-","Mainz 05",null,":"]
[null,null,null,null,null,null,1293,21,24,"PSV Eindhoven","-","Red Bull Salzburg",null,":"]
[null,null,null,null,null,null,1294,11,23,"Atletico Madrid","-","Dinamo Zagreb",null,":"]
[null,null,null,null,null,null,1295,26,31,"Roter Stern Belgrad","-","FC Girona",null,":"]
[null,null,null,null,null,null,1296,3,25,"FC Bayern München","-","OSC Lille",null,":"]
[null,null,null,null,null,null,1297,18,5,"AC Mailand","-","FC Liverpool",null,":"]
[null,null,null,null,null,null,1298,6,19,"Inter Mailand","-","Feyenoord Rotterdam",null,":"]
[null,null,null,null,null,null,1299,17,12,"Schachtjor Donezk","-","Atalanta Bergamo",null,":"]
[null,null,null,null,null,null,1300,7,15,"Borussia Dortmund","-","FC Arsenal",null,":"]
[null,null,null,null,null,null,1301,28,4,"AS Monaco","-","Paris Saint-Germain",null,":"]
[null,null,null,null,null,null,1302,27,40,"Young Boys Bern","-","Hertha BSC",null,":"]
[null,null,null,null,null,null,1303,39,29,"FC Lille","-","Aston Villa",null,":"]
[null,null,null,null,null,null,1304,13,20,"Juventus Turin","-","Sporting Lissabon",null,":"]
[null,null,null,null,null,null,1305,22,8,"Celtic Glasgow","-","RB Leipzig",null,":"]
[null,null,null,null,null,null,1306,32,16,"VfB Stuttgart","-","FC Brügge",null,":"]
[null,null,null,null,null,null,1307,10,37,"Bayer Leverkusen","-","AC Roma",null,":"]
[null,null,null,null,null,null,1308,38,35,"FC Basel","-","Eintracht Frankfurt",null,":"]
[null,null,null,null,null,null,1309,34,1,"Stade Brest","-","Real Madrid",null,":"]
[null,null,null,null,null,null,1310,14,33,"Benfica Lissabon","-","Sturm Graz",null,":"]
[null,null,null,null,null,null,1311,36,30,"Mainz 05","-","FC Bologna",null,":"]
[null,null,null,null,null,null,1312,9,21,"FC Barcelona","-","PSV Eindhoven",null,":"]
[null,null,null,null,null,null,1313,23,2,"Dinamo Zagreb","-","Manchester City",null,":"]
[null,null,null,null,null,null,1314,24,26,"Red Bull Salzburg","-","Roter Stern Belgrad",null,":"]
[null,null,null,null,null,null,1315,25,11,"OSC Lille","-","Atletico Madrid",null,":"]
[null,null,null,null,null,null,1316,31,18,"FC Girona","-","AC Mailand",null,":"]
[null,null,null,null,null,null,1317,19,3,"Feyenoord Rotterdam","-","FC Bayern München",null,":"]
[null,null,null,null,null,null,1318,5,17,"FC Liverpool","-","Schachtjor Donezk",null,":"]
[null,null,null,null,null,null,1319,15,6,"FC Arsenal","-","Inter Mailand",null,":"]
[null,null,null,null,null,null,1320,12,7,"Atalanta Bergamo","-","Borussia Dortmund",null,":"]
[null,null,null,null,null,null,1321,4,40,"Paris Saint-Germain","-","Hertha BSC",null,":"]
[null,null,null,null,null,null,1322,28,39,"AS Monaco","-","FC Lille",null,":"]
[null,null,null,null,null,null,1323,20,27,"Sporting Lissabon","-","Young Boys Bern",null,":"]
[null,null,null,null,null,null,1324,29,22,"Aston Villa","-","Celtic Glasgow",null,":"]
[null,null,null,null,null,null,1325,16,13,"FC Brügge","-","Juventus Turin",null,":"]
[null,null,null,null,null,null,1326,8,10,"RB Leipzig","-","Bayer Leverkusen",null,":"]
[null,null,null,null,null,null,1327,35,32,"Eintracht Frankfurt","-","VfB Stuttgart",null,":"]
[null,null,null,null,null,null,1328,37,34,"AC Roma","-","Stade Brest",null,":"]
[null,null,null,null,null,null,1329,33,38,"Sturm Graz","-","FC Basel",null,":"]
[null,null,null,null,null,null,1330,1,36,"Real Madrid","-","Mainz 05",null,":"]
[null,null,null,null,null,null,1331,21,14,"PSV Eindhoven","-","Benfica Lissabon",null,":"]
[null,null,null,null,null,null,1332,30,23,"FC Bologna","-","Dinamo Zagreb",null,":"]
[null,null,null,null,null,null,1333,26,9,"Roter Stern Belgrad","-","FC Barcelona",null,":"]
[null,null,null,null,null,null,1334,2,25,"Manchester City","-","OSC Lille",null,":"]
[null,null,null,null,null,null,1335,18,24,"AC Mailand","-","Red Bull Salzburg",null,":"]
[null,null,null,null,null,null,1336,11,19,"Atletico Madrid","-","Feyenoord Rotterdam",null,":"]
[null,null,null,null,null,null,1337,17,31,"Schachtjor Donezk","-","FC Girona",null,":"]
[null,null,null,null,null,null,1338,3,15,"FC Bayern München","-","FC Arsenal",null,":"]
[null,null,null,null,null,null,1339,7,5,"Borussia Dortmund","-","FC Liverpool",null,":"]
[null,null,null,null,null,null,1340,6,12,"Inter Mailand","-","Atalanta Bergamo",null,":"]
[null,null,null,null,null,null,1341,39,4,"FC Lille","-","Paris Saint-Germain",null,":"]
[null,null,null,null,null,null,1342,40,20,"Hertha BSC","-","Sporting Lissabon",null,":"]
[null,null,null,null,null,null,1343,22,28,"Celtic Glasgow","-","AS Monaco",null,":"]
[null,null,null,null,null,null,1344,27,16,"Young Boys Bern","-","FC Brügge",null,":"]
[null,null,null,null,null,null,1345,10,29,"Bayer Leverkusen","-","Aston Villa",null,":"]
[null,null,null,null,null,null,1346,13,35,{"$f":"IFERROR(VLOOKUP($H1351,$B$6:$C$45,2,0),\"\")","v":"Juventus Turin"},"-",{"$f":"IFERROR(VLOOKUP($I1351,$B$6:$C$45,2,0),\"\")","v":"Eintracht Frankfurt"},null,":"]
[null,null,null,null,null,null,1347,34,8,"Stade Brest","-","RB Leipzig",null,":"]
[null,null,null,null,null,null,1348,32,33,"VfB Stuttgart","-","Sturm Graz",null,":"]
[null,null,null,null,null,null,1349,36,37,"Mainz 05","-","AC Roma",null,":"]
[null,null,null,null,null,null,1350,38,21,"FC Basel","-","PSV Eindhoven",null,":"]
[null,null,null,null,null,null,1351,23,1,"Dinamo Zagreb","-","Real Madrid",null,":"]
[null,null,null,null,null,null,1352,14,26,"Benfica Lissabon","-","Roter Stern Belgrad",null,":"]
[null,null,null,null,null,null,1353,25,30,"OSC Lille","-","FC Bologna",null,":"]
[null,null,null,null,null,null,1354,9,18,"FC Barcelona","-","AC Mailand",null,":"]
[null,null,null,null,null,null,1355,19,2,"Feyenoord Rotterdam","-","Manchester City",null,":"]
[null,null,null,null,null,null,1356,24,17,"Red Bull Salzburg","-","Schachtjor Donezk",null,":"]
[null,null,null,null,null,null,1357,15,11,"FC Arsenal","-","Atletico Madrid",null,":"]
[null,null,null,null,null,null,1358,31,7,"FC Girona","-","Borussia Dortmund",null,":"]
[null,null,null,null,null,null,1359,12,3,"Atalanta Bergamo","-","FC Bayern München",null,":"]
[null,null,null,null,null,null,1360,5,6,"FC Liverpool","-","Inter Mailand",null,":"]
[null,null,null,null,null,null,1361,4,20,"Paris Saint-Germain","-","Sporting Lissabon",null,":"]
[null,null,null,null,null,null,1362,39,22,"FC Lille","-","Celtic Glasgow",null,":"]
[null,null,null,null,null,null,1363,16,40,"FC Brügge","-","Hertha BSC",null,":"]
[null,null,null,null,null,null,1364,28,10,"AS Monaco","-","Bayer Leverkusen",null,":"]
[null,null,null,null,null,null,1365,35,27,"Eintracht Frankfurt","-","Young Boys Bern",null,":"]
[null,null,null,null,null,null,1366,29,34,"Aston Villa","-","Stade Brest",null,":"]
[null,null,null,null,null,null,1367,33,13,"Sturm Graz","-","Juventus Turin",null,":"]
[null,null,null,null,null,null,1368,8,36,"RB Leipzig","-","Mainz 05",null,":"]
[null,null,null,null,null,null,1369,21,32,"PSV Eindhoven","-","VfB Stuttgart",null,":"]
[null,null,null,null,null,null,1370,37,23,"AC Roma","-","Dinamo Zagreb",null,":"]
[null,null,null,null,null,null,1371,26,38,"Roter Stern Belgrad","-","FC Basel",null,":"]
[null,null,null,null,null,null,1372,1,25,"Real Madrid","-","OSC Lille",null,":"]
[null,null,null,null,null,null,1373,18,14,"AC Mailand","-","Benfica Lissabon",null,":"]
[null,null,null,null,null,null,1374,30,19,"FC Bologna","-","Feyenoord Rotterdam",null,":"]
[null,null,null,null,null,null,1375,17,9,"Schachtjor Donezk","-","FC Barcelona",null,":"]
[null,null,null,null,null,null,1376,2,15,"Manchester City","-","FC Arsenal",null,":"]
[null,null,null,null,null,null,1377,7,24,"Borussia Dortmund","-","Red Bull Salzburg",null,":"]
[null,null,null,null,null,null,1378,11,12,"Atletico Madrid","-","Atalanta Bergamo",null,":"]
[null,null,null,null,null,null,1379,6,31,"Inter Mailand","-","FC Girona",null,":"]
[null,null,null,null,null,null,1380,3,5,"FC Bayern München","-","FC Liverpool",null,":"]
[null,null,null,null,null,null,1381,22,4,"Celtic Glasgow","-","Paris Saint-Germain",null,":"]
[null,null,null,null,null,null,1382,20,16,"Sporting Lissabon","-","FC Brügge",null,":"]
[null,null,null,null,null,null,1383,10,39,"Bayer Leverkusen","-","FC Lille",null,":"]
[null,null,null,null,null,null,1384,40,35,"Hertha BSC","-","Eintracht Frankfurt",null,":"]
[null,null,null,null,null,null,1385,34,28,"Stade Brest","-","AS Monaco",null,":"]
[null,null,null,null,null,null,1386,27,33,"Young Boys Bern","-","Sturm Graz",null,":"]
[null,null,null,null,null,null,1387,36,29,"Mainz 05","-","Aston Villa",null,":"]
[null,null,null,null,null,null,1388,13,21,"Juventus Turin","-","PSV Eindhoven",null,":"]
[null,null,null,null,null,null,1389,23,8,"Dinamo Zagreb","-","RB Leipzig",null,":"]
[null,null,null,null,null,null,1390,32,26,"VfB Stuttgart","-","Roter Stern Belgrad",null,":"]
[null,null,null,null,null,null,1391,25,37,"OSC Lille","-","AC Roma",null,":"]
[null,null,null,null,null,null,1392,38,18,"FC Basel","-","AC Mailand",null,":"]
[null,null,null,null,null,null,1393,19,1,"Feyenoord Rotterdam","-","Real Madrid",null,":"]
[null,null,null,null,null,null,1394,14,17,"Benfica Lissabon","-","Schachtjor Donezk",null,":"]
[null,null,null,null,null,null,1395,15,30,"FC Arsenal","-","FC Bologna",null,":"]
[null,null,null,null,null,null,1396,9,7,"FC Barcelona","-","Borussia Dortmund",null,":"]
[null,null,null,null,null,null,1397,12,2,"Atalanta Bergamo","-","Manchester City",null,":"]
[null,null,null,null,null,null,1398,24,6,"Red Bull Salzburg","-","Inter Mailand",null,":"]
[null,null,null,null,null,null,1399,5,11,"FC Liverpool","-","Atletico Madrid",null,":"]
[null,null,null,null,null,null,1400,31,3,"FC Girona","-","FC Bayern München",null,":"]
[null,null,null,null,null,null,1401,4,16,"Paris Saint-Germain","-","FC Brügge",null,":"]
[null,null,null,null,null,null,1402,22,10,"Celtic Glasgow","-","Bayer Leverkusen",null,":"]
[null,null,null,null,null,null,1403,35,20,"Eintracht Frankfurt","-","Sporting Lissabon",null,":"]
[null,null,null,null,null,null,1404,39,34,"FC Lille","-","Stade Brest",null,":"]
[null,null,null,null,null,null,1405,33,40,"Sturm Graz","-","Hertha BSC",null,":"]
[null,null,null,null,null,null,1406,28,36,"AS Monaco","-","Mainz 05",null,":"]
[null,null,null,null,null,null,1407,21,27,"PSV Eindhoven","-","Young Boys Bern",null,":"]
[null,null,null,null,null,null,1408,29,23,"Aston Villa","-","Dinamo Zagreb",null,":"]
[null,null,null,null,null,null,1409,26,13,"Roter Stern Belgrad","-","Juventus Turin",null,":"]
[null,null,null,null,null,null,1410,8,25,{"$f":"IFERROR(VLOOKUP($H1415,$B$6:$C$45,2,0),\"\")","v":"RB Leipzig"},"-",{"$f":"IFERROR(VLOOKUP($I1415,$B$6:$C$45,2,0),\"\")","v":"OSC Lille"},null,":"]
[null,null,null,null,null,null,1411,18,32,"AC Mailand","-","VfB Stuttgart",null,":"]
[null,null,null,null,null,null,1412,37,19,"AC Roma","-","Feyenoord Rotterdam",null,":"]
[null,null,null,null,null,null,1413,17,38,"Schachtjor Donezk","-","FC Basel",null,":"]
[null,null,null,null,null,null,1414,1,15,"Real Madrid","-","FC Arsenal",null,":"]
[null,null,null,null,null,null,1415,7,14,"Borussia Dortmund","-","Benfica Lissabon",null,":"]
[null,null,null,null,null,null,1416,30,12,"FC Bologna","-","Atalanta Bergamo",null,":"]
[null,null,null,null,null,null,1417,6,9,"Inter Mailand","-","FC Barcelona",null,":"]
[null,null,null,null,null,null,1418,2,5,"Manchester City","-","FC Liverpool",null,":"]
[null,null,null,null,null,null,1419,3,24,"FC Bayern München","-","Red Bull Salzburg",null,":"]
[null,null,null,null,null,null,1420,11,31,"Atletico Madrid","-","FC Girona",null,":"]
[null,null,null,null,null,null,1421,10,4,"Bayer Leverkusen","-","Paris Saint-Germain",null,":"]
[null,null,null,null,null,null,1422,16,35,"FC Brügge","-","Eintracht Frankfurt",null,":"]
[null,null,null,null,null,null,1423,34,22,"Stade Brest","-","Celtic Glasgow",null,":"]
[null,null,null,null,null,null,1424,20,33,"Sporting Lissabon","-","Sturm Graz",null,":"]
[null,null,null,null,null,null,1425,36,39,"Mainz 05","-","FC Lille",null,":"]
[null,null,null,null,null,null,1426,40,21,"Hertha BSC","-","PSV Eindhoven",null,":"]
[null,null,null,null,null,null,1427,23,28,"Dinamo Zagreb","-","AS Monaco",null,":"]
[null,null,null,null,null,null,1428,27,26,"Young Boys Bern","-","Roter Stern Belgrad",null,":"]
[null,null,null,null,null,null,1429,25,29,"OSC Lille","-","Aston Villa",null,":"]
[null,null,null,null,null,null,1430,13,18,"Juventus Turin","-","AC Mailand",null,":"]
[null,null,null,null,null,null,1431,19,8,"Feyenoord Rotterdam","-","RB Leipzig",null,":"]
[null,null,null,null,null,null,1432,32,17,"VfB Stuttgart","-","Schachtjor Donezk",null,":"]
[null,null,null,null,null,null,1433,15,37,"FC Arsenal","-","AC Roma",null,":"]
[null,null,null,null,null,null,1434,38,7,"FC Basel","-","Borussia Dortmund",null,":"]
[null,null,null,null,null,null,1435,12,1,"Atalanta Bergamo","-","Real Madrid",null,":"]
[null,null,null,null,null,null,1436,14,6,"Benfica Lissabon","-","Inter Mailand",null,":"]
[null,null,null,null,null,null,1437,5,30,"FC Liverpool","-","FC Bologna",null,":"]
[null,null,null,null,null,null,1438,9,3,"FC Barcelona","-","FC Bayern München",null,":"]
[null,null,null,null,null,null,1439,31,2,"FC Girona","-","Manchester City",null,":"]
[null,null,null,null,null,null,1440,24,11,"Red Bull Salzburg","-","Atletico Madrid",null,":"]
[null,null,null,null,null,null,1441,4,35,"Paris Saint-Germain","-","Eintracht Frankfurt",null,":"]
[null,null,null,null,null,null,1442,10,34,"Bayer Leverkusen","-","Stade Brest",null,":"]
[null,null,null,null,null,null,1443,33,16,"Sturm Graz","-","FC Brügge",null,":"]
[null,null,null,null,null,null,1444,22,36,"Celtic Glasgow","-","Mainz 05",null,":"]
[null,null,null,null,null,null,1445,21,20,"PSV Eindhoven","-","Sporting Lissabon",null,":"]
[null,null,null,null,null,null,1446,39,23,"FC Lille","-","Dinamo Zagreb",null,":"]
[null,null,null,null,null,null,1447,26,40,"Roter Stern Belgrad","-","Hertha BSC",null,":"]
[null,null,null,null,null,null,1448,28,25,"AS Monaco","-","OSC Lille",null,":"]
[null,null,null,null,null,null,1449,18,27,"AC Mailand","-","Young Boys Bern",null,":"]
[null,null,null,null,null,null,1450,29,19,"Aston Villa","-","Feyenoord Rotterdam",null,":"]
[null,null,null,null,null,null,1451,17,13,"Schachtjor Donezk","-","Juventus Turin",null,":"]
[null,null,null,null,null,null,1452,8,15,"RB Leipzig","-","FC Arsenal",null,":"]
[null,null,null,null,null,null,1453,7,32,"Borussia Dortmund","-","VfB Stuttgart",null,":"]
[null,null,null,null,null,null,1454,37,12,"AC Roma","-","Atalanta Bergamo",null,":"]
[null,null,null,null,null,null,1455,6,38,"Inter Mailand","-","FC Basel",null,":"]
[null,null,null,null,null,null,1456,1,5,"Real Madrid","-","FC Liverpool",null,":"]
[null,null,null,null,null,null,1457,3,14,"FC Bayern München","-","Benfica Lissabon",null,":"]
[null,null,null,null,null,null,1458,30,31,"FC Bologna","-","FC Girona",null,":"]
[null,null,null,null,null,null,1459,11,9,"Atletico Madrid","-","FC Barcelona",null,":"]
[null,null,null,null,null,null,1460,2,24,"Manchester City","-","Red Bull Salzburg",null,":"]
[null,null,null,null,null,null,1461,34,4,"Stade Brest","-","Paris Saint-Germain",null,":"]
[null,null,null,null,null,null,1462,35,33,"Eintracht Frankfurt","-","Sturm Graz",null,":"]
[null,null,null,null,null,null,1463,36,10,"Mainz 05","-","Bayer Leverkusen",null,":"]
[null,null,null,null,null,null,1464,16,21,"FC Brügge","-","PSV Eindhoven",null,":"]
[null,null,null,null,null,null,1465,23,22,"Dinamo Zagreb","-","Celtic Glasgow",null,":"]
[null,null,null,null,null,null,1466,20,26,"Sporting Lissabon","-","Roter Stern Belgrad",null,":"]
[null,null,null,null,null,null,1467,25,39,"OSC Lille","-","FC Lille",null,":"]
[null,null,null,null,null,null,1468,40,18,"Hertha BSC","-","AC Mailand",null,":"]
[null,null,null,null,null,null,1469,19,28,"Feyenoord Rotterdam","-","AS Monaco",null,":"]
[null,null,null,null,null,null,1470,27,17,"Young Boys Bern","-","Schachtjor Donezk",null,":"]
[null,null,null,null,null,null,1471,15,29,"FC Arsenal","-","Aston Villa",null,":"]
[null,null,null,null,null,null,1472,13,7,"Juventus Turin","-","Borussia Dortmund",null,":"]
[null,null,null,null,null,null,1473,12,8,"Atalanta Bergamo","-","RB Leipzig",null,":"]
[null,null,null,null,null,null,1474,32,6,{"$f":"IFERROR(VLOOKUP($H1479,$B$6:$C$45,2,0),\"\")","v":"VfB Stuttgart"},"-",{"$f":"IFERROR(VLOOKUP($I1479,$B$6:$C$45,2,0),\"\")","v":"Inter Mailand"},null,":"]
[null,null,null,null,null,null,1475,5,37,"FC Liverpool","-","AC Roma",null,":"]
[null,null,null,null,null,null,1476,38,3,"FC Basel","-","FC Bayern München",null,":"]
[null,null,null,null,null,null,1477,31,1,"FC Girona","-","Real Madrid",null,":"]
[null,null,null,null,null,null,1478,14,11,"Benfica Lissabon","-","Atletico Madrid",null,":"]
[null,null,null,null,null,null,1479,24,30,"Red Bull Salzburg","-","FC Bologna",null,":"]
[null,null,null,null,null,null,1480,9,2,"FC Barcelona","-","Manchester City",null,":"]
[null,null,null,null,null,null,1481,4,33,"Paris Saint-Germain","-","Sturm Graz",null,":"]
[null,null,null,null,null,null,1482,34,36,"Stade Brest","-","Mainz 05",null,":"]
[null,null,null,null,null,null,1483,21,35,"PSV Eindhoven","-","Eintracht Frankfurt",null,":"]
[null,null,null,null,null,null,1484,10,23,"Bayer Leverkusen","-","Dinamo Zagreb",null,":"]
[null,null,null,null,null,null,1485,26,16,"Roter Stern Belgrad","-","FC Brügge",null,":"]
[null,null,null,null,null,null,1486,22,25,"Celtic Glasgow","-","OSC Lille",null,":"]
[null,null,null,null,null,null,1487,18,20,"AC Mailand","-","Sporting Lissabon",null,":"]
[null,null,null,null,null,null,1488,39,19,"FC Lille","-","Feyenoord Rotterdam",null,":"]
[null,null,null,null,null,null,1489,17,40,"Schachtjor Donezk","-","Hertha BSC",null,":"]
[null,null,null,null,null,null,1490,28,15,"AS Monaco","-","FC Arsenal",null,":"]
[null,null,null,null,null,null,1491,7,27,"Borussia Dortmund","-","Young Boys Bern",null,":"]
[null,null,null,null,null,null,1492,29,12,"Aston Villa","-","Atalanta Bergamo",null,":"]
[null,null,null,null,null,null,1493,6,13,"Inter Mailand","-","Juventus Turin",null,":"]
[null,null,null,null,null,null,1494,8,5,"RB Leipzig","-","FC Liverpool",null,":"]
[null,null,null,null,null,null,1495,3,32,"FC Bayern München","-","VfB Stuttgart",null,":"]
[null,null,null,null,null,null,1496,37,31,"AC Roma","-","FC Girona",null,":"]
[null,null,null,null,null,null,1497,11,38,"Atletico Madrid","-","FC Basel",null,":"]
[null,null,null,null,null,null,1498,1,24,"Real Madrid","-","Red Bull Salzburg",null,":"]
[null,null,null,null,null,null,1499,2,14,"Manchester City","-","Benfica Lissabon",null,":"]
[null,null,null,null,null,null,1500,30,9,"FC Bologna","-","FC Barcelona",null,":"]
[null,null,null,null,null,null,1501,36,4,"Mainz 05","-","Paris Saint-Germain",null,":"]
[null,null,null,null,null,null,1502,33,21,"Sturm Graz","-","PSV Eindhoven",null,":"]
[null,null,null,null,null,null,1503,23,34,"Dinamo Zagreb","-","Stade Brest",null,":"]
[null,null,null,null,null,null,1504,35,26,"Eintracht Frankfurt","-","Roter Stern Belgrad",null,":"]
[null,null,null,null,null,null,1505,25,10,"OSC Lille","-","Bayer Leverkusen",null,":"]
[null,null,null,null,null,null,1506,16,18,"FC Brügge","-","AC Mailand",null,":"]
[null,null,null,null,null,null,1507,19,22,"Feyenoord Rotterdam","-","Celtic Glasgow",null,":"]
[null,null,null,null,null,null,1508,20,17,"Sporting Lissabon","-","Schachtjor Donezk",null,":"]
[null,null,null,null,null,null,1509,15,39,"FC Arsenal","-","FC Lille",null,":"]
[null,null,null,null,null,null,1510,40,7,"Hertha BSC","-","Borussia Dortmund",null,":"]
[null,null,null,null,null,null,1511,12,28,"Atalanta Bergamo","-","AS Monaco",null,":"]
[null,null,null,null,null,null,1512,27,6,"Young Boys Bern","-","Inter Mailand",null,":"]
[null,null,null,null,null,null,1513,5,29,"FC Liverpool","-","Aston Villa",null,":"]
[null,null,null,null,null,null,1514,13,3,"Juventus Turin","-","FC Bayern München",null,":"]
[null,null,null,null,null,null,1515,31,8,"FC Girona","-","RB Leipzig",null,":"]
[null,null,null,null,null,null,1516,32,11,"VfB Stuttgart","-","Atletico Madrid",null,":"]
[null,null,null,null,null,null,1517,24,37,"Red Bull Salzburg","-","AC Roma",null,":"]
[null,null,null,null,null,null,1518,38,2,"FC Basel","-","Manchester City",null,":"]
[null,null,null,null,null,null,1519,9,1,"FC Barcelona","-","Real Madrid",null,":"]
[null,null,null,null,null,null,1520,14,30,"Benfica Lissabon","-","FC Bologna",null,":"]
[null,null,null,null,null,null,1521,4,21,"Paris Saint-Germain","-","PSV Eindhoven",null,":"]
[null,null,null,null,null,null,1522,36,23,"Mainz 05","-","Dinamo Zagreb",null,":"]
[null,null,null,null,null,null,1523,26,33,"Roter Stern Belgrad","-","Sturm Graz",null,":"]
[null,null,null,null,null,null,1524,34,25,"Stade Brest","-","OSC Lille",null,":"]
[null,null,null,null,null,null,1525,18,35,"AC Mailand","-","Eintracht Frankfurt",null,":"]
[null,null,null,null,null,null,1526,10,19,"Bayer Leverkusen","-","Feyenoord Rotterdam",null,":"]
[null,null,null,null,null,null,1527,17,16,"Schachtjor Donezk","-","FC Brügge",null,":"]
[null,null,null,null,null,null,1528,22,15,"Celtic Glasgow","-","FC Arsenal",null,":"]
[null,null,null,null,null,null,1529,7,20,"Borussia Dortmund","-","Sporting Lissabon",null,":"]
[null,null,null,null,null,null,1530,39,12,"FC Lille","-","Atalanta Bergamo",null,":"]
[null,null,null,null,null,null,1531,6,40,"Inter Mailand","-","Hertha BSC",null,":"]
[null,null,null,null,null,null,1532,28,5,"AS Monaco","-","FC Liverpool",null,":"]
[null,null,null,null,null,null,1533,3,27,"FC Bayern München","-","Young Boys Bern",null,":"]
[null,null,null,null,null,null,1534,29,31,"Aston Villa","-","FC Girona",null,":"]
[null,null,null,null,null,null,1535,11,13,"Atletico Madrid","-","Juventus Turin",null,":"]
[null,null,null,null,null,null,1536,8,24,"RB Leipzig","-","Red Bull Salzburg",null,":"]
[null,null,null,null,null,null,1537,2,32,"Manchester City","-","VfB Stuttgart",null,":"]
[null,null,null,null,null,null,1538,37,9,{"$f":"IFERROR(VLOOKUP($H1543,$B$6:$C$45,2,0),\"\")","v":"AC Roma"},"-",{"$f":"IFERROR(VLOOKUP($I1543,$B$6:$C$45,2,0),\"\")","v":"FC Barcelona"},null,":"]
[null,null,null,null,null,null,1539,30,38,"FC Bologna","-","FC Basel",null,":"]
[null,null,null,null,null,null,1540,1,14,"Real Madrid","-","Benfica Lissabon",null,":"]
[null,null,null,null,null,null,1541,23,4,"Dinamo Zagreb","-","Paris Saint-Germain",null,":"]
[null,null,null,null,null,null,1542,21,26,"PSV Eindhoven","-","Roter Stern Belgrad",null,":"]
[null,null,null,null,null,null,1543,25,36,"OSC Lille","-","Mainz 05",null,":"]
[null,null,null,null,null,null,1544,33,18,"Sturm Graz","-","AC Mailand",null,":"]
[null,null,null,null,null,null,1545,19,34,"Feyenoord Rotterdam","-","Stade Brest",null,":"]
[null,null,null,null,null,null,1546,35,17,"Eintracht Frankfurt","-","Schachtjor Donezk",null,":"]
[null,null,null,null,null,null,1547,15,10,"FC Arsenal","-","Bayer Leverkusen",null,":"]
[null,null,null,null,null,null,1548,16,7,"FC Brügge","-","Borussia Dortmund",null,":"]
[null,null,null,null,null,null,1549,12,22,"Atalanta Bergamo","-","Celtic Glasgow",null,":"]
[null,null,null,null,null,null,1550,20,6,"Sporting Lissabon","-","Inter Mailand",null,":"]
[null,null,null,null,null,null,1551,5,39,"FC Liverpool","-","FC Lille",null,":"]
[null,null,null,null,null,null,1552,40,3,"Hertha BSC","-","FC Bayern München",null,":"]
[null,null,null,null,null,null,1553,31,28,"FC Girona","-","AS Monaco",null,":"]
[null,null,null,null,null,null,1554,27,11,"Young Boys Bern","-","Atletico Madrid",null,":"]
[null,null,null,null,null,null,1555,24,29,"Red Bull Salzburg","-","Aston Villa",null,":"]
[null,null,null,null,null,null,1556,13,2,"Juventus Turin","-","Manchester City",null,":"]
[null,null,null,null,null,null,1557,9,8,"FC Barcelona","-","RB Leipzig",null,":"]
[null,null,null,null,null,null,1558,32,30,"VfB Stuttgart","-","FC Bologna",null,":"]
[null,null,null,null,null,null,1559,14,37,"Benfica Lissabon","-","AC Roma",null,":"]
[null,null,null,null,null,null,1560,38,1,"FC Basel","-","Real Madrid",null,":"]

{"sheet":"1 x 200","index":2,"n_rows":2005,"n_cols":234,"rows_kept":2005,"cut":false,"hidden":false,"merged":[[0,0,0,1],[1,0,1,1],[1,6,1,14],[3,1,3,2],[3,16,3,17],[2,9,2,11],[3,34,3,37],[4,7,4,8],[4,12,4,14],[4,22,4,24],[4,30,4,32],[3,29,3,33]]}
[]
[null,null,null,null,null,null,"Tournament schedule 1 x 200"]
[null,null,null,null,null,null,null,null,null,"(without second legs)"]
[null,"Group A",null,null,null,null,null,null,null,null,null,null,null,null,null,null,"Table Group A",null,null,null,null,null,null,null,null,null,null,null,null,"Direct comparisons",null,null,null,null,"First legs"]
[null,"No","Team","Tie Break","Pen. pts",null,"No","Pairing",null,null,null,null,"Result",null,null,null,"Rank","Team","Pld","W","D","L","Goals",null,null,"GD","Pts",null,null,"Pts","Goals",null,null,"GD",{"$f":"LEFT($R$6,6)","v":"TM 79"},{"$f":"LEFT($R$7,6)","v":"AC Mai"},{"$f":"LEFT($R$8,6)","v":"TM 102"},{"$f":"LEFT($R$9,6)","v":"TM 199"},{"$f":"LEFT($R$10,6)","v":"FC Liv"},{"$f":"LEFT($R$11,6)","v":"TM 71"},{"$f":"LEFT($R$12,6)","v":"TM 91"},{"$f":"LEFT($R$13,6)","v":"TM 184"},{"$f":"LEFT($R$14,6)","v":"FC Lil"},{"$f":"LEFT($R$15,6)","v":"TM 194"},{"$f":"LEFT($R$16,6)","v":"TM 131"},{"$f":"LEFT($R$17,6)","v":"FC Brü"},{"$f":"LEFT($R$18,6)","v":"TM 110"},{"$f":"LEFT($R$19,6)","v":"TM 76"},{"$f":"LEFT($R$20,6)","v":"TM 142"},{"$f":"LEFT($R$21,6)","v":"TM 140"},{"$f":"LEFT($R$22,6)","v":"TM 109"},{"$f":"LEFT($R$23,6)","v":"OSC Li"},{"$f":"LEFT($R$24,6)","v":"TM 124"},{"$f":"LEFT($R$25,6)","v":"TM 87"},{"$f":"LEFT($R$26,6)","v":"TM 118"},{"$f":"LEFT($R$27,6)","v":"TM 95"},{"$f":"LEFT($R$28,6)","v":"TM 170"},{"$f":"LEFT($R$29,6)","v":"TM 42"},{"$f":"LEFT($R$30,6)","v":"TM 182"},{"$f":"LEFT($R$31,6)","v":"Red Bu"},{"$f":"LEFT($R$32,6)","v":"TM 187"},{"$f":"LEFT($R$33,6)","v":"TM 94"},{"$f":"LEFT($R$34,6)","v":"TM 86"},{"$f":"LEFT($R$35,6)","v":"TM 166"},{"$f":"LEFT($R$36,6)","v":"Juvent"},{"$f":"LEFT($R$37,6)","v":"TM 193"},{"$f":"LEFT($R$38,6)","v":"TM 121"},{"$f":"LEFT($R$39,6)","v":"TM 191"},{"$f":"LEFT($R$40,6)","v":"TM 158"},{"$f":"LEFT($R$41,6)","v":"TM 112"},{"$f":"LEFT($R$42,6)","v":"TM 43"},{"$f":"LEFT($R$43,6)","v":"TM 162"},{"$f":"LEFT($R$44,6)","v":"TM 41"},{"$f":"LEFT($R$45,6)","v":"TM 123"},{"$f":"LEFT($R$46,6)","v":"TM 104"},{"$f":"LEFT($R$47,6)","v":"TM 80"},{"$f":"LEFT($R$48,6)","v":"TM 135"},{"$f":"LEFT($R$49,6)","v":"TM 60"},{"$f":"LEFT($R$50,6)","v":"TM 139"},{"$f":"LEFT($R$51,6)","v":"TM 98"},{"$f":"LEFT($R$52,6)","v":"TM 153"},{"$f":"LEFT($R$53,6)","v":"TM 48"},{"$f":"LEFT($R$54,6)","v":"TM 171"},{"$f":"LEFT($R$55,6)","v":"TM 69"},{"$f":"LEFT($R$56,6)","v":"TM 134"},{"$f":"LEFT($R$57,6)","v":"TM 67"},{"$f":"LEFT($R$58,6)","v":"TM 116"},{"$f":"LEFT($R$59,6)","v":"TM 107"},{"$f":"LEFT($R$60,6)","v":"TM 173"},{"$f":"LEFT($R$61,6)","v":"Boruss"},{"$f":"LEFT($R$62,6)","v":"TM 73"},{"$f":"LEFT($R$63,6)","v":"FC Bol"},{"$f":"LEFT($R$64,6)","v":"TM 148"},{"$f":"LEFT($R$65,6)","v":"Dinamo"},{"$f":"LEFT($R$66,6)","v":"TM 70"},{"$f":"LEFT($R$67,6)","v":"TM 92"},{"$f":"LEFT($R$68,6)","v":"TM 136"},{"$f":"LEFT($R$69,6)","v":"Feyeno"},{"$f":"LEFT($R$70,6)","v":"Manche"},{"$f":"LEFT($R$71,6)","v":"TM 55"},{"$f":"LEFT($R$72,6)","v":"Benfic"},{"$f":"LEFT($R$73,6)","v":"TM 156"},{"$f":"LEFT($R$74,6)","v":"TM 154"},{"$f":"LEFT($R$75,6)","v":"FC Gir"},{"$f":"LEFT($R$76,6)","v":"TM 130"},{"$f":"LEFT($R$77,6)","v":"Celtic"},{"$f":"LEFT($R$78,6)","v":"TM 137"},{"$f":"LEFT($R$79,6)","v":"TM 122"},{"$f":"LEFT($R$80,6)","v":"TM 88"},{"$f":"LEFT($R$81,6)","v":"TM 68"},{"$f":"LEFT($R$82,6)","v":"TM 163"},{"$f":"LEFT($R$83,6)","v":"FC Bas"},{"$f":"LEFT($R$84,6)","v":"TM 44"},{"$f":"LEFT($R$85,6)","v":"TM 54"},{"$f":"LEFT($R$86,6)","v":"TM 52"},{"$f":"LEFT($R$87,6)","v":"TM 155"},{"$f":"LEFT($R$88,6)","v":"TM 85"},{"$f":"LEFT($R$89,6)","v":"TM 126"},{"$f":"LEFT($R$90,6)","v":"Sporti"},{"$f":"LEFT($R$91,6)","v":"AC Rom"},{"$f":"LEFT($R$92,6)","v":"TM 152"},{"$f":"LEFT($R$93,6)","v":"Hertha"},{"$f":"LEFT($R$94,6)","v":"TM 161"},{"$f":"LEFT($R$95,6)","v":"TM 47"},{"$f":"LEFT($R$96,6)","v":"TM 106"},{"$f":"LEFT($R$97,6)","v":"FC Bay"},{"$f":"LEFT($R$98,6)","v":"TM 103"},{"$f":"LEFT($R$99,6)","v":"TM 78"},{"$f":"LEFT($R$100,6)","v":"TM 144"},{"$f":"LEFT($R$101,6)","v":"TM 82"},{"$f":"LEFT($R$102,6)","v":"Paris "},{"$f":"LEFT($R$103,6)","v":"TM 174"},{"$f":"LEFT($R$104,6)","v":"PSV Ei"},{"$f":"LEFT($R$105,6)","v":"VfB St"},{"$f":"LEFT($R$106,6)","v":"TM 93"},{"$f":"LEFT($R$107,6)","v":"TM 198"},{"$f":"LEFT($R$108,6)","v":"Young "},{"$f":"LEFT($R$109,6)","v":"TM 59"},{"$f":"LEFT($R$110,6)","v":"TM 160"},{"$f":"LEFT($R$111,6)","v":"FC Bar"},{"$f":"LEFT($R$112,6)","v":"TM 179"},{"$f":"LEFT($R$113,6)","v":"TM 181"},{"$f":"LEFT($R$114,6)","v":"Aston "},{"$f":"LEFT($R$115,6)","v":"TM 77"},{"$f":"LEFT($R$116,6)","v":"TM 83"},{"$f":"LEFT($R$117,6)","v":"TM 183"},{"$f":"LEFT($R$118,6)","v":"TM 165"},{"$f":"LEFT($R$119,6)","v":"TM 169"},{"$f":"LEFT($R$120,6)","v":"Sturm "},{"$f":"LEFT($R$121,6)","v":"TM 175"},{"$f":"LEFT($R$122,6)","v":"AS Mon"},{"$f":"LEFT($R$123,6)","v":"Inter "},{"$f":"LEFT($R$124,6)","v":"TM 50"},{"$f":"LEFT($R$125,6)","v":"TM 147"},{"$f":"LEFT($R$126,6)","v":"TM 114"},{"$f":"LEFT($R$127,6)","v":"TM 129"},{"$f":"LEFT($R$128,6)","v":"TM 127"},{"$f":"LEFT($R$129,6)","v":"TM 100"},{"$f":"LEFT($R$130,6)","v":"TM 185"},{"$f":"LEFT($R$131,6)","v":"TM 61"},{"$f":"LEFT($R$132,6)","v":"TM 46"},{"$f":"LEFT($R$133,6)","v":"TM 180"},{"$f":"LEFT($R$134,6)","v":"TM 111"},{"$f":"LEFT($R$135,6)","v":"TM 143"},{"$f":"LEFT($R$136,6)","v":"TM 168"},{"$f":"LEFT($R$137,6)","v":"RB Lei"},{"$f":"LEFT($R$138,6)","v":"TM 49"},{"$f":"LEFT($R$139,6)","v":"TM 56"},{"$f":"LEFT($R$140,6)","v":"TM 99"},{"$f":"LEFT($R$141,6)","v":"FC Ars"},{"$f":"LEFT($R$142,6)","v":"TM 89"},{"$f":"LEFT($R$143,6)","v":"TM 164"},{"$f":"LEFT($R$144,6)","v":"TM 146"},{"$f":"LEFT($R$145,6)","v":"TM 58"},{"$f":"LEFT($R$146,6)","v":"TM 200"},{"$f":"LEFT($R$147,6)","v":"TM 192"},{"$f":"LEFT($R$148,6)","v":"TM 66"},{"$f":"LEFT($R$149,6)","v":"TM 108"},{"$f":"LEFT($R$150,6)","v":"TM 189"},{"$f":"LEFT($R$151,6)","v":"Mainz "},{"$f":"LEFT($R$152,6)","v":"Roter "},{"$f":"LEFT($R$153,6)","v":"TM 97"},{"$f":"LEFT($R$154,6)","v":"Atalan"},{"$f":"LEFT($R$155,6)","v":"TM 65"},{"$f":"LEFT($R$156,6)","v":"TM 115"},{"$f":"LEFT($R$157,6)","v":"TM 72"},{"$f":"LEFT($R$158,6)","v":"TM 138"},{"$f":"LEFT($R$159,6)","v":"TM 172"},{"$f":"LEFT($R$160,6)","v":"TM 74"},{"$f":"LEFT($R$161,6)","v":"TM 167"},{"$f":"LEFT($R$162,6)","v":"TM 141"},{"$f":"LEFT($R$163,6)","v":"TM 51"},{"$f":"LEFT($R$164,6)","v":"TM 117"},{"$f":"LEFT($R$165,6)","v":"TM 159"},{"$f":"LEFT($R$166,6)","v":"TM 96"},{"$f":"LEFT($R$167,6)","v":"TM 113"},{"$f":"LEFT($R$168,6)","v":"TM 101"},{"$f":"LEFT($R$169,6)","v":"Real M"},{"$f":"LEFT($R$170,6)","v":"TM 64"},{"$f":"LEFT($R$171,6)","v":"TM 120"},{"$f":"LEFT($R$172,6)","v":"Atleti"},{"$f":"LEFT($R$173,6)","v":"Eintra"},{"$f":"LEFT($R$174,6)","v":"TM 90"},{"$f":"LEFT($R$175,6)","v":"TM 195"},{"$f":"LEFT($R$176,6)","v":"TM 81"},{"$f":"LEFT($R$177,6)","v":"TM 177"},{"$f":"LEFT($R$178,6)","v":"TM 186"},{"$f":"LEFT($R$179,6)","v":"TM 133"},{"$f":"LEFT($R$180,6)","v":"TM 105"},{"$f":"LEFT($R$181,6)","v":"TM 145"},{"$f":"LEFT($R$182,6)","v":"TM 119"},{"$f":"LEFT($R$183,6)","v":"TM 57"},{"$f":"LEFT($R$184,6)","v":"TM 132"},{"$f":"LEFT($R$185,6)","v":"TM 75"},{"$f":"LEFT($R$186,6)","v":"TM 63"},{"$f":"LEFT($R$187,6)","v":"TM 150"},{"$f":"LEFT($R$188,6)","v":"TM 53"},{"$f":"LEFT($R$189,6)","v":"TM 196"},{"$f":"LEFT($R$190,6)","v":"TM 62"},{"$f":"LEFT($R$191,6)","v":"TM 176"},{"$f":"LEFT($R$192,6)","v":"TM 45"},{"$f":"LEFT($R$193,6)","v":"Bayer "},{"$f":"LEFT($R$194,6)","v":"TM 151"},{"$f":"LEFT($R$195,6)","v":"Schach"},{"$f":"LEFT($R$196,6)","v":"TM 197"},{"$f":"LEFT($R$197,6)","v":"TM 190"},{"$f":"LEFT($R$198,6)","v":"Stade "},{"$f":"LEFT($R$199,6)","v":"TM 188"},{"$f":"LEFT($R$200,6)","v":"TM 84"},{"$f":"LEFT($R$201,6)","v":"TM 125"},{"$f":"LEFT($R$202,6)","v":"TM 128"},{"$f":"LEFT($R$203,6)","v":"TM 178"},{"$f":"LEFT($R$204,6)","v":"TM 157"},{"$f":"LEFT($R$205,6)","v":"TM 149"}]
[null,1,"Real Madrid",null,null,null,1,{"$f":"Match_pairings(200,TRUE,TRUE)","v":176},47,{"$f":"IFERROR(VLOOKUP($H6,$B$6:$C$205,2,0),\"\")","v":"TM 176"},"-",{"$f":"IFERROR(VLOOKUP($I6,$B$6:$C$205,2,0),\"\")","v":"TM 47"},3,":",4,null,{"$f":"Group_table(0,3,$J$6:$J$2005,$L$6:$L$2005,$M$6:$M$2005,$O$6:$O$2005,$C$6:$C$205,$D$6:$D$205,$E$6:$E$205)","v":1},"TM 79",16,11,2,3,38,":",19,19,35,"","TM 79","","","","","","","","","","","","","","","","","","","","","","","","","","","","","","","","","","","","","","","","","","","","","","","","","","","","","","","","","","","","","","","","","","","","","","","","","","","","","","","","","","","","","","","","","1 : 0","","","","","","","","","","","","","","","","","","","","0 : 3","2 : 1","","","","","","","","","","","","","","","","","","5 : 2","","","0 : 3","","","","","9 : 2","","","","","","","","","","3 : 1","","","1 : 3","","","","","","","","","0 : 0","","","","","3 : 1","","","","","","","","","","","","","","","","1 : 0","3 : 1","","","","","","","0 : 0","3 : 0","","","","","","","5 : 2","","","","","","","","","2 : 0",""]
[null,2,"Manchester City",null,null,null,2,35,58,{"$f":"IFERROR(VLOOKUP($H7,$B$6:$C$205,2,0),\"\")","v":"Eintracht Frankfurt"},"-",{"$f":"IFERROR(VLOOKUP($I7,$B$6:$C$205,2,0),\"\")","v":"TM 58"},0,":",3,null,2,"AC Mailand",16,11,1,4,42,":",23,19,34,"","AC Mailand","","","","","","","","","","","","","","","","","","","","","","","","","","","","","","","","","","","","","","","","","","","","","","","","","","","","","","","","","","","","","","","","","","","","","","","","","","","","","","","","","","","","","","","","","","","","","","","","","","","","","","","3 : 1","","","","","","","","","","","","","","","","","","","","","","","","1 : 3","","","","","","","","","","3 : 1","","","","","","","","","","","","","","3 : 0","","","","","","","","","","","0 : 4","","0 : 0","","","","","","3 : 1","5 : 2","3 : 1","","0 : 3","3 : 1","","0 : 3","","","","","","","1 : 0","","","","","","3 : 0","","","","","","9 : 2","","","5 : 1","","","","","",""]
[null,3,"FC Bayern München",null,null,null,3,104,33,"TM 104","-","Sturm Graz",9,":",2,null,3,"TM 102",16,11,0,5,48,":",29,19,33,"","TM 102","","","","","","","","","","","","","","","","","","","","","","","","","","","","","","","","","","","3 : 1","","","","","","","","","","","","","","","","","","","","","","","5 : 1","","","","","","","","0 : 4","","","","","","","","","","","","","","","","","","","","","","","","","","","","","","","","","","","","","","","","","","","","","","","","0 : 3","","","","","","","","","0 : 4","","","","","","","","","","","","2 : 0","","","","","3 : 1","5 : 1","","","","","","","","","","","","9 : 2","","","","","","","","","","","","9 : 2","","","","","","","","","","","","","","","","5 : 2","","","","","","","","0 : 3","","","1 : 3","2 : 1","","","","","","","","3 : 1","","","","1 : 0"]
[null,4,"Paris Saint-Germain",null,null,null,4,31,175,"FC Girona","-","TM 175",3,":",1,null,4,"TM 199",16,10,2,4,43,":",25,18,32,"","TM 199","","","","","","","","","","","","","","","","","","","","","","","","","","","","","","","","","","","","","","","","","","","","","","","","","","","","","","","","","","","","","","","","","","","","0 : 3","","","","","","","3 : 0","","","","","","","","","","","","","","","","","","","","","","","","","","","","","","","","","","","","","","","","","3 : 1","","","","","2 : 1","","","","","","","","","5 : 2","","","","","","","","","","","","","","9 : 2","0 : 3","","","","","1 : 3","","","","5 : 2","","0 : 0","","","3 : 1","","","","","","","","","","","","","","3 : 1","","","","","","","","","","","","3 : 0","5 : 1","","","","","","","","","","","","","","","","","","",""]
[null,5,"FC Liverpool",null,null,null,5,76,30,"TM 76","-","FC Bologna",1,":",3,null,5,"FC Liverpool",16,10,2,4,43,":",26,17,32,"","FC Liverpool","","","","","","","","","","","","","","","","","","","","","","","","","","","","","","","","","","","","","","","","","","","","","","","","","","","","","","","","","","","","","","","","","","","","1 : 5","","","","","","","0 : 0","","","","","","","","","","","","","","","","","","","","","","","","","","","","","","","","","","","","","","","","","5 : 2","","","","","9 : 2","","","","","","","","","","","0 : 3","","","","","","","","","","","","3 : 0","1 : 0","","","","","2 : 1","","3 : 1","","0 : 4","","","3 : 1","","9 : 2","","","","","","","","","","","","","","5 : 2","","","","","","","","","2 : 0","","","0 : 0","0 : 3","","","","","","","","","","","","","","","","","","",""]
[null,6,"Inter Mailand",null,null,null,6,46,12,"TM 46","-","Atalanta Bergamo",2,":",0,null,6,"TM 71",16,10,2,4,41,":",24,17,32,"","TM 71","","","","","","","","","","","","","","","","","","","","","","","","","","","","","","","","","","","","","","","","","","","","","","","","","","","","","","","","","","","","","","","","","","","","","","","","","","","","","","","","","","","","","","","","","","","","3 : 1","","","","","3 : 0","","","0 : 3","","","","","","","","","","","","","","","","","","","1 : 0","","","","","0 : 0","5 : 2","","0 : 0","","","","","","","","","","","","","","","","","","","","","","","","","","","","","","","","","","","","","3 : 1","","","","","","","0 : 3","5 : 1","","","9 : 2","","3 : 0","","","","","","","2 : 1","","","","","","1 : 3","","","","","","5 : 2","","","","","","","","",""]
[null,7,"Borussia Dortmund",null,null,null,7,124,28,"TM 124","-","AS Monaco",0,":",0,null,7,"TM 91",16,10,2,4,39,":",23,16,32,"","TM 91","","","","","","","","","","","","","","","","","","","","","","","","","","","","","","","","","","","","","","","","","","","","","","","","","","","","","","","","","","","","","","","","","","","","","","","","","","","","","","","","","0 : 0","","","","","","0 : 3","","","","","","","","","","","","","","","","","","","","","","1 : 0","9 : 2","","","","","","","","","","","","","","","","","","","","","1 : 0","","","","","0 : 3","","","","","","","","","","5 : 2","","","2 : 1","","","","","","","","","2 : 0","","","","","5 : 2","","","","","","","","","","","","","","","","3 : 1","9 : 2","","","","","","","2 : 0","0 : 0","","","","","","","0 : 4","","","","","","","","","0 : 3",""]
[null,8,"RB Leipzig",null,null,null,8,26,119,"Roter Stern Belgrad","-","TM 119",3,":",0,null,8,"TM 184",16,10,2,4,36,":",21,15,32,"","TM 184","","","","","","","","","","","","","","","","","","","","","","","","","","","","","","","","","","","","","","","","","","","","","","","","","","","","","","","","","","","","","","","","","","","","","","","","","","","","","","","","","","","","","5 : 2","","","","0 : 3","","","","","","","","","","","","","","","","","","","","","1 : 3","3 : 1","","","","","","","","","","","","","","","","","3 : 1","","","5 : 1","","","","","3 : 1","","","","","","","","","","1 : 0","","","5 : 2","","","","","","","","","3 : 0","","","","","","","","","","","","","","","","","","","","","0 : 3","1 : 3","","","","","","","3 : 0","0 : 0","","","","","","","3 : 1","","","","","","","","","0 : 0",""]
[null,9,"FC Barcelona",null,null,null,9,80,23,"TM 80","-","Dinamo Zagreb",0,":",0,null,9,"FC Lille",16,10,2,4,34,":",21,13,32,"","FC Lille","","","","","","","","","","","","","","","","","","","","","","","","","","","","","","","","","","","","","","","","","","","","","","","","","","","","","","","","","","","","","","","","","","","","","","","","","","","","","","","","","","","","","","","","","","","","","","","","","","","","","","","5 : 2","","","","","","","","","","","","","","","","2 : 1","","","","","","0 : 3","","3 : 1","","","","","","","","","","0 : 2","","","","","","","","","","","","","","0 : 0","","","","","","","","","","","","","2 : 0","","","","","","","0 : 4","9 : 2","","1 : 0","5 : 2","","1 : 0","","","","","","","3 : 1","","","","","","0 : 0","","","","","","3 : 0","","","0 : 3","","","","","",""]
[null,10,"Bayer Leverkusen",null,null,null,10,22,146,"Celtic Glasgow","-","TM 146",1,":",2,null,10,"TM 194",16,10,2,4,37,":",28,9,32,"","TM 194","","","","","","","","","","","","","","","","","","","","","","","","","","","","","","","","","2 : 9","","","","","","","","","","","","","","","","","","","","","","","","","","","","","","","","","","","3 : 0","","","","","","3 : 1","","","","","","","","","1 : 0","","","0 : 0","","","","","","","","","","","","","","","","","","","","5 : 2","","","","","","","","","","9 : 2","","","","","","","","","","","","","","0 : 3","","","","","","","","","","","","","","0 : 3","","","","","","1 : 0","","","","","","3 : 1","","","2 : 0","","","","","","","","","","","","","","","","","","","","","","","3 : 1","","","0 : 4","5 : 2","","","","","","","","","","","","","","","","","","",""]
[null,11,"Atletico Madrid",null,null,null,11,139,21,"TM 139","-","PSV Eindhoven",0,":",3,null,11,"TM 131",16,10,1,5,51,":",29,22,31,"","TM 131","","","","","","","","","","","","","","","","","","","","","","","","","","","","","","","","","","","","","","","","","","","","","","","","","","","","","","","","","","","","","","","","","","","","","","","","","","","","","","","","","","","","","","","","","","","","","","","","","","","","","","","","","","","","","","","","","","","","","","","","","","","","","","","1 : 3","","","","","","","","","","5 : 1","","","","","","","","","","","","","","5 : 2","","","","","","","","","","","9 : 2","","0 : 4","","","","","0 : 3","0 : 3","0 : 0","1 : 0","","9 : 2","","","2 : 0","","","","","","","0 : 3","","","","","","9 : 2","","","","","","5 : 1","","","4 : 3","","","","","",""]
[null,12,"Atalanta Bergamo",null,null,null,12,20,72,"Sporting Lissabon","-","TM 72",5,":",1,null,12,"FC Brügge",16,10,1,5,49,":",27,22,31,"","FC Brügge","","","","","","","","","","","","","","","","","","","","","","","","","","","","","","","","","","","5 : 2","","","","","","","","","","1 : 3","","","","","","","","","","","","","1 : 3","","","","","","","","2 : 0","","","","","","","","","","","","","","","","","","","","","","","","","","","","","","","","","","","","","","","","","","","","","","","","3 : 1","","","","","","","","","2 : 0","","","","","","","","","","","","0 : 3","","","","","9 : 2","1 : 3","","","","","","","","","","","","0 : 4","","","","","","","","","","","","","","","","","","","","","","","","","","","","0 : 0","","","","","","","","5 : 1","","","3 : 1","5 : 2","","","","","","","","3 : 0","","","","9 : 2"]
[null,13,"Juventus Turin",null,null,null,13,73,167,"TM 73","-","TM 167",0,":",4,null,13,"TM 110",16,10,1,5,45,":",27,18,31,"","TM 110","","","","","","","","","","","","","","","","","","","","","","","","","","","","","","","","","","","","","","","","","","","","","","","","","","","","","","","","","","","","","","","","","","","","","","","","","","","","","","","","","","","","","","","","","","","","","3 : 1","","","","","","","","","","","","0 : 3","","","3 : 1","","","","","5 : 1","","","","","","","","","","","","","0 : 3","","","","","","","","0 : 4","","","","2 : 0","","","","","","","","","","","","","","","","","","","","","","","","","","","","0 : 3","5 : 1","","","","","","","","","9 : 2","","9 : 2","","","","","5 : 2","","","","","","","","","","","1 : 3","","","2 : 1","0 : 0","","1 : 0","","","","",""]
[null,14,"Benfica Lissabon",null,null,null,14,165,63,"TM 165","-","TM 63",5,":",2,null,14,"TM 76",16,10,1,5,43,":",27,16,31,"","TM 76","","","","","","","","","","","","","","","","","","","","","","","","","","","","","","","","","","","","","","","","","","","","","","","","","","","","","","","","","","","","","","","1 : 3","","2 : 0","","","","","","","","","","","","","","","","","","","","","","","","","","","","","","","","","","","","","","","1 : 5","","","","","","","","","","","","","","","","","","3 : 0","5 : 1","","","","","","","","","","","","1 : 3","","","","","2 : 0","2 : 5","","4 : 0","","","","","","","","","","","","","","","","","","0 : 0","","","","3 : 0","","","","","","","","","","","","","","","","0 : 4","","","","","","","","","","","2 : 1","9 : 2","","","","","","","","5 : 2","","","","3 : 1"]
[null,15,"FC Arsenal",null,null,null,15,153,164,"TM 153","-","TM 164",3,":",1,null,15,"TM 142",16,10,1,5,43,":",30,13,31,"","TM 142","","","","","","","","","","","","","","","","","","","","","","","","","","","","5 : 2","","","","","1 : 3","","","","","","","","","","","","","","","","","","","","","","","","","","","","","","","","","","","2 : 9","","","","","","1 : 3","","","","5 : 0","","","","","5 : 2","","","3 : 0","","","","","","","","","","","","","","","","","","","","1 : 3","","","","","","","","","","3 : 1","","","","","","","","","","","","","","5 : 1","","","","","","","","","","","","","","","","","","","","0 : 3","","","","","","1 : 0","3 : 0","","0 : 0","","","","","","","","","","","","","","","","","","","","","","","","","","5 : 2","3 : 1","","","","","","","","","","","","","","","","","","",""]
[null,16,"FC Brügge",null,null,null,16,163,189,"TM 163","-","TM 189",0,":",3,null,16,"TM 140",15,9,3,3,39,":",20,19,30,"","TM 140","","","","","","","","","","","","","","","","","","","","","","","","","","","","","","","","","","","","","","","","","","","","","","","","","","","","","","","","","","","","","","","","","","","","","","","","","","","","","","","","","","","","","","","","","","","","","","","","","","","","","","","0 : 0","","","","","","","","","","","","","","","","","","","","","","","","","","","","","","5 : 2","","","","3 : 0","","9 : 2","","","","","","","","","0 : 0","","","3 : 1","","","","1 : 0","","","","","3 : 1","","0 : 4","","","","","","0 : 3","5 : 1","0 : 0","","","","5 : 2","","","","","","","","","","","","","","","","","","","","","","","","","","","","0 : 3","5 : 1","",""]
[null,17,"Schachtjor Donezk",null,null,null,17,102,159,"TM 102","-","TM 159",9,":",2,null,17,"TM 109",15,9,3,3,37,":",19,18,30,"","TM 109","","","","","","","","","","","","","","","","","","","","","","","","","","","","","","","","","","","","","","","","","","","","","","","","","","","","","","","","","","","","","","","","","","","","","","","","","","","","","","","","","","","","","","","","","","","","","","","","","","","","","","","1 : 3","","","","","","","","","","","","","","","","","","","","","","","","2 : 0","","","","","","","","","","0 : 0","","5 : 1","","","","","","","","","","","","0 : 0","","","","","","","","","","","5 : 2","","5 : 2","","","","","0 : 4","3 : 0","1 : 0","","","3 : 1","","","","","","","","","","9 : 2","","","","","","","","","","","","0 : 4","","","3 : 0","","","","0 : 0","",""]
[null,18,"AC Mailand",null,null,null,18,161,83,"TM 161","-","TM 83",2,":",1,null,18,"OSC Lille",15,9,3,3,33,":",15,18,30,"","OSC Lille","","","","","","","","","","","","","","","","","","","","","","","","","","","","","","","","","","","","","","","","","","","","","","","","","","","","","","","","","","","","","","","","","","","","","","","","","","","","","","","","","","","","","","","","","","","","","","","","","","","","","","","1 : 3","","","","","","","","","","","","","","","","","","","","","","","","0 : 0","","","","","","","","","","2 : 0","","0 : 0","","","","","","","","","","","","0 : 0","","","","","","","","","","","0 : 3","","","","","","3 : 0","1 : 0","1 : 3","","","","2 : 0","","","","","","","","","","3 : 1","","","","","","","","","","","","5 : 2","","","3 : 0","","","9 : 2","3 : 1","",""]
[null,19,"Feyenoord Rotterdam",null,null,null,19,16,15,"FC Brügge","-","FC Arsenal",1,":",3,null,19,"TM 124",16,9,3,4,37,":",20,17,30,"","TM 124","","","","","","","","","","","","","","","","","","","","","","","","","","","","","","","","","","","","","","","","","","","","","","","","","","","","","","","","","","","","","","","","","4 : 0","","","","","","","","","","","","","","","","","","","","","","","","","","","","","","","","","","","","","","","3 : 0","","","","","","","","","","","","","","","","","","0 : 0","1 : 3","","","","","","","","","","","","3 : 1","","","","","0 : 3","1 : 0","","0 : 0","","","","","","","","","","","","","","","","","","2 : 5","","","","3 : 1","","","","","","","","","","","","","","","","2 : 0","","","","","","","","9 : 2","","","5 : 2","1 : 3","","","","","","","","0 : 0","","","","3 : 0"]
[null,20,"Sporting Lissabon",null,null,null,20,7,75,"Borussia Dortmund","-","TM 75",2,":",0,null,20,"TM 87",16,9,3,4,37,":",21,16,30,"","TM 87","","","","","","","","","","","","","","","","","","","","","","","","","","","","","","","","","","","","","","","","","","","","","","","","","","","","","","","","","","","","","","","","","","","3 : 0","","","","","","","","","","","","","","","","","","2 : 0","","","","9 : 2","","","","","","","","","","","","","","","","","","","","","","0 : 4","","","","","","","","","","","","","","","","","1 : 0","","","0 : 0","","","","","1 : 0","","","","","","","","","","0 : 3","","","0 : 0","","","","","","","","","5 : 2","","","","","","","","","","","","","","","","","","","","","2 : 0","0 : 3","","","","","","","9 : 2","5 : 1","","","","","","","0 : 0","","","","","","","","","0 : 4",""]
[null,21,"PSV Eindhoven",null,null,null,21,67,10,"TM 67","-","Bayer Leverkusen",0,":",0,null,21,"TM 118",16,9,3,4,34,":",19,15,30,"","TM 118","","","","","","","","","","","","","","","","","","","","","","","","","","","","","","","","","","","","","","","","","","","","","","","","","","","","","","","","","","","","","","","","","","","","","","","","","","","","","","","3 : 0","","","","","","","","","","","","","","0 : 0","","","","","","","","","3 : 0","","","5 : 2","","","1 : 0","","","","","1 : 3","","","","","","","","","","","","","","","","","","","","","0 : 3","","","","0 : 0","","","","","","","","","","","","","","","","","","","","","","","","","","","","1 : 3","3 : 1","","","","","","","","","2 : 0","","","","","","","9 : 2","","","","","","","","","","","3 : 0","","","0 : 0","3 : 1","","0 : 4","","","","",""]
[null,22,"Celtic Glasgow",null,null,null,22,158,172,"TM 158","-","TM 172",3,":",0,null,22,"TM 95",16,9,3,4,36,":",23,13,30,"","TM 95","","","","","","","","","","","","","","","","","","","","","","","","","","","","","","","","","","","","","","","","","","","","","","","","","","","","","","","","","","","","","","","","","","","","","","","","","","","","","","","","","","","","","","","","","","","","","","","","","","","","0 : 0","","","0 : 4","","","","","","","","","","","","","","","","9 : 2","","","","","5 : 2","1 : 0","","9 : 2","","","","","","","","","","","","","","","","","","","","","","","","2 : 0","","","","","","","","","","","","","0 : 3","","","","","","","2 : 1","0 : 3","","","0 : 4","","0 : 0","","","","","","","5 : 2","","","","","","2 : 0","","","","","","0 : 0","","","1 : 0","","","","","",""]
[null,23,"Dinamo Zagreb",null,null,null,23,48,6,"TM 48","-","Inter Mailand",0,":",0,null,23,"TM 170",16,9,3,4,33,":",20,13,30,"","TM 170","","","","","","","","","","","","","","","","","","","","2 : 5","","","","","","","","","","","0 : 0","","","","","","","","","","","","","","","","","","","","","","","","","","","","","","","","","","","","","","","","","","","","","","","","","","","","","","","","","","","","3 : 1","","","","","","","","","","","","","","","","","0 : 0","","","","","","","","","","","","","","","","","","1 : 3","","","","","","","","3 : 1","","","","3 : 0","","","","","","","","","1 : 0","","","","","","","","","","","","","","","","","","","1 : 0","2 : 0","","","","","","","","","","","0 : 3","","","","","0 : 3","","","","","","","","","","","0 : 0","","","5 : 1","9 : 2","","3 : 1","","","","",""]
[null,24,"Red Bull Salzburg",null,null,null,24,5,136,"FC Liverpool","-","TM 136",1,":",5,null,24,"TM 42",16,9,3,4,32,":",19,13,30,"","TM 42","","","","","","","","","","","","","","","","","","","","","","","","","","","","","","","","","","","","","","","","","","","","","","","","","","","","","","","","","","","","","","","","","","","","","","","","","","","","","","","","","","","","","","","","","","","","","","","","","","0 : 0","3 : 0","","","","","","","","","","","","","","","","","","","","","","","","","","","","","","","","","","3 : 1","","","","0 : 0","","3 : 1","","","2 : 5","","","","","","1 : 0","","","","","","","0 : 3","","","","","1 : 3","","9 : 2","","","","","","2 : 0","0 : 3","3 : 0","","","","3 : 1","","","","","","","","","","","","","","","","","","","","","","","","","","","","2 : 0","0 : 0","",""]
[null,25,"OSC Lille",null,null,null,25,60,45,"TM 60","-","TM 45",4,":",3,null,25,"TM 182",16,9,3,4,32,":",21,11,30,"","TM 182","","","","","","","","","","","","","","","","","","","","","","","","","","","","","","","","","","","","","","","","","","","","","","","","","","","","","","","","","","","","","","","","","","","","","","","","","","","","","","","","","","","","","","","","","","","","","","","","","","","","","","","","","3 : 1","","","3 : 0","","","","","0 : 3","","","","","","","","","","","","","3 : 1","","","","","","","","9 : 2","","","","0 : 0","","","","","","","","","0 : 0","","","","","","","","","","","","","","","","","","","0 : 0","0 : 3","","","","","","","","","1 : 0","","1 : 0","","","","","2 : 1","","","","","","","","","","","5 : 1","","","0 : 3","0 : 4","","5 : 2","","","","",""]
[null,26,"Roter Stern Belgrad",null,null,null,26,2,115,"Manchester City","-","TM 115",5,":",1,null,26,"Red Bull Salzburg",16,9,3,4,34,":",26,8,30,"","Red Bull Salzburg","","","","","","","","","","","","","","","","","","","","","","","","","","","","0 : 0","","","","","1 : 0","3 : 1","","","","","","","","","","","","","","","","","","","","","","","","","","","","","","","","","","0 : 0","","","","","","5 : 2","","","","0 : 4","","","","","0 : 2","","","2 : 9","","","","","","","","","","","","","","","","","","","","0 : 0","","","","","","","","","","0 : 4","","","","","","","","","","","","","","5 : 1","","","","","","","","","","","","","","","","","","","","9 : 2","","","","","","3 : 1","","","3 : 0","","","","","","","","","","","","","","","","","","","","","","","","","","2 : 0","1 : 0","","","","","","","","","","","","","","","","","","",""]
[null,27,"Young Boys Bern",null,null,null,27,100,145,"TM 100","-","TM 145",0,":",4,null,27,"TM 187",16,9,2,5,41,":",20,21,29,"","TM 187","","","","","","","","","","","","","","","","","","","","","","","","","","","","","","","","","","","","","","","","","","","","","","","","","2 : 0","","","","0 : 1","","","","9 : 2","","","","","","","","","","","","","","","","","","","","","","","","1 : 3","","","","","","","","","","","","","","","","","","","","","","","","","","","","3 : 0","0 : 0","","","","","","","","","","","","","","","","","","","4 : 0","","","","","","","2 : 0","","","","","","","","","","5 : 1","","","0 : 3","","","","","","","","","","","","","","5 : 1","","","","","","","","","","","","","","","","0 : 4","","","","","","","","1 : 0","","","","","","","","2 : 5","","","","","","","","","7 : 0",""]
[null,28,"AS Monaco",null,null,null,28,199,185,"TM 199","-","TM 185",5,":",2,null,28,"TM 94",16,9,2,5,38,":",21,17,29,"","TM 94","","","","","","","","","","","","","","","9 : 2","","","","","3 : 1","","","","","","","","","","","0 : 1","","","","","","0 : 0","","","","","","","","","","","","","","","","","","","","","","","","","","","","","","","","","","","","","","","","","","","","","","","","","","","","","","1 : 3","","","","","","","","","","","","","","","","0 : 3","","","","","","","","","","","","","","","","","","","2 : 0","","","","","","","","0 : 3","","","","5 : 1","","","","","","","","","3 : 0","","","","","","","","","","","","","","","","","","","","3 : 1","","","","","","","","","","","0 : 0","","","","","9 : 2","","","","","","","","","","","0 : 3","","","1 : 0","2 : 1","","","","","","",""]
[null,29,"Aston Villa",null,null,null,29,155,143,"TM 155","-","TM 143",3,":",1,null,29,"TM 86",16,9,2,5,37,":",23,14,29,"","TM 86","","","","","","","","","","","","","","","","","","","","","","","","","","","","","","","1 : 3","","","","","","","","","","","","","","","","","","","","","","","","","","","","","","","","","","","","","","","","","","","","","","","","","","","","","","","","","","","","0 : 3","","","","","","","","","","","","","","5 : 1","","","1 : 3","","","","","","","","","","","","","","","","","","5 : 1","","","","","","","","5 : 2","","","","3 : 1","","","","","","","","","2 : 0","","","","","","","","","","","","","","","","","","","2 : 0","0 : 4","","","","","","","","","","","0 : 0","","","","","0 : 0","","","","","","","","","","","9 : 2","","","3 : 0","1 : 0","","0 : 3","","","","",""]
[null,30,"FC Bologna",null,null,null,30,134,154,"TM 134","-","TM 154",0,":",3,null,30,"TM 166",16,9,2,5,35,":",21,14,29,"","TM 166","","","","","","","","1 : 3","","","","","","","","","2 : 5","","","","","","","","","","","","","","","","","","","","","","","","","","","","","","","","0 : 1","","","3 : 0","9 : 2","","","","0 : 0","","","","","","","","","","","","","","","","","","","","","","","","3 : 1","","","","","","4 : 0","","","","","","","","","","","","","","","","","","","","","","3 : 1","3 : 0","","","","","","","","","","","","","","","","","","","2 : 0","","","","","","","1 : 0","","","","","","","","","","","","","","","","","","","","","","","","","","","0 : 3","","","","","","","","","","","","","","","","2 : 0","","","","","","","","2 : 5","","","","","","","","0 : 0","","","","","","","","","",""]
[null,31,"FC Girona",null,null,null,31,68,125,"TM 68","-","TM 125",9,":",2,null,31,"Juventus Turin",15,9,2,4,34,":",20,14,29,"","Juventus Turin","","","","","","","","","","","","","","","","","","","","","","","","","","","","","","","","","","","","","","","","","","","","","","","","","","","","","","","","","","","","","","","","","","","","","","","","","","","","","","","","","","","","","","","","","","","","","","","","","","","","","","","","","","","","","","","","","","","","","","","","","","","","","","","1 : 3","","","","","","","","","","3 : 1","","0 : 3","","","","","","","","","","","","5 : 2","","","","2 : 0","","","","","","","3 : 1","","","","","","3 : 1","9 : 2","0 : 0","","","","0 : 4","","","","","","","","","","","","","","","","","","","","","","2 : 0","","","2 : 0","","","0 : 0","3 : 0","",""]
[null,32,"VfB Stuttgart",null,null,null,32,121,93,"TM 121","-","TM 93",3,":",1,null,32,"TM 193",16,9,2,5,35,":",22,13,29,"","TM 193","","","","","","","","","","","","","","","","","","","","","","","","","","","","","","","","","0 : 0","","","","","","","","","","","","","","","","","","","","","","","","","","","","","","","","","","","3 : 0","","","","","","0 : 4","","","","5 : 1","","","","","3 : 1","","","3 : 0","","","","","","","","","","","","","","","","","","","","2 : 0","","","","","","","","","","5 : 1","","","","","","","","","","","","","","9 : 2","","","","","","","","","","","","","","2 : 0","","","","","","0 : 3","","","","","","1 : 0","","","1 : 3","","","","","","","","","","","","","","","","","","","","","","","","","","1 : 3","0 : 0","","","","","","","","","","","","","","","","","","",""]
[null,33,"Sturm Graz",null,null,null,33,51,99,"TM 51","-","TM 99",1,":",3,null,33,"TM 121",16,9,2,5,35,":",23,12,29,"","TM 121","","","","","","","","","","","","","","","","","","","","","","","","","","","","","","","","","","","","","","","","","","","","","","","","","","","","","","","","","","","","","","","","","","","","5 : 1","","","","","","0 : 3","","","","","","","","","","","","","","","","","","","","","","","","","","","","","","","","3 : 1","","","","","","","","","","0 : 3","","","","","","","","","","","","","","3 : 1","","","","","","","","","","","","","","3 : 1","5 : 1","","","","","5 : 2","","","","3 : 1","","3 : 0","0 : 3","","1 : 3","","","","","","","","","","","","","","","","","","","","","","","3 : 0","","","0 : 0","0 : 0","","","","","","","","","","","","","","","","","","",""]
[null,34,"Stade Brest",null,null,null,34,98,52,"TM 98","-","TM 52",2,":",0,null,34,"TM 191",16,9,2,5,34,":",23,11,29,"","TM 191","","","","","","","","","","","","","","","","","","","","","","","","","","","","","","","","","","","","","","","","","","","","","","","","","","","","","","","","","","","","","","","","","","","","","","","","","","","","","","","","","","","","","","","","","","","","","","","","","","","","5 : 1","","","","","","","","","","","","","","","","","","","0 : 3","","","","","3 : 0","3 : 1","","3 : 0","","","","","","","","","","","","","","","","","","","","","","","","0 : 3","","","","","","","","","","","","","0 : 3","","","","","","","5 : 1","0 : 0","","","2 : 1","","0 : 0","","","","","","","1 : 3","","","","","","5 : 2","","","","","","3 : 1","","","3 : 1","","","","","",""]
[null,35,"Eintracht Frankfurt",null,null,null,35,59,149,"TM 59","-","TM 149",6,":",0,null,35,"TM 158",16,9,2,5,32,":",21,11,29,"","TM 158","","","","","","","","","","","","","","","","","","","","","","","","","","","","","","","","","","","","","","","","","","","","","","","","","","","","","","","","","","","","","","","","","","","","","","","","","","","5 : 1","","4 : 0","","","","","","","","","","","","","","","","","","","","","","","","","","","","","","","","","","","","","","","1 : 3","","","","","0 : 3","","","","","","","","","","","1 : 3","","","","","","","","","","","","0 : 4","3 : 1","","","","","5 : 1","","0 : 0","","2 : 1","","","0 : 0","","3 : 0","","","","","","","","","","","","","","3 : 0","","","","","","","","","2 : 0","","","3 : 1","0 : 3","","","","","","","","","","","","","","","","","","",""]
[null,36,"Mainz 05",null,null,null,36,198,94,"TM 198","-","TM 94",3,":",0,null,36,"TM 112",16,9,2,5,31,":",20,11,29,"","TM 112","","","","","","","","","","","","","","","","","","","","","","","","","","","","","","","","","","","","","","","","","","","","","","","","","","","","","","","","","","","","","","","","","","","","","","","","","","","","","","","","","","","","","","","","","","","","","","","","","","1 : 3","","","","","2 : 0","","","","","","","","","","","","","","","","","","","","","","","","","","","","","","0 : 3","","","","1 : 3","","3 : 0","","","1 : 0","","","","","","2 : 0","","","","","","","0 : 0","","","","","5 : 1","","1 : 0","","","","","","0 : 4","0 : 0","3 : 1","","","","0 : 3","","","","","","","","","","","","","","","","","","","","","","","","","","","","3 : 0","9 : 2","",""]
[null,37,"AC Roma",null,null,null,37,160,196,"TM 160","-","TM 196",0,":",0,null,37,"TM 43",16,9,2,5,34,":",24,10,29,"","TM 43","","","","","","","","","","","","","","","","","","","","","","","","","","","","","","","","","","","","","","","","","","","","","","","","","","","","","","","","","","","","","","","","","","","","","","","","","","","","","","","","","5 : 1","","","","","","1 : 3","","","","","","","","","","","","","","","","","","","","","","3 : 1","0 : 3","","","","","","","","","","","","","","","","","","","0 : 0","","3 : 1","","","","","0 : 4","","","","","","","","","","1 : 3","","","5 : 1","","","","","","","","","","","","","","3 : 0","","","","","","","","","","","","","","","","0 : 0","3 : 0","","","","","","","5 : 2","3 : 1","","","","","","","2 : 1","","","","","","","","","0 : 3",""]
[null,38,"FC Basel",null,null,null,38,194,38,"TM 194","-","FC Basel",1,":",0,null,38,"TM 162",16,9,2,5,33,":",25,8,29,"","TM 162","","","","","","","","","","","","","","","","","","","","","","","","","","","","","","","","","","","","","","","","","","","","","","","","","1 : 5","","","","1 : 3","","","","","","","","","","","","","","","","","","","","","","","","","","","","0 : 3","","","","","","3 : 1","","","","","","","","","","","","","","","","","","","","","","5 : 2","1 : 0","","","","","","","","","","","","","","","","","","","3 : 0","","","","","","","5 : 1","","","","","","","","","","2 : 1","","","0 : 3","","","","","","","","","","","","","","0 : 0","","","","","","","","","","","","","","","","3 : 0","","","","","","","","1 : 3","5 : 2","","","","","","","0 : 0","","","","","","","","","3 : 1",""]
[null,39,"FC Lille",null,null,null,39,17,29,"Schachtjor Donezk","-","Aston Villa",0,":",3,null,39,"TM 41",16,9,2,5,34,":",29,5,29,"","TM 41","","","","","","","","","","","","","","","","","","","","","","","","","","","","","","","","","","","","","","","","","","","","","","","","","","","","","","","","","","","","","","","","0 : 2","","","2 : 9","","","","","","","","","","","","","","","","","1 : 0","0 : 0","","","","3 : 1","","","","","","","","","","","","","","","","","","","","","","5 : 2","","","","","","","","","","","","","","","","","0 : 3","","","3 : 0","","","","","0 : 3","","","","","","","","","","9 : 2","","","1 : 0","","","","","","","","","3 : 1","","","","","","","","","","","","","","","","","","","","","0 : 0","2 : 0","","","","","","","","0 : 4","","","","","","","","","","","","","","","","5 : 2",""]
[null,40,"Hertha BSC",null,null,null,40,193,137,"TM 193","-","TM 137",5,":",1,null,40,"TM 123",16,9,2,5,28,":",24,4,29,"","TM 123","","","","","","","","","","","","","","","","","3 : 1","","","","","","","","","","","","","","","","","","","","","","","","","","","","","","","","3 : 0","","","","3 : 1","","","","0 : 3","","","","","","","","","","","","","","","","","","","","","","","","1 : 0","","","","","","2 : 5","","","","","","","","","","","","","","","","","","","","","","1 : 3","1 : 5","","","","","","","","","","","","","","","","","","","0 : 0","","","","","","","0 : 3","","","","","","","","","","","","","1 : 0","","","","","","","","","","","","","","2 : 0","","","","","","","","","","","","","","","","0 : 0","","","","","","","","3 : 1","","","","","","","","","","","","","","","","","5 : 2",""]
[null,41,"TM 41",null,null,null,41,150,97,"TM 150","-","TM 97",0,":",4,null,41,"TM 104",16,9,1,6,39,":",27,12,28,"","TM 104","","","","","","","","","","","","","","","","","","","","","","","","","","","","","","","","","","","","","","","","","","","","","","","","","","","","","","","","","","","","","","","0 : 0","","0 : 1","","","","","","","","","","","","","","","","","","","","","","","","","","","","","","","","","","","","","","","1 : 3","","","","","","","","","","","","","","","","9 : 2","","3 : 1","0 : 3","","","","","","","","","","","","","","","","","0 : 4","3 : 1","","2 : 0","","","","","","","","","","","","","","","","","","3 : 0","","","","1 : 5","","","","","","","","","","","","","","","","9 : 2","","","","","","","","","","","0 : 3","1 : 0","","","","","","","","2 : 1","","","",""]
[null,42,"TM 42",null,null,null,42,142,170,"TM 142","-","TM 170",5,":",2,null,42,"TM 80",16,8,4,4,29,":",17,12,28,"","TM 80","","","","","","","","","","","","","","","","","","","","","","","","","","","","","","","","","","","","","","","","","","","","","","","","","","","","","","","","","","","","","","","","","0 : 0","","","","","","","","","","","","","","","","","","","","","","","","","","","","","","","","","","","","","","","3 : 1","","","","","","","","","","1 : 3","","","","","","","","","0 : 0","","","","","","","","","","","","3 : 0","","","","","0 : 0","2 : 0","","1 : 3","","","","","","","","","","","","","","","","","","1 : 0","","","","0 : 3","","","","","","","","","","","","","","","","0 : 3","","","","","","","","1 : 0","","","0 : 0","5 : 1","","","","","","","","9 : 2","","","","3 : 1"]
[null,43,"TM 43",null,null,null,43,168,116,"TM 168","-","TM 116",1,":",3,null,43,"TM 135",16,9,1,6,39,":",29,10,28,"","TM 135","","","","","","","","","","","","","","","","","","","","","","","","","","","","","","","","","","","","","","","","","","","","","","","","","","","","","","","","","","","","","","","","","","","","","","","","","","","","","","","","","","","","","","","","","","","","","5 : 2","","","","","","","","","2 : 0","","","3 : 1","","","0 : 3","","","","","1 : 3","","","","","","","","","","","","","","","","","","","","","2 : 0","","","","0 : 3","","","","","","","","","","","","","","","","","","","","","","","","","","","","5 : 1","1 : 3","","","","","","","","","0 : 4","","0 : 4","","","","","0 : 0","","","","","","","","","","","3 : 1","","","5 : 2","3 : 0","","9 : 2","","","","",""]
[null,44,"TM 44",null,null,null,44,24,86,"Red Bull Salzburg","-","TM 86",3,":",1,null,44,"TM 60",16,8,4,4,29,":",20,9,28,"","TM 60","","","","","","","","","","","","","","","","","","","","","","","","","","","","","","","","0 : 2","","","1 : 0","","","","","","","","5 : 1","","0 : 3","","","","","","","","","","","","","1 : 3","0 : 0","","","","","","","3 : 1","","","","","","","","","","","","","","","","","","","","","","","","","","","","","","","","","","","","","","","","","","","","","","","","0 : 0","","","","","","","","","","","","","","","","","","","","","5 : 1","","","","","0 : 4","","","","","","","","","","","","","0 : 0","","","","","","","","","","","","","","","","","","","","","","","","","","","","2 : 0","","","","","","","","5 : 2","","","4 : 3","","","","","","","","","0 : 0","","","","3 : 0"]
[null,45,"TM 45",null,null,null,45,133,166,"TM 133","-","TM 166",0,":",2,null,45,"TM 139",16,8,4,4,27,":",18,9,28,"","TM 139","","","","","","","","","","","","","","","","","","","","","","","","","","","","","","","","","","","","","","","","","","","","","","","","","","","","","","","","","","","","","","","","","","","","","","","","","","","","","","","","","","","","","","","","","","","","","","","","","","","","","","","","0 : 3","","","","","","","","","","5 : 1","","","","","","","","","5 : 2","","","","","","","","","","","","3 : 1","","","","","1 : 3","0 : 4","","5 : 1","","","","","","","","","","0 : 0","","","","","","","","2 : 0","","","","0 : 0","","","","","","","","","","","","","","","","0 : 0","","","","","","","","","","","0 : 0","3 : 0","","","","","","","","1 : 0","","","","0 : 3"]
[null,46,"TM 46",null,null,null,46,37,173,"AC Roma","-","TM 173",0,":",0,null,46,"TM 98",16,8,4,4,30,":",23,7,28,"","TM 98","","","","","","","","","","","","","","","","","","","","","","","","","","","","","","","","","","","","","","","","","","","","","","","","","","","","","","","","","","","","","","","","","","","","0 : 0","","","","","","2 : 2","","","","","","","","","","","","2 : 0","","","","","","","","","","","","","","","","","","","","0 : 4","","","","","","","","","","0 : 3","","","","","5 : 2","","","","","","","","","1 : 0","","","","","","","","","","","","","","1 : 0","","","","","","0 : 0","","","","0 : 0","","5 : 2","2 : 0","","0 : 3","","","","","","","","","","","","","","","","","","","","","","","9 : 2","","","3 : 1","0 : 4","","","","","","","","","","","","","","","","","","",""]
[null,47,"TM 47",null,null,null,47,157,70,"TM 157","-","TM 70",0,":",3,null,47,"TM 153",16,9,1,6,32,":",28,4,28,"","TM 153","","","","","","","","","","","","","","","","","","","","","","","","","","","","","","","","","","","0 : 3","","","","","","","","","","","","","","","","","","","","","","","0 : 3","","","","","","","","","","","","","","","","","","","","","","","","","","","","","","","","","","","","","","","","","","","","","","","","","","","","","","","","3 : 1","","","","","","","","","9 : 2","","","","","","","","","","","","0 : 4","","","","","3 : 0","0 : 3","","3 : 1","","","","","","","","","","1 : 0","","","","","","","","","","","","1 : 0","","","","","","","","","","","","","","","","2 : 1","","","","","","","","0 : 0","","","5 : 1","0 : 3","","","","","","","","0 : 4","","","","5 : 2"]
[null,48,"TM 48",null,null,null,48,192,182,"TM 192","-","TM 182",0,":",0,null,48,"TM 48",16,8,4,4,25,":",21,4,28,"","TM 48","","","","","","","","","","","","","","","","","","","","","","","","","","","","","","","","1 : 0","","","2 : 9","","","","","","","","3 : 1","","1 : 3","","","","","","","","","","","","","3 : 0","","","","","","","","0 : 0","","","","","","","","","","","","","","","","","","","","","","","","","","","","","","","","","","","","","","","","","","","","","","","","0 : 0","","","","","","","","","0 : 0","","","","","","","","","","","","1 : 3","","","","","2 : 0","","","","","","","","","","","","","3 : 0","","","","","","","","","","","","","","","","","","","","","","","","","","","","1 : 0","","","","","","","","0 : 0","","","3 : 1","","","","","","","","","0 : 3","","","","5 : 1"]
[null,49,"TM 49",null,null,null,49,108,123,"TM 108","-","TM 123",0,":",1,null,49,"TM 171",16,9,1,6,32,":",32,0,28,"","TM 171","","","","","","","","","","","","","","","","","","","","","","","","","","","","","","","","","","","","","","","","","","","","","","","","","","","","","","","","","","","","","","","","","","","","","","","","","","","","","","","","","","","","","","","","","","","","","","","","","","","","","","","0 : 3","","","","","","","","","","","","","","","","","","","","","","","","5 : 2","","","","","","","","","","0 : 3","","","","","","","","","","","","","","2 : 9","","","","","","","","","","","1 : 0","","3 : 0","","","","","1 : 0","3 : 1","3 : 1","","","0 : 3","","","5 : 1","","","","","","","0 : 3","","","","","","","","","","","","3 : 1","","","0 : 0","","","","5 : 2","",""]
[null,50,"TM 50",null,null,null,50,114,110,"TM 114","-","TM 110",3,":",0,null,50,"TM 69",16,8,3,5,37,":",23,14,27,"","TM 69","","","","","","","","","","","","","","","","","","","","","","","","","","","","","","","","","","","","","","","","","","","","","","","","","","","","","","","","","","","","","","","","","","","","","","","","","","","","","","","","","","","","","","","","","0 : 3","","","","","","","","","","","","","","","","","","","","9 : 2","0 : 4","5 : 1","","","","","","","","","","","","","","","","","0 : 0","","","2 : 0","","","","","0 : 0","","","","","","","","","","0 : 0","","","3 : 0","","","","","","","","","0 : 4","","","","","","","","","","","","","","","","","","","","","1 : 3","1 : 0","","","","","","","0 : 3","9 : 2","","","","","","","2 : 0","","","","","","","","","5 : 1",""]
[null,51,"TM 51",null,null,null,51,200,187,"TM 200","-","TM 187",1,":",5,null,51,"TM 134",16,8,3,5,35,":",24,11,27,"","TM 134","","","","","","","","","","","","","","","","","","","","","","","","","","","","","","","","","","","","","","","","","","","","","","","","","","","","","","","","","","","","","","","","","","","","2 : 0","","","","","","0 : 3","","","","","","","","","","","","","","","","","","","","","","","","","","","","","","","","","","","","","","","","","","0 : 0","","","","","0 : 4","","","","","","","","","0 : 0","","","","","","","","","","","","","","0 : 0","9 : 2","","","","","5 : 2","","","","2 : 0","","0 : 4","1 : 3","","1 : 0","","","","","","","","","","","","","","1 : 0","","","","","","","","","0 : 3","","","9 : 2","5 : 1","","","","","","","","","","","","","","","","","","",""]
[null,52,"TM 52",null,null,null,52,186,135,"TM 186","-","TM 135",4,":",0,null,52,"TM 67",16,8,3,5,34,":",26,8,27,"","TM 67","","","","","","","","","","","","","","","","","","","","","","","","","","","","","","","","2 : 9","","","0 : 0","","","","","","","","","","3 : 0","","","","","","","","","","","","","1 : 3","","","","","","","","3 : 0","","","","","","","","","","","","","","","","","","","","","","","","","","","","","","","","","","","","","","","","","","","","","","","","5 : 2","","","","","","","","","0 : 3","","","","","","","","","","","","0 : 0","","","","","1 : 0","","","","","","","","","","","","","2 : 0","","","","","","","","","","","","","","","","","","","","","","","","","","","","9 : 2","","","","","","","","1 : 3","","","3 : 0","0 : 0","","","","","","","","3 : 1","","","","1 : 3"]
[null,53,"TM 53",null,null,null,53,53,162,"TM 53","-","TM 162",2,":",5,null,53,"TM 116",16,8,3,5,28,":",21,7,27,"","TM 116","","","","","","","","1 : 5","","","","","","","","","3 : 1","","","","","","","","","","","","","","","","","","","","","","","","","","","","","","","","3 : 1","","","3 : 0","0 : 3","","","","3 : 1","","","","","0 : 0","","","","","","","","","","","","","","","","","","","0 : 2","","","","","","4 : 0","","","","","","","","","","","","","","","","","","","","","","0 : 0","1 : 3","","","","","","","","","","","","","","","","","","","3 : 0","","","","","","","3 : 1","","","","","","","","","","","","","","","","","","","","","","","","","","","0 : 3","","","","","","","","","","","","","","","","","","","","","","","","3 : 0","","","","","","","","1 : 1","","","","","","","","","",""]
[null,54,"TM 54",null,null,null,54,113,118,"TM 113","-","TM 118",1,":",3,null,54,"TM 107",16,8,3,5,31,":",25,6,27,"","TM 107","","","","","","","","","","","","","","","","","","","","","","","","","","","","","","","","","","","","","","","","","","","","","","","","","0 : 0","","","","","","","","","","","","","","","","","","","","","","","","","","","","","","","","2 : 0","","","","","","1 : 0","","","","","","","","","","","","","","","","","","","","","","0 : 0","0 : 3","","","","","","","","","","","","","","","","","","","2 : 5","","","","","","","0 : 0","","","","","","","","","","0 : 4","","","9 : 2","","","","","","","","","","","","","","0 : 4","","","","","","","","","","","","","","","","5 : 2","4 : 1","","","","","","","0 : 3","2 : 0","","","","","","","5 : 1","","","","","","","","","1 : 0",""]
[null,55,"TM 55",null,null,null,55,105,107,"TM 105","-","TM 107",1,":",4,null,55,"TM 173",16,8,3,5,28,":",23,5,27,"","TM 173","","","","","","","","","","","","","","","","","","","","","","","","","","","","","","","","","","","","","","","","","","","","","","","","","","","","","","","","","","","","","","","","","","","","","","","","","","","","","","","","","","","","","","","","","","","0 : 0","","","","","","","","","","","","","","3 : 0","","","5 : 1","","","","","","","","","","","","","","","","","","3 : 0","","","","","","","","1 : 0","","","","0 : 3","","","","","","","","","0 : 4","","","","","","","","","","","","","","","","","","","0 : 4","0 : 0","","","","","","","","","5 : 2","","5 : 2","","","","","1 : 3","","","","","","","","","","","0 : 3","","","3 : 1","","","0 : 0","","","","",""]
[null,56,"TM 56",null,null,null,56,190,85,"TM 190","-","TM 85",2,":",2,null,56,"Borussia Dortmund",16,8,3,5,28,":",24,4,27,"","Borussia Dortmund","","","","","","","","","","","","","","","","","","","","","","","","","","","","","","","","","","","","","","","","","","","","","","","","","","","","","","","","","","","","","","","","","","","","","","","","","","","2 : 0","","0 : 0","","","","","","","","","","","","","3 : 0","","","","","","","","","","","","","","","","","","","","","","","","","","0 : 4","","","","","0 : 3","","","","","","","","","","","1 : 0","","","","","","","","","","","","0 : 0","0 : 0","","","","","9 : 2","","2 : 5","","3 : 1","","","5 : 2","","","","","","","","","","","","","","","","0 : 4","","","","","","","","","0 : 3","","","2 : 0","1 : 0","","","","","","","","","","","","","","","","","","",""]
[null,57,"TM 57",null,null,null,57,61,43,"TM 61","-","TM 43",1,":",3,null,57,"TM 73",16,8,3,5,27,":",23,4,27,"","TM 73","","","","","","","","","","","","","","","","","","","","","","","","","","","","","","","","","","","","","","","","","","","","","","","","","","","","","","","","","","0 : 0","","","","","","","","","","","","","","","","","","","","","","","","","","","","","","","","","","","","","","","","","","","","","","","","","","","","","","","","3 : 0","","","","","","","","","1 : 0","","","","","","","","","","","","0 : 3","","","","","5 : 1","0 : 0","","3 : 0","","","","","","","","","","5 : 2","","","","","","","","0 : 4","","","","5 : 2","","","","","","","","","","","","","","","","0 : 3","","","","","","","","0 : 4","","","0 : 3","3 : 1","","","","","","","","2 : 0","","","","0 : 0"]
[null,58,"TM 58",null,null,null,58,111,179,"TM 111","-","TM 179",3,":",1,null,58,"FC Bologna",16,8,3,5,25,":",21,4,27,"","FC Bologna","","","","","","","","","","","","","","","","","","","3 : 1","","","","","","","","","","","","","","","","","","","","","","","","","","","0 : 0","","","","","","","","","","","","","","","","","","","2 : 5","","","","","","","","","","","","","","","","","","","","","","","","","","","","","","3 : 0","","","","","","","","","0 : 2","","","","","","","","","","","","","","","","2 : 0","","3 : 1","2 : 0","","","","","","","","","","","","","","","","","","1 : 3","","3 : 1","","","","","","","","","","","","","","","","","","0 : 0","","","","1 : 0","","","","","","","","","","","","","","","","0 : 0","","","","","","","","","","0 : 4","5 : 1","0 : 3","","","","","","","","","","","",""]
[null,59,"TM 59",null,null,null,59,138,91,"TM 138","-","TM 91",0,":",2,null,59,"TM 148",16,8,3,5,28,":",25,3,27,"","TM 148","","","","","","","","","","","","","","","","","","","","","","","","","","","","","","","","","","","","","","","","","","","","2 : 0","","","","","","","","","","","","","","","","","","","","","","","","","","","","","","","","","","","","","","","","","","","","","","","","","","","","","","4 : 0","1 : 5","","","","","","","","","","","","","","","","","","","","","","","","","","","","","","","","","","3 : 0","","","","0 : 3","","1 : 3","","","0 : 0","","","","","","2 : 5","","","","","","","3 : 1","","","","","0 : 0","","0 : 0","","","","","","2 : 1","2 : 0","3 : 1","","","","","","","","","","","","","","","","","","","","","","","","","","","","","","","","0 : 4","5 : 2","",""]
[null,60,"TM 60",null,null,null,60,151,3,"TM 151","-","FC Bayern München",0,":",0,null,60,"Dinamo Zagreb",16,8,3,5,29,":",29,0,27,"","Dinamo Zagreb","","","","","","","","","","","","","","","","","","","0 : 2","","","","","0 : 4","","","","","","","","","","","","","","","","","","","","","","1 : 0","0 : 0","","","","","","","","","","","","","","","","5 : 2","","","","","","","","","","","","","","","","","","","","","","","","","","","","","","","","2 : 9","","","","","","","","","3 : 0","","","","","","","","","","","","","","","","0 : 0","","3 : 1","2 : 5","","","","","","","","","","","","","","","","","","4 : 0","","1 : 5","","","","","","","","","","","","","","","","","","2 : 0","","","","0 : 0","","","","","","","","","","","","","","","","","","","","","","","","","","3 : 1","","3 : 0","","","","","","","","","","","",""]
[null,61,"TM 61",null,null,null,61,127,19,"TM 127","-","Feyenoord Rotterdam",0,":",3,null,61,"TM 70",16,8,2,6,36,":",21,15,26,"","TM 70","","","","","","","","4 : 0","","","","","","","","","0 : 2","","","","","","","","","","","","","","","","","","","","","","","","","","","","","","","","1 : 3","","","","0 : 0","","","","0 : 3","","","","","","","","","","","","","","","","","","","","","","","","3 : 1","","","","","","3 : 0","","","","","","","","","","","","","","","","","","","","","","0 : 1","2 : 0","","","","","","","","","","","","","","","","","","","1 : 5","","","","","","","1 : 3","","","","","","","","","","","","","","","","","","","","","","","","","","","9 : 2","","","","","","","","","","","","","","","","5 : 1","","","","","","","","0 : 0","","","","","","","","4 : 0","","","","","","","","","3 : 0",""]
[null,62,"TM 62",null,null,null,62,57,152,"TM 57","-","TM 152",0,":",0,null,62,"TM 92",16,8,2,6,39,":",25,14,26,"","TM 92","","","","","","","","","","","","","","","","","","","","","","","","","0 : 3","","","","","","","","","","","","","","","","","","","9 : 2","","","","","","","","","","","","","","","","","","","","","","","","","","","","","","","","","","","","","","","","","","","","","","","","","","","","","","0 : 1","0 : 0","","0 : 3","","","","","","","","","","","","","","","","","","","","","","","","","","","","","","","","1 : 3","","","","","","0 : 3","","","3 : 1","","","","","","3 : 0","","","","","","","0 : 0","","","","","5 : 2","","","","","","","","3 : 1","9 : 2","5 : 1","","","","","","","","","","","","","","","","","","","","","","","","","","","","","","","","1 : 0","0 : 3","",""]
[null,63,"TM 63",null,null,null,63,126,79,"TM 126","-","TM 79",0,":",1,null,63,"TM 136",16,8,2,6,34,":",22,12,26,"","TM 136","","","","","","","","","3 : 0","5 : 1","","","","","0 : 3","","","","","9 : 2","","","","","","","","","","","0 : 0","","","","","","0 : 3","1 : 5","","","","","","","","","","","","","0 : 0","","","","","0 : 2","","","","","","","","","","","","","","3 : 1","","","","","","","","","","","","","","","","","","","","","3 : 1","","","","","","","","","","","","","","","","4 : 0","","","","","","","","","","","","","","","","","","","1 : 3","","","","","","","","","","","","","","","","","","","","","0 : 1","","","","","","","","","","","","","","","","","","","","2 : 0","","","","","","","","","","","3 : 0","","","","","","","","","","","","","","","","","","","","","","","","","","",""]
[null,64,"TM 64",null,null,null,64,49,144,"TM 49","-","TM 144",3,":",0,null,64,"Feyenoord Rotterdam",16,8,2,6,35,":",26,9,26,"","Feyenoord Rotterdam","","","","","","","","","","","","","","","","","","","","","","","","","","","","","","","","","","","","","","","","","","","","","","","","","","","","","","","","","","","","","","","","","","","","","","","","","","","","","","","","","0 : 4","","","","","","","","","","","","","","","","","","","","","","","","","","","","0 : 3","5 : 1","","","","","","","","","","","","","","","","","","3 : 0","","","1 : 3","","","","","3 : 0","","","","","","","","","","2 : 0","","","0 : 4","","","","","","","","","5 : 1","","","","","0 : 0","","","","","","","","","","","","","","","","3 : 1","0 : 0","","","","","","","3 : 1","0 : 3","","","","","","","1 : 3","","","","","","","","","9 : 2",""]
[null,65,"TM 65",null,null,null,65,9,69,"FC Barcelona","-","TM 69",1,":",5,null,65,"Manchester City",16,8,2,6,32,":",25,7,26,"","Manchester City","","","","","","","","","","","","","","","","","","","","","","","","","","","","","","","","","","","","","","","","","","","","","","","","","","","","","","","","","","","","","","","","","","","","1 : 3","","","","","","","0 : 4","","","","","","","","","","","","","","","","","","","","","","","","","","","","","","","","","","","","","","","","","2 : 0","","","","","5 : 1","","","","","","","","","","","2 : 0","","","","","","","","","","","","","0 : 3","","","","","0 : 4","","","","1 : 3","","5 : 1","1 : 0","","0 : 0","","","","","","","","","","","","","","0 : 0","","","","","","","","","3 : 1","","","0 : 3","9 : 2","","","","","","","","","","","","","","","","","","",""]
[null,66,"TM 66",null,null,null,66,34,50,{"$f":"IFERROR(VLOOKUP($H71,$B$6:$C$205,2,0),\"\")","v":"Stade Brest"},"-",{"$f":"IFERROR(VLOOKUP($I71,$B$6:$C$205,2,0),\"\")","v":"TM 50"},4,":",0,null,65,"TM 55",16,8,2,6,32,":",25,7,26,"","TM 55","","","","","","","","","","","","","","","","","","","","","","","","","","","","","","","","","","","","","","","","","","","","","","","","","","","","","","","","","","","","","","","","","","","","","","","","","","","","","","","","","","","","","","","","","","","","","","","","","","","","","","","0 : 0","","","","","","","","","","","","","","","","0 : 4","","","","","","","","1 : 0","","","","","","","","","","5 : 1","","","","","","","","","","","","","","0 : 4","","","","","","","","","","","1 : 3","","5 : 1","","","","","","","3 : 0","0 : 0","","0 : 3","2 : 0","","1 : 3","","","","","","","3 : 1","","","","","","0 : 3","","","","","","","","","2 : 0","","","","","",""]
[null,67,"TM 67",null,null,null,67,54,184,"TM 54","-","TM 184",2,":",5,null,67,"Benfica Lissabon",16,8,2,6,29,":",22,7,26,"","Benfica Lissabon","","","","","","","","","","","","","","","","","","","","","","","","","","","","","","","","","","","","","","","","","","","","","","","","","","","","","","","","","","","","","","","","","","","","","","","","","","","","","","","","","","","","","","","","0 : 1","","","","0 : 0","","","","","4 : 0","","","1 : 3","","","","","","","","","","","","2 : 0","","","","","","","3 : 1","","","","","5 : 1","3 : 0","","","","","","","","","","","","","","","","","","","","","","","","","","","","","","","","","","","","","","","0 : 0","","","","","","","0 : 3","2 : 0","","","2 : 5","","0 : 4","","","","","","","5 : 1","","","","","","1 : 0","","","","","","1 : 3","","","","","","","","",""]
[null,68,"TM 68",null,null,null,68,27,147,"Young Boys Bern","-","TM 147",3,":",1,null,68,"TM 156",16,8,2,6,29,":",24,5,26,"","TM 156","","","","","","","","","","","","","","","","","","","","","","","","","","","","","","","","","","","","","","","","","","","","","","","","","","","","","","","","","","","","","","","","","","","","","","","","","","","","","","","","","","","","","","","","","","","","","","","","","","","","","","","3 : 0","","","","","","","","","","","","","","","","5 : 1","","","","","0 : 0","0 : 3","","0 : 0","","","","","","","","","","","","","","","","","","","","","","","","5 : 1","","","","","","","","","","","","","0 : 3","","","","","","","0 : 4","3 : 0","","3 : 1","1 : 3","","3 : 1","","","","","","","2 : 0","","","","","","3 : 1","","","","","","0 : 3","","","1 : 3","","","","","",""]
[null,69,"TM 69",null,null,null,69,92,87,"TM 92","-","TM 87",0,":",3,null,69,"TM 154",16,8,2,6,33,":",29,4,26,"","TM 154","","","","","","","","","","","","","","","1 : 3","","","","","3 : 1","","","","","","","","","","","2 : 5","","","","","","4 : 0","3 : 0","","","","","","","","","","","","","2 : 2","","","","","3 : 0","","","","","","","","","","","","","","","","","","","","","","","","","","","","","","","","","","","2 : 5","","","","","","","","","","","","","","","","1 : 5","","","","","","","","","","","","","","","","","","","3 : 1","","","","","","","","2 : 0","","","","","","","","","","","","","0 : 0","","","","","","","","","","","","","","","","","","","","1 : 3","","","","","","","","","","","1 : 0","","","","","","","","","","","","","","","","5 : 1","","","0 : 3","","","","","","","",""]
[null,70,"TM 70",null,null,null,70,84,169,"TM 84","-","TM 169",1,":",2,null,70,"FC Girona",16,8,2,6,28,":",25,3,26,"","FC Girona","","","","","","","","","0 : 3","0 : 0","","","","","","","","","","","","","","","","","","","","","","","","","","","","","","1 : 5","","","","","","","","","","","","","","","","","","","","","0 : 2","","","","","","","","","4 : 0","","","","","","","1 : 3","","","","","3 : 1","","","","","","","","0 : 0","","","","3 : 0","","","","","","","","","","","","","","","","","","","","","","","","2 : 1","","","3 : 1","","","","","","","","","","","5 : 2","","","","","","","","","","","","","0 : 3","","","","","","","2 : 0","","","","","","","","","","","","","","","","","","","","","3 : 1","","","","","","","","","","","","","","","","","","1 : 3","","","","","","","","","","","","","",""]
[null,71,"TM 71",null,null,null,71,44,82,"TM 44","-","TM 82",3,":",1,null,71,"TM 130",15,8,2,5,26,":",23,3,26,"","TM 130","","","","","","","","","","","","","","","","","","","","","","","","","","","","","","","","","","","","","","","","","","","","","","","","","","","","","","","","","","","","","","","","","","","","","","","","","","","","","","","","","","","","","","","","","","","","","","","","","","5 : 1","","","","","0 : 4","","","","","","","","","","","","","","","","","","","","","","","","","","","","","","0 : 4","","","","5 : 1","","1 : 0","","","","","","","","","0 : 4","","","","","","","5 : 2","","","","","3 : 0","","2 : 0","","","","","","","1 : 3","0 : 3","","","","0 : 0","","","","","","","","","","","","","","","","","","","","","","","","","","","","3 : 1","1 : 0","",""]
[null,72,"TM 72",null,null,null,72,96,195,"TM 96","-","TM 195",1,":",3,null,72,"Celtic Glasgow",16,8,2,6,26,":",24,2,26,"","Celtic Glasgow","","","","","","","","","","","","","","","","","","","","","","","","","","","","","","","","","","","","","","","","0 : 4","","","","","","","","","","","","","","","","","","","","","0 : 0","","","","","","","","","","","","","","3 : 1","","","","","","","0 : 2","","","","","","","","3 : 1","","","","5 : 1","","","","","","","","","","","","","","","","","","","","","","","","0 : 3","","","3 : 0","","","","","","","","","","","3 : 1","","","","","","","","","","","","1 : 2","3 : 1","","","","","","","2 : 0","","0 : 0","","","","","","","","","","","","","","","","","","","0 : 3","","","","","","","","","2 : 5","","","","","","","","","1 : 0","","","","","","","","","","","","","",""]
[null,73,"TM 73",null,null,null,73,148,41,"TM 148","-","TM 41",2,":",0,null,73,"TM 137",16,8,2,6,28,":",29,-1,26,"","TM 137","","","","","","","","","","","","","","","","","","","","0 : 5","","","","","","","","","","","4 : 0","","","","","","1 : 5","","","","","","","","","","","","","","","","","","","","","","","","","","","","","","","","","","","","","","","","","","","","","","","","","","","","","","3 : 0","","","","","","","","","","","","","","","","","0 : 3","","","","","","","","","","","","","","","","","","0 : 0","","","","","","","","1 : 3","","","","3 : 1","","","","","","","","","2 : 5","","","","","","","","","","","","","","","","","","","","1 : 0","","","","","","","","","","","3 : 1","","","","","2 : 0","","","","","","","","","","","5 : 2","","","0 : 4","","","3 : 0","","","","",""]
[null,74,"TM 74",null,null,null,74,32,62,"VfB Stuttgart","-","TM 62",0,":",0,null,74,"TM 122",16,8,2,6,25,":",26,-1,26,"","TM 122","","","","","","","","","","","","","","","","","","","","","","","","","","0 : 3","","","","","","","","","","","","","","","","","","","","","","","","","","","","","","","","","","","","","","","","","","","","","","","","","","","","","","","","","","","","","","3 : 1","","","","2 : 5","","","","","0 : 0","","","1 : 0","","","","","","","","","","","","3 : 0","","","","","","","1 : 5","","","","","2 : 0","0 : 4","","","","","","","","","","","","","","","","","","","","","","","","","","","","","","","","","","","","","","","5 : 2","","","","","","","1 : 0","0 : 3","","","3 : 0","","0 : 0","","","","","","","1 : 2","","","","","","3 : 1","","","","","","","","","","","","","","",""]
[null,75,"TM 75",null,null,null,75,42,78,"TM 42","-","TM 78",3,":",0,null,75,"TM 88",15,8,1,6,40,":",30,10,25,"","TM 88","","","","","","","","","","","","","","","","","","","","","","","","","","","","","","","","","","","","","","","","","","","","","","","","","","","","","","","","","","","","","","","","","","","","","","","","","","","","","","","","","","","","","","","","","","","","","","","","","","","","","","","0 : 3","","","","","","","","","","","","","","","","","","","","","","","","","","","","","","","","","","3 : 1","","0 : 4","","","","","","","","","0 : 3","","","0 : 3","","","","9 : 2","","","","","0 : 3","","0 : 0","","","","","","5 : 1","5 : 2","5 : 2","","","","1 : 0","","","","","","","","","","","","","","","","","","","","","","","","","9 : 2","","","2 : 1","1 : 3","",""]
[null,76,"TM 76",null,null,null,76,81,11,"TM 81","-","Atletico Madrid",0,":",0,null,76,"TM 68",16,8,1,7,38,":",28,10,25,"","TM 68","","","","","","","","","","","","0 : 0","","","","","","","","","","","","","","","","","","","","3 : 1","","","1 : 3","","","","","","","1 : 5","3 : 0","","0 : 1","","","","","","","","","","","","","2 : 0","0 : 2","","","","","","","1 : 3","","","4 : 0","","","","","","","","","","","","","","","","","","","","","","","","","","","","","","","","","","","","","","","","","","","","","1 : 3","","","","","","","","","","","","","","","","","","","","","","","","","","5 : 1","","","","","","","","","","","","","5 : 2","","","","","","","","","","","","","","","","","","","","","","","","","","","","","","","","","","","","0 : 4","","","","","","","","","","","","9 : 2","","","","3 : 1"]
[null,77,"TM 77",null,null,null,77,112,89,"TM 112","-","TM 89",1,":",0,null,77,"TM 163",16,7,4,5,29,":",19,10,25,"","TM 163","","","","","","","","","","","","","","","","","","","","","","","","","","","","","","","","","","","","","","","","","","","","","","","","","","","","","","","","","","","","","","","","","","","","","","","","","","","1 : 3","","2 : 0","","","","","","","","","","","","","0 : 1","","","","","","","","","","","","","","","","","","","","","","","","","","","","9 : 2","","","0 : 0","","","","","","","","","","","0 : 0","","","","","","","","","","","","2 : 0","3 : 0","","","","","0 : 3","","4 : 0","","2 : 5","","","0 : 4","","","","","","","","","","","","","","","","5 : 1","","","","","","","","","1 : 0","","","","0 : 0","","","","","0 : 0","","","","","","","","","","","","","",""]
[null,78,"TM 78",null,null,null,78,181,177,"TM 181","-","TM 177",0,":",3,null,78,"FC Basel",16,8,1,7,37,":",30,7,25,"","FC Basel","","","","","","","","","","","","","","","0 : 1","","","","","2 : 5","","","","","","","","","","","2 : 0","","","","","","1 : 3","","","","","","","","","","","","","","","","","","","","","","","","","","","","","","","","","","","","","","","","","","","","","","","","","","","","","","1 : 5","","","","","","","","","","","","","","","","","2 : 0","","","","","","","","","","","","","","","","","","4 : 0","","","","","","","","5 : 1","","","","1 : 3","","","","","","","","","0 : 0","","","","","","","","","","","","","","","","","","","","0 : 3","","","","","","","","","","","3 : 0","","","","","0 : 4","","","","","","","","","","","2 : 1","","","9 : 2","5 : 2","","","","","","",""]
[null,79,"TM 79",null,null,null,79,130,103,"TM 130","-","TM 103",5,":",1,null,79,"TM 44",16,8,1,7,36,":",29,7,25,"","TM 44","","","","","","","","","","","","","","","","","","","","","","","","","","","","","","","","","","","","","","","","","","","","0 : 1","","","","","","","","","","","","","","","","","","","","","","","","","","","","","","","","","","","","","","","","","","","","","","","","","","","","","","2 : 0","1 : 3","","3 : 1","","","","","","","","","","","","","","","","","","","","","","","","","","","","","","","","1 : 5","","","","","","5 : 1","","","3 : 0","","","","","","0 : 0","","","","","","","0 : 3","","","","","4 : 0","","5 : 2","","","","","","0 : 3","0 : 4","1 : 3","","","","","","","","","","","","","","","","","","","","","","","","","","","","","","","","9 : 2","2 : 1","",""]
[null,80,"TM 80",null,null,null,80,40,117,"Hertha BSC","-","TM 117",0,":",4,null,80,"TM 54",16,7,4,5,31,":",24,7,25,"","TM 54","","","","","","","","","","","","","2 : 5","","","","","","","","","","","","0 : 2","","","","","","","","","","","","","","","","","","","0 : 0","","","","","","","","","","","","","","","","","","","","","","","","","","","","","","","","","","","","","","","","","","","","","","","","","","","","","","9 : 2","0 : 3","","3 : 1","","","","","","","","","","","","","","","","","","","","","","","","","","","","","","","","0 : 0","","","","","","0 : 0","","","0 : 3","","","","","","5 : 1","","","","","","","0 : 4","","","","","0 : 0","","","","","","","","3 : 0","1 : 0","","","","","","","","","","","","","","","","","","","","","","","","","","","","","","","","","5 : 2","3 : 1","",""]
[null,81,"TM 81",null,null,null,81,140,180,"TM 140","-","TM 180",5,":",2,null,81,"TM 52",16,7,4,5,27,":",22,5,25,"","TM 52","","","","","","","","","","","","","","","0 : 0","","","","","0 : 3","","","","","","","","","","","9 : 2","","","","","","0 : 3","","","","","","","","","","","","","","0 : 2","","","","","","","","","","","","","","","","","","","","","","","","","","","","","","","","","","","","","","","","0 : 0","","","","","","","","","","","","","","","","3 : 1","","","","","","","","","","","","","","","","","","","0 : 0","","","","","","","","0 : 0","","","","0 : 3","","","","","","","","","3 : 1","","","","","","","","","","","","","","","","","","","","3 : 0","","","","","","","","","","","0 : 4","","","","","1 : 0","","","","","","","","","","","3 : 1","","","5 : 2","","","","","","","",""]
[null,82,"TM 82",null,null,null,82,4,120,"Paris Saint-Germain","-","TM 120",3,":",1,null,82,"TM 155",16,8,1,7,33,":",29,4,25,"","TM 155","","","","","","","","","","","","3 : 0","","","","","","","","","","","","","","","","","","","","","","","0 : 4","","","","","","","3 : 1","1 : 3","","5 : 2","","","","","","","","","","","","","0 : 4","0 : 1","","","","","","","0 : 3","","","","","","","","","","","","","","","","","","","","","","","","","","","","","","","","","","","","","","","","","","","","","","","","5 : 1","","","","","","","","","","","","","","","","","","","","","3 : 1","","","","","0 : 3","","","","","","","","","","","","","3 : 1","","","","","","","","","","","","","","","","","","","","","","","","","","","","","","","","","","","","9 : 2","","","","","","","","","","","","1 : 0","","","","0 : 3"]
[null,83,"TM 83",null,null,null,83,88,66,"TM 88","-","TM 66",0,":",3,null,83,"TM 85",16,7,4,5,25,":",25,0,25,"","TM 85","","","","","","","","","","","","","","","","","","","","","","","","","","","","","","","","","","","","","","","","","","","","","","","","","","","","","","","","","","","","","","","","","","","","","","","","1 : 0","","","","","","","1 : 3","","","","","","","","","","","","","","2 : 9","","","","","","","","","0 : 0","","","0 : 0","","","2 : 0","","","","","3 : 0","","","","","","","","","","","","","","","","","","","","","0 : 0","","","","1 : 3","","","","","","","","","","","","","","","","","","","","","","","","","","","","1 : 3","","","","","","","","","","3 : 0","","","","","","","1 : 0","","","","","","","","","","","3 : 1","","","2 : 2","0 : 3","","5 : 1","","","","",""]
[null,84,"TM 84",null,null,null,84,122,132,"TM 122","-","TM 132",1,":",2,null,84,"TM 126",16,8,1,7,29,":",31,-2,25,"","TM 126","","","","","","0 : 1","","","","","","","3 : 0","","","","","","","","","","","","2 : 9","","","","","","","","","","","","","","","","","","","1 : 3","","","","","","","","","","","3 : 0","","","","","","","","","","","","","","","","","","","","","","","","","","","","","","","","","","","","","","","","","","","3 : 0","4 : 0","","1 : 5","","","","","","","","","","","","","","","","","","","","","","","","","","","","","","","","2 : 5","","","","","","2 : 0","","","3 : 1","","","","","","0 : 0","","","","","","","1 : 0","","","","","3 : 1","","","","","","","","1 : 3","","","","","","","","","","","","","","","","","","","","","","","","","","","","","","","","","","0 : 3","","",""]
[null,85,"TM 85",null,null,null,85,77,74,"TM 77","-","TM 74",2,":",1,null,85,"Sporting Lissabon",16,7,3,6,31,":",22,9,24,"","Sporting Lissabon","","","","","","","","","","","","","","","","","","","","","","","","","","","","","","","","","","","","","","","","","","","","","","","","","","","","","","","","","","","","","0 : 3","","","","","","","","","","","","","","0 : 0","","1 : 3","","","","","1 : 0","","","","","","","","","","","","3 : 1","","","","","","","","","","","","","","","","","","","","","","","","1 : 3","","","2 : 0","","","","","","","","","","","3 : 0","","","","","","","","","","","","1 : 3","0 : 1","","","","","","","1 : 5","","4 : 0","","","5 : 1","","","","","","","","","","","","","","","","9 : 2","","","","","","","","","0 : 0","","","","","","","","","0 : 0","","","","","","","","","","","","","",""]
[null,86,"TM 86",null,null,null,86,14,197,"Benfica Lissabon","-","TM 197",1,":",3,null,86,"AC Roma",16,7,3,6,31,":",23,8,24,"","AC Roma","","","","","","","","","","","","","","","","","","","","","","","","","","","","1 : 3","","","","","3 : 1","3 : 0","","","","","","","","","","","","","","","","","","","","","","","","","","0 : 0","","","","","","","","1 : 3","","","","","","5 : 2","","","","0 : 3","","","","","5 : 1","","","0 : 0","","","","","","","","","","","","","","","","","","","","3 : 0","","","","","","","","","","1 : 3","","","","","","","","","","","","","","0 : 0","","","","","","","","","","","","","","","","","","","","5 : 1","","","","","","0 : 3","","","3 : 0","","","","","","","","","","","","","","","","","","","","","","","","","","1 : 3","","","","","","","","","","","","","","","","","","","",""]
[null,87,"TM 87",null,null,null,87,13,65,"Juventus Turin","-","TM 65",2,":",0,null,87,"TM 152",16,7,3,6,30,":",25,5,24,"","TM 152","","","","","","","","","","","1 : 3","","","","","","","","","","","","","","","","","","","","","","","","","","","","","","","","","","","","","","","","","","","","","","","","","","","","","","","","","","","","","0 : 0","","","","","","","5 : 2","","","","","","","","","","","","","","0 : 4","","","","","","","","","0 : 3","","","5 : 1","","","0 : 3","","","","","0 : 0","","","","","","","","","","","","","","","","","","","","","","","","","3 : 1","","","","","","","","","","","","","","","","","","","","","","","","","","","","9 : 2","","","","","","","","","","3 : 1","","","","","","","0 : 0","","","","","","","","","","","","","","","1 : 0","","0 : 3","","","","",""]
[null,88,"TM 88",null,null,null,88,71,129,"TM 71","-","TM 129",0,":",0,null,88,"Hertha BSC",16,7,3,6,29,":",24,5,24,"","Hertha BSC","","","","","","","","","","","","","","","","","","1 : 3","","","","","","","","0 : 0","","","","","","","","","","","","","","","","","","","","","","2 : 5","","","","","","","","","","","","","","","","","","","","","","","","","","","","","","","","","","","","","","","","9 : 2","","","","4 : 0","","","","","2 : 0","","","0 : 0","","","","","","","","","","","","","","","","","","","3 : 0","","","","","0 : 3","3 : 1","","","","","","","","","","","","","","","","","","","","","","","","","","","","","","","","","","","","","","","0 : 4","","","","","","","","1 : 0","","","0 : 0","","2 : 0","","","","","","","","","","","","","2 : 5","","","","","","","","","","","","","","",""]
[null,89,"TM 89",null,null,null,89,25,101,"OSC Lille","-","TM 101",3,":",0,null,89,"TM 161",16,7,3,6,31,":",27,4,24,"","TM 161","","","","","","","","","","","","","","","","","","","","","","","","","","","","","","","","","","","","","","","","","","","","","","","","","","","","","","","","","","","","","","","","","","","","","","","","","","","0 : 3","","1 : 5","","","","","","","","","","","","","1 : 3","","","","","","","","","","","","","","","","","","","","","","","","","","2 : 1","","0 : 0","","","4 : 0","","","","","","","","","","","3 : 1","","","","","","","","","","","","5 : 1","5 : 2","","","","","0 : 3","","3 : 0","","0 : 0","","","3 : 0","","","","","","","","","","","","","","","","0 : 0","","","","","","","","","1 : 3","","","","3 : 5","","","","","","","","","","","","","","","","","","",""]
[null,90,"TM 90",null,null,null,90,106,188,"TM 106","-","TM 188",0,":",0,null,90,"TM 47",16,7,3,6,28,":",26,2,24,"","TM 47","","","","","","","","","","","","","","","","","","","","","","","","","","","","","","","","","","","","","","","","","","","","","","","","","","","","","","","","","","","","","","","0 : 3","","9 : 2","","","","","","","","","","","","","","","","","","","","","","","","","","","","","","","","","","","","","","","0 : 0","","","","","","","","","","","","","","","","0 : 0","","0 : 3","0 : 0","","","","","","","","","","","","0 : 3","","","","","","3 : 0","","0 : 1","","","","","","","","","","","","","","","","","","3 : 1","","","","0 : 4","","","","","","","","","","","","","","","","1 : 0","","","","","","","","","","4 : 3","3 : 1","5 : 2","","","","","","","","0 : 3","","","",""]
[null,91,"TM 91",null,null,null,91,183,128,"TM 183","-","TM 128",1,":",0,null,91,"TM 106",16,7,3,6,28,":",27,1,24,"","TM 106","","","","","","","","","","","","","","","","","","","","","","","","","","","","","","","","","","","","","","","","","","","","","","","","","","","","","","","","","","","","","","","","","","","","","","","","","","","","","","","","","","","","","","","","","","","","","","","","","","","","2 : 0","","","","","","","","","","","","","","","","","","","0 : 3","","","","","0 : 4","0 : 0","","0 : 3","","","","","","","","","","","","","","","","","","","","","","","","","","","","","","","","","","","","","1 : 0","","","","","","","9 : 2","0 : 0","","","5 : 1","","5 : 2","","","","","","","0 : 4","","","","","","1 : 3","","","","","","2 : 0","","","0 : 0","","","","","",""]
[null,92,"TM 92",null,null,null,92,191,36,"TM 191","-","Mainz 05",0,":",3,null,92,"FC Bayern München",16,7,3,6,25,":",26,-1,24,"","FC Bayern München","","","","","","","","","","","0 : 3","","","","","","","","","","","","","","","","","","","","","","","","","","","","","","","","","","","","","","","","","","","","","","","","","","","","","","","","","","","","","0 : 4","","","","","","","0 : 0","","","","","","","","","","","","","","0 : 2","","","","","","","","","5 : 1","","","0 : 3","","","0 : 0","","","","","0 : 3","","","","","","","","","","","","","","","","","","","","","","","","","3 : 0","","","","","","","","","","","","","","","","","","","","","","","","","","","","1 : 0","","","","","","","","","","3 : 1","","","","","","","0 : 4","","","","","","","","","","","0 : 0","","","","5 : 2","","3 : 1","","","","",""]
[null,93,"TM 93",null,null,null,93,109,56,"TM 109","-","TM 56",5,":",1,null,93,"TM 103",16,7,3,6,29,":",32,-3,24,"","TM 103","","","","","","","","","","","","","","","","","","","","","","","","","","","","","0 : 0","","","","","","","","","","","","3 : 1","","","","","","","","","","","","","","","","","","","","","","","0 : 4","","","1 : 0","","","","","","","","","1 : 5","","","","","","","","0 : 2","2 : 9","","","","0 : 3","","","","","","","","","","","","","","","","","","","","","","0 : 0","","","","","","","","","","","","","","","","","5 : 1","","","0 : 0","","","","","","","","","","","","","","","0 : 4","","","9 : 2","","","","","","","","","3 : 1","","","","","","","","","","","","","","","","","","","","","","3 : 0","","","","","","","","2 : 0","","","","","","","","","","","","","","","","",""]
[null,94,"TM 94",null,null,null,94,95,174,"TM 95","-","TM 174",0,":",4,null,94,"TM 78",16,7,2,7,33,":",28,5,23,"","TM 78","","","","","","","","","","","","","","","","","","","","","","","","","","","","","0 : 3","","","","","","","","","","","","","","","","","","","","","","","","","","","","","","","","","","","5 : 1","","","0 : 0","","","","","","","","","","","","","","","","","3 : 1","3 : 0","","","","0 : 4","","","","","","","","","","","","","","","","","","","","","","2 : 0","","","","","","","","","","","","","","","","","9 : 2","","","3 : 0","","","","","","","","","","","","","","","5 : 1","","","0 : 3","","","","","","","","","1 : 3","","","","","","","","","","","","","","","","","","","","","0 : 4","1 : 3","","","","","","","","1 : 3","","","","","","","","","","","","","","","","0 : 0",""]
[null,95,"TM 95",null,null,null,95,171,178,"TM 171","-","TM 178",5,":",2,null,94,"TM 144",16,7,2,7,33,":",28,5,23,"","TM 144","","","","","","","","","","","3 : 0","","","","","","","","","","","","","","","","0 : 0","","","","","","","","","","","","1 : 5","","","","","","","","","","","","","","","","","","","","","","","","","","","","","","","","","3 : 1","","","","","","","0 : 1","","","","","","","","","","","","","","0 : 0","","","0 : 2","","","","","","1 : 3","","","1 : 3","","","5 : 1","","","","","2 : 0","","","","","","","","","","","","","","","","","","","","","","","","","0 : 3","","","","","","","","","","","","","","","","","","","","","","","","","","","","0 : 4","","","","","","","","","","5 : 2","","","","","","","","","","","","","","","","","","","","","","9 : 2","","3 : 1","","","","",""]
[null,96,"TM 96",null,null,null,96,156,90,"TM 156","-","TM 90",3,":",1,null,96,"TM 82",16,7,2,7,31,":",28,3,23,"","TM 82","","","","","","","","","","","","","","","","","","","","","","","","","","","","","","","","","","","","","","","","","","","","","","","","","","","","","","","","","","","","","","","","","","","3 : 0","","","","","","","","","","","","","","","","","1 : 3","1 : 3","","","","5 : 1","","","","","","","","","","","","","","","","","","","","","","1 : 3","","","","","","","","","","","","","","","","","0 : 3","","","0 : 4","","","","","1 : 3","","","","","","","","","","0 : 3","","","3 : 1","","","","","","","","","0 : 0","","","","","","","","","","","","","","","","","","","","","5 : 1","5 : 2","","","","","","","0 : 0","3 : 1","","","","","","","","","","","","","","","","3 : 0",""]
[null,97,"TM 97",null,null,null,97,131,1,"TM 131","-","Real Madrid",0,":",3,null,97,"Paris Saint-Germain",16,7,2,7,26,":",23,3,23,"","Paris Saint-Germain","","","","","","","","","","","","","","","","","","","","","","","","","","0 : 3","","","","","","","","","","","","","","","","","","","","","","0 : 2","","","","","","","","","","","","","","","","","","","","","","","","","","","","","","","","","","","","","","","","0 : 0","","","","3 : 0","","","","","1 : 5","","","3 : 1","","","","","","","","","","","","1 : 3","","","","","","","2 : 0","","","","","0 : 3","0 : 1","","","","","","","","","","","","","","","","","","","","","","","","","","","","","","","","","","","","","","","3 : 0","","","","","","","3 : 1","1 : 3","","","4 : 0","","5 : 1","","","","","","","","","","","","","0 : 0","","","","","","","","","","","","","","",""]
[null,98,"TM 98",null,null,null,98,39,8,"FC Lille","-","RB Leipzig",0,":",2,null,98,"TM 174",16,7,2,7,27,":",25,2,23,"","TM 174","","","","","","","1 : 3","","","","","","","2 : 5","","","","","","","0 : 0","3 : 1","3 : 1","","","","4 : 0","","","","","","","","","","","","","","0 : 2","","","","","","","","","","","","","3 : 0","","","","","","","","","","","","","","","","","0 : 0","","0 : 3","","","4 : 0","","","","3 : 0","","","","","","","","","","","","","","","","","","","","","","","","","","","","","","","","","","","1 : 5","","0 : 3","","","","","","","","","","","","","","","","","","","","","","","","","","","","","","","","","","","","","","","","","","","","","","","","","","","","","","","","","","","","","","","","","","","","","","","","","","","","","","","","","","","","","","","",""]
[null,99,"TM 99",null,null,null,99,18,64,"AC Mailand","-","TM 64",3,":",1,null,99,"PSV Eindhoven",16,7,2,7,25,":",23,2,23,"","PSV Eindhoven","","","","","","","","","","","","","","","","","","","5 : 1","","","","","0 : 3","","","","","","","","","","","","","","","","","","","","","","3 : 1","1 : 3","","","3 : 0","","","","","","","","","","","","","2 : 0","","0 : 3","","","","","","","","","","","","","","","","","","","","","","","","","","","","","","0 : 0","","","","","","","","","","","","","","","","","","","","","","","","","3 : 0","","0 : 0","","","","","","","","","","","","","","","","","","","2 : 0","","1 : 3","","","","","","","","","","","","","","","","","","0 : 1","","","","3 : 0","","","","","","","","","","","","","","","","","","","","","","","","","","1 : 3","","1 : 5","","","","","","","","","","","",""]
[null,100,"TM 100",null,null,null,100,55,141,"TM 55","-","TM 141",1,":",3,null,100,"VfB Stuttgart",16,7,2,7,33,":",32,1,23,"","VfB Stuttgart","","","","","","","","","","","","","","","","","","3 : 0","","","","","","","","2 : 5","","","","1 : 3","","","","1 : 5","","","","","","","","","","","","","","1 : 3","","","","","","","","","","","","0 : 3","","","","","","","","","","","","","","","","","","","","","","","","","","","","0 : 0","","","","1 : 5","","","","","3 : 0","","","3 : 1","","","","","","","","","","","","9 : 2","","","","","","","3 : 1","","","","","3 : 1","0 : 3","","","","","","","","","","","","","","","","","","","","","","","","","","","","","","","","","","","","","","","","","","","","","","","","","","3 : 0","","","","","","","","","","","","","","","0 : 0","","","","","","","","","","","","","","",""]
[null,101,"TM 101",null,null,null,101,35,176,"Eintracht Frankfurt","-","TM 176",2,":",0,null,101,"TM 93",16,7,2,7,29,":",28,1,23,"","TM 93","","","","","","","","","","","","","","","2 : 5","","","","","3 : 1","","","","","","","","","","","0 : 0","","","","","","0 : 2","1 : 3","","","","","","","","","","","","","4 : 0","","","","","","","","","","","","","","","","","","","","","","","","","","","","","","","","","","","","","","","","0 : 3","","","","","","","","","","","","","","","","3 : 1","","","","","","","","","","","","","","","","","","","0 : 3","","","","","","","","0 : 4","","","","","","","","","","","","","1 : 3","","","","","","","","","","","","","","","","","","","","5 : 1","","","","","","","","","","","2 : 0","","","","","5 : 2","","","","","","","","","","","3 : 0","","","0 : 0","","","","","","","",""]
[null,102,"TM 102",null,null,null,102,33,47,"Sturm Graz","-","TM 47",0,":",0,null,102,"TM 198",16,7,2,7,27,":",26,1,23,"","TM 198","","","","","","","","","","","","","","","","","","","","","","","","","","","","","","","","","3 : 0","","","","","","","","","","","","","","","","","","","","","","","","","","","","","","","","","","","0 : 4","","","","","","5 : 1","","","","","","","","","","","","1 : 3","","","","","","","","","","","","","","","","","","","","1 : 3","","","","","","","","","","0 : 3","","","","","","","","","","","","","","0 : 3","","","","","","","","","","","","","","1 : 3","","","","","","3 : 1","","","","0 : 3","","0 : 0","5 : 1","","2 : 0","","","","","","","","","","","","","","","","","","","","","","","0 : 0","","","3 : 1","3 : 0","","","","","","","","","","","","","","","","","","",""]
[null,103,"TM 103",null,null,null,103,58,31,"TM 58","-","FC Girona",3,":",0,null,103,"Young Boys Bern",16,7,2,7,25,":",24,1,23,"","Young Boys Bern","","","","","","","","","","","","","","","","","","1 : 3","","","","","","","","0 : 1","","0 : 0","","0 : 3","","","","3 : 1","","","","","","","","","","","","","","3 : 0","","","","","","","","","","","","1 : 5","","","","","","","","","","","","","","","","","","3 : 0","","","","","0 : 2","","","","","0 : 2","","","","3 : 0","","","","","0 : 0","","","1 : 5","","","","","","","","","","","","4 : 0","","","","","","","","","","","","3 : 1","3 : 1","","","","","","","","","","","","","","","","","","","","","","","","","","","","","","","","","","","","","","","","","","","","","","","","","","","","","","","","","","","","","","","","","","","","","","","","","","","","","","","",""]
[null,104,"TM 104",null,null,null,104,30,104,"FC Bologna","-","TM 104",0,":",0,null,104,"TM 59",16,7,2,7,33,":",34,-1,23,"","TM 59","","","","","","3 : 0","","","","","","0 : 1","","","","","","","","","","","","","","","","","","","","0 : 3","","","1 : 3","","","","","","","1 : 3","2 : 5","","3 : 1","","","","","","","","","","2 : 9","","","0 : 0","0 : 0","","","","","","","1 : 0","","","3 : 0","","","","","","","","","","","","","","","","","","","","","","","","","","","","","","","","","","","","","","","","","","","","","6 : 0","","","","","","","","","","","","","","","","","","","","","","","","","","","","","","","","","","","","","","","2 : 9","","","","","","","","","","","","","","","","","","","","","","","","","","","","","","","","","","","","3 : 0","","","","","","","","","","","","","","","","6 : 0"]
[null,105,"TM 105",null,null,null,105,175,46,"TM 175","-","TM 46",1,":",0,null,105,"TM 160",16,7,2,7,27,":",28,-1,23,"","TM 160","","","","","","1 : 2","","","","","","2 : 9","3 : 1","","","","","","","","","","","","","","","","","","","0 : 0","","","0 : 3","","","","","","","3 : 0","0 : 1","","5 : 1","","","","","","","","","","4 : 0","","","3 : 1","3 : 0","","","","","","","0 : 2","","","1 : 5","","","","","","","","","","","","","","","","","","","","","","","","","","","","","","","","","","","","","","","","","","","","","1 : 3","","","","","","","","","","","","","","","","","","","","","","","","","","","","","","","","","","","","","","","1 : 0","","","","","","","","","","","","","","","","","","","","","","","","","","","","","","","","","","","","0 : 0","","","","","","","","","","","","","","","",""]
[null,106,"TM 106",null,null,null,106,28,76,"AS Monaco","-","TM 76",0,":",3,null,106,"FC Barcelona",16,7,2,7,26,":",28,-2,23,"","FC Barcelona","","","","","","","","","","","","","1 : 3","","","","","","","","","","","","4 : 0","","","","","","","","","","","","","","","","","","","2 : 5","","","","","","","","","","","1 : 5","","","","","","","","","","","","","","","","","","","","","","","","","","","","","","","","","","","","","","","","","","","0 : 0","0 : 2","","3 : 1","","","","","","","","","","","","","","","","","","","","","","","","","","","","","","","","1 : 0","","","","","","0 : 4","","","3 : 1","","","","","","1 : 3","","","","","","","2 : 0","","","","","0 : 3","","","","","","","","5 : 1","","","","","","","","","","","","","","","","","","","","","","","","","","","","","","","","","","0 : 0","3 : 0","",""]
[null,107,"TM 107",null,null,null,107,12,26,"Atalanta Bergamo","-","Roter Stern Belgrad",5,":",1,null,107,"TM 179",16,7,2,7,28,":",32,-4,23,"","TM 179","","","","","","","","","","","","","","","","","","","","","","","","","","","","","","","","","","","","","","","","","","","","","","","","","","","","","","","","","","","","","","","","","","","","","","","","0 : 2","","","","","","","0 : 3","","","","","","","","","","","","","","","","","","","","","","","3 : 1","","","2 : 9","","","0 : 4","","","","","1 : 3","","","","","","","","","","","","","","","","","","","","","1 : 3","","","","5 : 1","","","","","","","","","","","","","","","","","","","","","","","","","","","","5 : 2","","","","","","","","","","0 : 0","","","","","","","2 : 0","","","","","","","","","","","0 : 3","","","","0 : 0","","3 : 0","","","","",""]
[null,108,"TM 108",null,null,null,108,23,124,"Dinamo Zagreb","-","TM 124",0,":",4,null,108,"TM 181",16,7,2,7,24,":",28,-4,23,"","TM 181","","","","","","","","","","","","","","","","","","1 : 5","","","","","","","","3 : 1","","","","3 : 0","","","","","","","","","","","","","","","","","","3 : 1","","","","","","","","","","","","","","","","","","","","","","","","","","","","","","","","","","","","","","","","0 : 3","","","","0 : 0","","","","","3 : 0","","","0 : 2","","","","","","","","","","","","3 : 1","","","","","","","1 : 3","","","","","0 : 3","0 : 0","","","","","","","","","","","","","","","","","","","","","","","","","","","","","","","","","","","","","","","","","","","","","","","3 : 1","","","1 : 5","","0 : 3","","","","","","","","","","","","","3 : 0","","","","","","","","","","","","","","",""]
[null,109,"TM 109",null,null,null,109,119,22,"TM 119","-","Celtic Glasgow",5,":",2,null,109,"Aston Villa",16,7,2,7,27,":",34,-7,23,"","Aston Villa","","","","","","","","3 : 0","","","","","","","","","1 : 3","","","","","","","","","","","","","","","","","","","","","","","","","","","","","","3 : 1","","0 : 0","1 : 5","","1 : 3","0 : 0","","","","2 : 5","","","","","0 : 3","","","","","","","","","","","","","","","","","","","3 : 1","","","","","","1 : 5","","","","","","","","","","","","","","","","","","","","","","0 : 6","3 : 1","","","","","","","","","","","","","","","","","","","3 : 0","","","","","","","","","","","","","","","","","","","","","","","","","","","","","","","","","","3 : 1","","","","","","","","","","","","","","","","","","","","","","","","","","","","","","","","3 : 0","","","","","","","","","",""]
[null,110,"TM 110",null,null,null,110,21,80,"PSV Eindhoven","-","TM 80",1,":",3,null,110,"TM 77",15,7,1,7,31,":",31,0,22,"","TM 77","","","","","","","","","","","","","","","","","","","","","","","","","","","","","","","","","","","","","","","","","","","","","","","","","","","","","","","","","","","","","","","","","","","","","","","","","","","","","","","","","","","","","","","","","","","","","","","","","","","","","","","5 : 1","","","","","","","","","","","","","","","","","","","","","","","","1 : 3","","","","","","","","","","0 : 3","","2 : 0","","","","","","","","","","","","3 : 1","","","","0 : 4","","","","","2 : 1","","0 : 3","","","","","","1 : 3","0 : 0","0 : 3","","","","9 : 2","","","","","","","","","","","","","","","","","","","","","","","","","0 : 4","","","5 : 2","3 : 1","",""]
[null,111,"TM 111",null,null,null,111,146,20,"TM 146","-","Sporting Lissabon",3,":",1,null,111,"TM 83",16,7,1,8,33,":",36,-3,22,"","TM 83","","","","","","","","","1 : 3","2 : 5","","","","","2 : 9","","","","","1 : 3","","","","","","","","","","","4 : 0","","","","","","1 : 5","3 : 0","","3 : 1","","","","","","","","","","","3 : 0","","","","","0 : 0","","","","","4 : 0","","","","","","","","","0 : 2","","","","","","","","","","","","","","","","","","","","","3 : 1","","","1 : 2","","","","","","","","","","","","","3 : 0","","","","","","","","","","","","","","","","","","","","","","","","","","","","","","","","","","","","","","","","2 : 5","","","","","","","","","","","","","","","","","","","","","","","","","","","","","","","","","","","","","","","","","","","","","","","","","","","","","","","","","",""]
[null,112,"TM 112",null,null,null,112,167,139,"TM 167","-","TM 139",0,":",2,null,112,"TM 183",15,7,1,7,27,":",30,-3,22,"","TM 183","","","","","","","","","","","","","","","","","","","","","","","","","","","","","","","","","","","","","","","","","","","","","","","","","","","","","","","","","","","","","","","","","","","","","","","","","","","","","","","","","","","","","","","","","","","","","","","","","","","","","","","3 : 0","","","","","","","","","","","","","","","","","","","","","","","","1 : 3","","","","","","","","","","0 : 4","","1 : 3","","","","","","","","","","","","2 : 9","","","","","","","","","","","0 : 0","","","","","","","2 : 0","5 : 1","0 : 3","","","3 : 0","","","","","","","","","","5 : 1","","","","","","","","","","","","","","","3 : 0","","","1 : 0","0 : 3","",""]
[null,113,"TM 113",null,null,null,113,72,165,"TM 72","-","TM 165",0,":",0,null,113,"TM 165",16,6,4,6,27,":",31,-4,22,"","TM 165","","","","","","","","","","","","","","","","","","","","","","","","","","","","","","","","","","","","","","","","","","","","","","","","","","","","","","","","","","","","","","","","","","","","","","","","","","","1 : 2","","3 : 0","","","","","2 : 9","","","","","","","","3 : 1","","","","0 : 0","","","","","","","","","","","","","","","","","","","","","","","","","","","1 : 5","","","","","","","","","","","2 : 5","","","","","","","","","","","","0 : 3","1 : 3","","","","","","","0 : 0","","3 : 0","","","0 : 0","","","","","","","","","","","","","","","","0 : 0","","","","","","","","","3 : 1","","","","5 : 2","","","","","3 : 0","","","","","","","","","","","","","",""]
[null,114,"TM 114",null,null,null,114,164,73,"TM 164","-","TM 73",0,":",3,null,113,"TM 169",16,7,1,8,27,":",31,-4,22,"","TM 169","","","","","","","","","","","0 : 1","","","1 : 2","","","","","","","","","","","","","2 : 9","","","","","","","","","","","","3 : 0","","","","","","","","","","","","","","","","","","","","","","","","","","","","","","","","4 : 0","1 : 3","1 : 5","","","","","","5 : 1","","","","","","","","","","","","","","0 : 3","","","3 : 0","","","","","","0 : 2","","","1 : 3","","","","","","","","3 : 1","","","","","","","","","","","","","","","","","","","","","","","","","","","","","","","","","","","","","","","","","","","","","","","","","","","","","0 : 0","","","","","","","","","","1 : 0","","","","","","","","","","","","","","","","","","","","","","","","2 : 1","","","","",""]
[null,115,"TM 115",null,null,null,115,63,163,"TM 63","-","TM 163",0,":",0,null,115,"Sturm Graz",16,6,4,6,25,":",30,-5,22,"","Sturm Graz","","","","","","","","","","","","","","","","","","","","","","","","","","","","","","","","","","","","","","","","","","","","","","2 : 9","","","","","","","","","","","","","","","","","0 : 2","","0 : 0","","","","","","","","","","","","","","","","","","","","","","","","","","","","","","0 : 0","","","","","","","","","0 : 3","","","","","","","","","","","","","","","","","","3 : 1","0 : 4","","","","","","","","","","","","0 : 0","","","","","","5 : 1","","0 : 3","","","","","","","","","","","","","","","","","","","","","","2 : 0","","","","","","","","","","","","","","","","5 : 2","","","","","","","","","","5 : 2","3 : 0","0 : 0","","","","","","","","","","","",""]
[null,116,"TM 116",null,null,null,116,159,153,"TM 159","-","TM 153",0,":",1,null,116,"TM 175",16,7,1,8,29,":",36,-7,22,"","TM 175","","","","","","","","","1 : 2","2 : 9","","","","","","","","","","","","","","","","","","","","","","","","","","","","","","3 : 0","","","","","","","","","","","2 : 5","","","","","4 : 0","","","","","3 : 0","","","","","","","","","1 : 5","","","","","1 : 3","","0 : 3","","","","","0 : 0","","","","","","","","0 : 2","","","","0 : 4","","","","","","","","","","","","","","","","","","","","","","","","5 : 1","","","","","","","","","","","","","","1 : 0","","","","","","","","","","","","","","","","","","","","3 : 1","","","","","","","","","","","","","","","","","","","","","","","","","","","","","","","","","","","","","","","","","","","","","","","","","","","","",""]
[null,117,"TM 117",null,null,null,117,189,161,"TM 189","-","TM 161",3,":",0,null,117,"AS Monaco",16,6,3,7,26,":",25,1,21,"","AS Monaco","","","","","","","","","","","","","","","","","","","0 : 3","","","","","0 : 0","","","","","","","","","","","","","","","","","","","","","","1 : 3","","","","","","","","","","","","","","","","","1 : 3","","1 : 3","","","","","","","","","","","","","","","","","","","","","","","","","","","","","","3 : 0","","","","","","","","","0 : 0","","","","","","","","","","","","","","","","1 : 3","","","1 : 0","","","","","","","","","","","","","","","","","","0 : 0","","3 : 0","","","","","","","","","","","","","","","","","","4 : 0","","","","2 : 5","","","","","","","","","","","","","","","","","","","","","","","","","","5 : 1","1 : 3","3 : 1","","","","","","","","","","","",""]
[null,118,"TM 118",null,null,null,118,15,102,"FC Arsenal","-","TM 102",1,":",5,null,118,"Inter Mailand",16,6,3,7,27,":",28,-1,21,"","Inter Mailand","","","","","","","","4 : 0","","","","","","","","","0 : 2","","1 : 5","","","","","3 : 1","","","","","","","","","","","","","","","","","","","","","","3 : 0","0 : 0","","","2 : 5","","2 : 9","0 : 0","","","","3 : 0","","","","","0 : 1","0 : 2","","5 : 2","","","","","","","","","","","","","","","","","","","","","","","","","","","","","","0 : 0","","","","","","","","","","","","","","","","","","","","","","","","","4 : 0","","0 : 1","","","","","","","","","","","","","","","","","","","","","","","","","","","","","","","","","","","","","","","","","","","","","","","","","","","","","","","","","","","","","","","","","","","","","","","","","","","","","","","","","","",""]
[null,119,"TM 119",null,null,null,119,83,7,"TM 83","-","Borussia Dortmund",4,":",0,null,119,"TM 50",16,6,3,7,25,":",27,-2,21,"","TM 50","","","","","","","","","","","0 : 0","","","","","","","","","","","","","","","","2 : 5","","","","","","","","","","","","0 : 3","","","","","","","","","","","","","","","","","","","","","","","","","","","","","","","","","1 : 5","0 : 0","","","","","","0 : 2","","","","","","","","","","","","","","3 : 0","","","4 : 0","","","","","","3 : 0","","","1 : 3","","","1 : 3","","","","","3 : 0","","","","","","","","","","","","","","","","","","","","","","","","","","","","","","","","","","","","","","","","","","","","","","","","","","","","","2 : 0","","","","","","","","","","0 : 0","","","","","","","","","","","","","","","","","","","","","","0 : 4","","5 : 2","","","","",""]
[null,120,"TM 120",null,null,null,120,10,16,"Bayer Leverkusen","-","FC Brügge",2,":",5,null,120,"TM 147",16,6,3,7,24,":",27,-3,21,"","TM 147","","","","","","","","","","","2 : 5","","","3 : 0","","","","","","","","","","","","","0 : 1","","","","","","","","","","","","1 : 3","","","","","","","","","","","","","","","","","","","","","","","","","","","","","","","","","0 : 3","3 : 0","","","","","","4 : 0","","","","","","","","","","","","","","1 : 3","","","0 : 0","","","","","","1 : 0","","","3 : 0","","","1 : 3","","","","","0 : 0","","","","","","","","","","","","","","","","","","","","","","","","","","","","","","","","","","","","","","","","","","","","","","","","","","","","","3 : 0","","","","","","","","","","2 : 9","","","","","","","","","","","","","","","","","","","","","","","","0 : 0","","","","",""]
[null,121,"TM 121",null,null,null,121,75,158,"TM 75","-","TM 158",1,":",3,null,121,"TM 114",16,6,3,7,23,":",26,-3,21,"","TM 114","","","","","","","","","","","","","","","","","","3 : 0","","","","","","","","","","3 : 1","","1 : 3","","","0 : 2","1 : 5","","","","","","","","","","","","","","","","","","","","","","","","","","0 : 3","","","","","","","","3 : 1","","","","","","1 : 3","","","","0 : 0","","","","","0 : 4","","","0 : 0","","","","","","","","","","","","","","","","","","","","3 : 0","","","","","","","","","","","","","","","","","","","","","","","","0 : 3","","","","","","","","","","","","","","","","","","","","","","","","","","5 : 1","","","0 : 0","","","","","","","","","","","","","","","","","","","","","","","","","","3 : 0","","","","","","","","","","","","","","","","","","","",""]
[null,122,"TM 122",null,null,null,122,6,67,"Inter Mailand","-","TM 67",3,":",0,null,122,"TM 129",15,6,3,6,23,":",28,-5,21,"","TM 129","","","","","","","3 : 1","","","","0 : 0","","","1 : 3","","3 : 1","","","","","","0 : 2","0 : 0","","","","2 : 9","","","","","","","","","3 : 1","","","0 : 3","","","","","","","","","","","","","","","2 : 5","","","","","","","","","","","","","","","","","0 : 1","","0 : 0","","","","","","","","","","","","","","","","","","","","","","","3 : 0","","","","","","","","","","","","","","","","","","","3 : 1","","3 : 1","","","","","","","","","","","","","","","","","","","","","","","","","","","","","","","","","","","","","","","","","","","","","","","","","","","","","","","","","","","","","","","","","","","","","","","","","","","","","","","","","","","","","","","",""]
[null,123,"TM 123",null,null,null,123,172,5,"TM 172","-","FC Liverpool",2,":",9,null,123,"TM 127",16,6,3,7,26,":",32,-6,21,"","TM 127","","","","","","2 : 5","","","","","","","1 : 3","","","","","","","","","","","","0 : 1","","","","","","","","","","","","","","","","","","","3 : 0","","","","","","","","","","","0 : 0","","","","","","","","","","","","","","0 : 3","","","","","","","","","","","","","","","","","","","","","","","","","","","","","1 : 5","2 : 9","","3 : 0","","","","","","","","","","","","","","","","","","","","","","","","","","","","","","","","0 : 0","","","","","","","","","2 : 0","","","","","","4 : 0","","","","","","","2 : 5","","","","","3 : 0","","","","","","","","0 : 0","","","","","","","","","","","","","","","","","","","","","","","","","","","","","","","","","","3 : 1","","",""]
[null,124,"TM 124",null,null,null,124,45,48,"TM 45","-","TM 48",1,":",3,null,124,"TM 100",16,6,3,7,22,":",28,-6,21,"","TM 100","","","","","","","","","","","","","","","","","","","","","","","","","","","","","","","","0 : 4","","","0 : 2","","","","","","","0 : 0","0 : 3","","0 : 0","","","","","","","","","","","","","0 : 3","5 : 2","","","","","","","5 : 1","","","","","","","","","","","","","","","","","","","","","","","","","","","","","","","","","","","","","","","","","","","","","","","","0 : 3","","","","","","","","","","","","","","","","","","","","","3 : 0","","","","","0 : 0","","","","","","","","","","","","","0 : 3","","","","","","","","","","","","","","","","","","","","","","","","","","","","0 : 4","","","","","","","","1 : 0","","","","","","","","","","","","5 : 2","","","","3 : 1"]
[null,125,"TM 125",null,null,null,125,136,2,"TM 136","-","Manchester City",3,":",1,null,125,"TM 185",16,6,3,7,26,":",34,-8,21,"","TM 185","","","","","","","","","2 : 5","","","","","","3 : 0","","","","","1 : 5","","","","","","","","","","","1 : 5","","","","","","2 : 9","1 : 3","","","","","","","","","","","","","0 : 1","","","","","0 : 0","","","","","","","","","","","","","","","","","","","","","","","","","","","","","","","","","","","0 : 0","","","","","","","","","","","","","","","","3 : 0","","","","","","","","","","","","","","","","","","","3 : 0","","","","","","","","1 : 0","","","","","","","","","","","","","4 : 0","","","","","","","","","","","","","","","","","","","","0 : 0","","","","","","","","","","","2 : 5","","","","","","","","","","","","","","","","","","","3 : 1","","","","","","","",""]
[null,126,"TM 126",null,null,null,126,145,60,"TM 145","-","TM 60",0,":",2,null,126,"TM 61",16,6,2,8,28,":",25,3,20,"","TM 61","","","","","","3 : 0","","","","","","0 : 1","1 : 5","","","","","","","","","","","","0 : 0","","","","","","","","","","","","","","","","","1 : 3","","0 : 3","","","","","","","","","","","0 : 2","","","","","","","","","","","","","","3 : 1","","","","","","","","","","","","","","","","","","","","","","","","","","","","","0 : 0","0 : 3","","4 : 0","","","","","","","","","","","","","","","","","","","","","","","","","","","","","","","","3 : 1","","","","","","","","","9 : 2","","","","","","0 : 1","","","","","","","3 : 0","","","","","1 : 3","","","","","","","","","","","","","","","","","","","","","","","","","","","","","","","","","","","","","","","","","","","","",""]
[null,127,"TM 127",null,null,null,127,115,199,"TM 115","-","TM 199",0,":",0,null,127,"TM 46",16,6,2,8,29,":",28,1,20,"","TM 46","","","","","","","","","","3 : 0","","","","","","","","","","","","","","","","","","","","","","","","","","","","","","3 : 1","","","","","","","","","","","","","","","","","","","","","0 : 1","","","","","","","","","0 : 2","","","","","2 : 5","","1 : 3","","","","","0 : 0","","","","","","","","0 : 3","","","","1 : 3","","","","","","","","","","","","","","","","","","","","","","","","5 : 2","","","0 : 1","","","","","","","","","","","","","","","","","","","","","","","","9 : 2","","","","","","","0 : 4","","2 : 0","","","","","","","","","","","","","","","","","","","0 : 0","","","","","","","","","","","","","","","","","","3 : 1","","","","","","","","","","","","","",""]
[null,128,"TM 128",null,null,null,128,143,100,"TM 143","-","TM 100",0,":",3,null,127,"TM 180",16,6,2,8,29,":",28,1,20,"","TM 180","","","","","","","","","","","","","","","","","","","","","2 : 5","","","","","","","","1 : 3","","","","","","","","","","","","3 : 0","","","","","","","","","","","","","","","","","","","","","","","0 : 3","","","3 : 1","","","","","","","","","4 : 0","","","","","","","","5 : 1","0 : 0","","","","5 : 2","","","","","","","","","","","","","","","","","","","","","","0 : 1","","","","","","","","","","","","","","","","","0 : 0","","","1 : 3","","","","","","","","","","","","","","","1 : 3","","","","","","","","","","","","0 : 3","","","","","","","","","","","","","","","","","","","","","","3 : 0","","","","","","","","1 : 3","","","","","","","","","","","","","","","","",""]
[null,129,"TM 129",null,null,null,129,185,134,"TM 185","-","TM 134",0,":",0,null,129,"TM 111",16,6,2,8,26,":",30,-4,20,"","TM 111","","","","","","","","","","","","","","","","","","4 : 0","","","","","","","","3 : 0","","1 : 3","","2 : 9","","","3 : 0","2 : 5","","","","","","","","","","","","","","0 : 2","","","","","","","","","","","","0 : 1","","","","","","","","","","","","","","0 : 2","","","","3 : 1","","","","","1 : 5","","","0 : 0","","0 : 0","","","","","","","","","","","","","","","","","","4 : 0","","","","","","3 : 1","","","","","","","","","","","","","","","","","","0 : 1","","","","","","","","","","","","","","","","","","","","","","","","","","","","","","","","","","","","","","","","","","","","","","","","","","","","","","","","","","","","","","","","","","","","","","","","","","",""]
[null,130,"TM 130",null,null,null,130,125,155,{"$f":"IFERROR(VLOOKUP($H135,$B$6:$C$205,2,0),\"\")","v":"TM 125"},"-",{"$f":"IFERROR(VLOOKUP($I135,$B$6:$C$205,2,0),\"\")","v":"TM 155"},0,":",1,null,130,"TM 143",16,6,2,8,24,":",29,-5,20,"","TM 143","","","","","","","","0 : 2","","","","","","","","","3 : 0","","3 : 1","","","","","1 : 3","","","","","","","","","","","","","","","","","","","","","","","0 : 3","","1 : 5","1 : 3","","4 : 0","3 : 1","","","","0 : 0","","","","","3 : 0","","","","","","","","","","","","","","","","","","","","","","","","","1 : 3","","","","","","","","3 : 0","","","","","","","","","","","","","","","","","","","","","","","","","0 : 0","","","","","","","","","0 : 3","","","","","","","","","","","","","","","","","","","","","","","","","","","","","","","","","","","","","","","","","","","","","","","","","","","","","","","","","","","","","","","","","","","","","","","","","","","",""]
[null,131,"TM 131",null,null,null,131,154,121,"TM 154","-","TM 121",3,":",0,null,130,"TM 168",16,6,2,8,24,":",29,-5,20,"","TM 168","","","","","","2 : 9","","","","","","3 : 0","1 : 3","","","","","","","","","","","","0 : 1","","","","","","","0 : 2","","","0 : 1","","","","","","","4 : 0","1 : 5","3 : 0","3 : 0","","","","","","","","","","0 : 0","","","1 : 3","0 : 0","","","","","","","3 : 1","","","0 : 3","","","","","","","","","","","","","","","","","","","","","","","","","","","","","","","","3 : 1","","","","","","","","","","","","","","","","","","","","","","","","","","","","","","","","","","","","","","","","","","","","","","","","","","","","","","","","","","","","","","","","","","","","","","","","","","","","","","","","","","","","","","","","","","","","","","","","","","","","","","","",""]
[null,132,"TM 132",null,null,null,132,99,68,"TM 99","-","TM 68",1,":",5,null,132,"RB Leipzig",16,6,2,8,24,":",30,-6,20,"","RB Leipzig","","","","","","","1 : 3","","","","","","","2 : 0","","1 : 5","","","","","0 : 3","0 : 0","0 : 2","","","","","","0 : 0","","","","","","","1 : 3","","","","","3 : 1","","","","","","","","","","","","","3 : 0","","","","","","","","","","3 : 0","","","","","","","1 : 5","","","","","1 : 5","","","","1 : 3","","","","","","","","","","","","","","","","","","","","","","","","","","","","","","","","","","","3 : 0","","4 : 0","","","","","","","","","","","","","","","","","","","","","","","","","","","","","","","","","","","","","","","","","","","","","","","","","","","","","","","","","","","","","","","","","","","","","","","","","","","","","","","","","","","","","","","",""]
[null,133,"TM 133",null,null,null,133,93,98,"TM 93","-","TM 98",4,":",0,null,133,"TM 49",16,6,2,8,23,":",29,-6,20,"","TM 49","","","","","","","","","","","","","","","","","","0 : 2","","","","","","","","0 : 0","","0 : 3","","0 : 0","","","1 : 5","1 : 3","","","","","","","","","","","","","","3 : 0","","","","","","","","","","","","3 : 0","","","","","","","","","","","","","","","","","","1 : 3","","","","","3 : 1","","","3 : 0","","3 : 1","","","","1 : 3","","","","","0 : 3","","","3 : 0","","","","","","","","","","","","1 : 5","","","","","","","","","","","","","","","","","","","","","","","","","","","","","","","","","","","","","","","","","","","","","","","","","","","","","","","","","","","","","","","","","","","","","","","","","","","","","","","","","","","","","","","","","","","","",""]
[null,134,"TM 134",null,null,null,134,149,51,"TM 149","-","TM 51",2,":",5,null,134,"TM 56",16,6,2,8,25,":",32,-7,20,"","TM 56","","","","","","","","","","","","","","","","","","","","","2 : 9","1 : 5","0 : 0","","","","","","1 : 3","","","","","","","3 : 0","","","","","0 : 3","","","","","","","","","","","","","","","","","","","","","","","3 : 1","","","3 : 0","","","","","","","","","0 : 1","","","","4 : 0","","","","1 : 5","0 : 0","","","","0 : 2","","","","","","","","","","","","","","","","","","","","","","4 : 0","","","","0 : 2","","3 : 1","","","","","","","","","","","","","","","","","","","","","","","","","","","","","","","","","","","","","","","","","","","","","","","","","","","","","","","","","","","","","","","","","","","","","","","","","","","","","","","","","","","","","","","",""]
[null,135,"TM 135",null,null,null,135,52,198,"TM 52","-","TM 198",3,":",1,null,134,"TM 99",16,6,2,8,25,":",32,-7,20,"","TM 99","","","","","","","","1 : 3","","","","","","","","","2 : 9","","0 : 2","","","","","3 : 0","","","","","","","","","","","","","","","","","","","","","","4 : 0","0 : 0","","4 : 0","3 : 1","","0 : 3","0 : 2","","","","0 : 1","","","","","1 : 5","","","","","","","","","","","","","","","","","","","1 : 5","","","","","","3 : 0","","","","","","","","","","","","","","","","","","","","","","","","","","","","","","","","","","","","","","","","","","0 : 0","","","","","","","","","","","","","","","","","","","","","","","","","","","","","","","","","","3 : 1","","","","","","","","","","","","","","","","","","","","","","","","","","","","","","","","","","","","","","","","","",""]
[null,136,"TM 136",null,null,null,136,196,59,"TM 196","-","TM 59",0,":",3,null,136,"FC Arsenal",16,6,2,8,22,":",29,-7,20,"","FC Arsenal","","","","","","","","1 : 5","","","","","","","","","3 : 1","","5 : 2","","","","","0 : 1","","","","","","","","","","","","","","","","","","","","","","1 : 3","0 : 2","","","4 : 0","","3 : 0","","","","","","","","","","0 : 0","3 : 1","","0 : 4","","","","","","","","","","","","","","","","","","","","","","","","","","","","","","0 : 3","","","","","","","","","0 : 2","","","","","","","","","","","","","","","","1 : 5","","0 : 0","","","","","","","","","","","","","","","","","","","","","","","","","","","","","","","","","","","","","","","1 : 0","","","","","","","","","","","","","","","","","","","","","","","","","","","","","","","","","","","","","","","","","","","",""]
[null,137,"TM 137",null,null,null,137,94,194,"TM 94","-","TM 194",9,":",2,null,137,"TM 89",16,6,2,8,25,":",33,-8,20,"","TM 89","","","","","","","","","","","","","","","","","","","","","","","","","","","","","5 : 2","","","","","","","","","","","","0 : 1","","","","","","","","","","","","","","","","","","","","","","","0 : 0","","","1 : 3","","","","","","","","","","","","","","","","","0 : 3","3 : 0","","","","1 : 3","","","","","","","","","","","","","","","","","","","","","","1 : 3","","","","","","","","","","","","","","","","","0 : 2","","","2 : 9","","","","","","","","","","","","","","","","","","0 : 3","","","","","","","","","1 : 0","","","","","","","","","","","","","","","","","","","","","","0 : 0","","","","","","","","5 : 2","","","","","","","","","","","","","","","","3 : 1",""]
[null,138,"TM 138",null,null,null,138,29,160,"Aston Villa","-","TM 160",3,":",1,null,138,"TM 164",16,6,2,8,21,":",29,-8,20,"","TM 164","","","","","","","","","","","","","","","","","","","0 : 4","","","","","0 : 0","","","","","","","","","","","","","","","","","","","","","","0 : 2","3 : 1","","","1 : 5","","1 : 3","","","","","","","","","","0 : 3","1 : 3","","5 : 1","","","","","","","","","","","","","","","","","","","","","","","","","","","","","","1 : 0","","","","","","","","","3 : 1","","","","","","","","","","","","","","","","3 : 0","","0 : 3","","","","","","","","","","","","","","","","","","","","","","","","","","","","","","","","","","","","","","","0 : 0","","","","0 : 3","","","","","","","","","","","","","","","","","","","","","","","","","","3 : 0","","","","","","","","","","","","","",""]
[null,139,"TM 139",null,null,null,139,38,193,"FC Basel","-","TM 193",1,":",3,null,139,"TM 146",16,6,2,8,22,":",31,-9,20,"","TM 146","","","","","","","","","2 : 9","0 : 3","","","","","3 : 0","","","","","","","","","","","","","","","","","","","","","","0 : 2","1 : 3","","4 : 0","","","","","","","","","","","0 : 1","","","","","0 : 0","","","","","0 : 0","","","","","","","","","","","","","","","","2 : 1","","","","","0 : 2","","","","","","","","3 : 1","","","","1 : 5","","","","","","","","","","","","","3 : 1","","","","","","","","","","","3 : 0","","","","","","","","","","","","","","","","","","","","","","","","","","","","","","","","","","","","","","","","","","","","","","","","","","","","","","","","","","","","","","","","","","","","","","","","","","","","","","","","","","","","","","",""]
[null,140,"TM 140",null,null,null,140,97,17,"TM 97","-","Schachtjor Donezk",2,":",0,null,140,"TM 58",16,6,2,8,25,":",39,-14,20,"","TM 58","","","","","","","","","3 : 0","0 : 1","","","","","","","","","","","","","","","","","","","","","","","","","","","","1 : 5","","1 : 3","","","","","","","","","","","","","","","","2 : 9","","","","","0 : 0","","","","","","","","","3 : 0","","","","","3 : 0","","1 : 3","","","","","0 : 3","","","","","","","","1 : 0","","","","2 : 5","","","","","","","","","","","","","","","","","","","","","","","","3 : 1","","","","","","","","","","","","","","2 : 9","","","","","","","","","","","","","","","","","","","","0 : 0","","","","","","","","","","","","","","","","","","","","","3 : 0","","","","","","","","","","","","","","","","","","","","","","","","","","","","","","","",""]
[null,141,"TM 141",null,null,null,141,137,142,"TM 137","-","TM 142",0,":",5,null,141,"TM 200",16,6,1,9,29,":",37,-8,19,"","TM 200","","","","","","1 : 3","","","","","","2 : 5","0 : 1","","","","","","","","","","","","3 : 0","","","","","","","1 : 5","","","","","","","","","","3 : 1","1 : 2","2 : 9","","","","","","","","","","","0 : 0","","","","4 : 0","","","","","","","","","","0 : 2","","","","","","","","","","","","","","","","","","","","","","","","","","","","","4 : 0","1 : 5","","3 : 0","","","","","","","","","","","","","","","","","","","","","","","","","","","","","","","","3 : 1","","","","","","","","","","","","","","","","","","","","","","","","","","","","","","","","","","","","","","","","","","","","","","","","","","","","","","","","","","","","","","","","","","","","","","","",""]
[null,142,"TM 142",null,null,null,142,116,150,"TM 116","-","TM 150",3,":",0,null,142,"TM 192",16,5,4,7,21,":",29,-8,19,"","TM 192","","","","","","","","","","","","","","","","","","","","","","","","","","","","0 : 1","","0 : 0","","","0 : 3","0 : 2","","","","","","","","","","","","","","","","","","","","","","","","","","4 : 0","","","","","","","","1 : 0","","","","","","0 : 0","","","","5 : 2","","","","","0 : 0","","","1 : 3","","","","","","","","","","","","","","","","","","","","3 : 1","","","","","","","","","","5 : 2","","","","","","","","","","","","","","0 : 4","","","","","","","","","","","","","","","","","","","","","","","","","","0 : 2","","","2 : 9","","","","","","","","","","","","","","","","","","","","","","","","","","0 : 0","","","","","","","","","","","","","","","","","","","",""]
[null,143,"TM 143",null,null,null,143,170,24,"TM 170","-","Red Bull Salzburg",0,":",0,null,143,"TM 66",16,5,4,7,19,":",29,-10,19,"","TM 66","","","","","","","","","","","","","","","","","","","","","0 : 0","","","","","","","","0 : 1","","","","","","","","","","","","0 : 2","","","","","","","","","","","","","","","","","","","","","","","5 : 2","","","0 : 3","","","","","","","","","4 : 0","","","","3 : 0","","","","0 : 0","1 : 5","","","","0 : 0","","","","","","","","","","","","","","","","","","","","","","3 : 1","","","","","","","","","","","","","","","","","0 : 4","","","1 : 0","","","","","","","","","","","","","","","","","","","","","","","","","","","0 : 2","","","","","","","","","","","","","","","","","","","","","","2 : 9","","","","","","","","0 : 0","","","","","","","","","","","","","","","","",""]
[null,144,"TM 144",null,null,null,144,166,168,"TM 166","-","TM 168",1,":",0,null,144,"TM 108",16,6,1,9,28,":",39,-11,19,"","TM 108","","","","","","3 : 1","","","","","","1 : 2","2 : 5","","","","","","","","","","","","0 : 0","","","","","","","3 : 0","","","","","","","","","","1 : 5","3 : 0","0 : 1","0 : 1","","","","","","","","","","0 : 3","","","","2 : 9","","","","","","","","","","4 : 0","","","","","","","","","","","","","","","","","","","","","","","","","","","","","2 : 9","3 : 0","","1 : 3","","","","","","","","","","","","","","","","","","","","","","","","","","","","","","","","","","","","","","","","","3 : 0","","","","","","","","","","","","","","","","","","","","","","","","","","","","","","","","","","","","","","","","","","","","","","","","","","","","","","","","","","","","","","",""]
[null,145,"TM 145",null,null,null,145,86,37,"TM 86","-","AC Roma",0,":",3,null,145,"TM 189",16,6,1,9,31,":",45,-14,19,"","TM 189","","","","","","","","","3 : 1","1 : 2","","","","","0 : 1","","","","","3 : 0","","","","","","","","","","","2 : 9","","","","","","3 : 0","2 : 5","","1 : 5","","","","","","","","","","","0 : 0","","","","","2 : 5","","","","","2 : 9","","","","","","","","","4 : 0","","","","","","","","","","","","3 : 0","","","","","","","","","1 : 5","","","3 : 0","","","","","","","","","","","","","1 : 3","","","","","","","","","","","","","","","","","","","","","","","","","","","","","","","","","","","","","","","","","","","","","","","","","","","","","","","","","","","","","","","","","","","","","","","","","","","","","","","","","","","","","","","","","","","","","","","","","",""]
[null,146,"TM 146",null,null,null,146,70,133,"TM 70","-","TM 133",5,":",1,null,146,"Mainz 05",15,5,3,7,35,":",30,5,18,"","Mainz 05","","","","","","","0 : 3","","","","","","","0 : 0","","2 : 5","","","","","1 : 3","0 : 0","0 : 0","","","","0 : 2","","","","","","","","","2 : 5","","","3 : 0","","","","","","","","","","","","","","","9 : 2","","","","","","","","","","","","","","","","","4 : 0","","1 : 5","","","","","","","3 : 0","","","","","","","","","","","","","","","","","","","","","","","","","","","","","","","","","","","1 : 3","","9 : 2","","","","","","","","","","","","","","","","","","","","","","","","","","","","","","","","","","","","","","","","","","","","","","","","","","","","","","","","","","","","","","","","","","","","","","","","","","","","","","","","","","","","","","","",""]
[null,147,"TM 147",null,null,null,147,173,192,"TM 173","-","TM 192",0,":",4,null,147,"Roter Stern Belgrad",16,5,3,8,29,":",30,-1,18,"","Roter Stern Belgrad","","","","","","","","","","1 : 3","","","","","","","","","","","","","","","","","","","","","","","","","","","","","","0 : 0","","","","","","","","","","","","","","","","","","","","","5 : 2","","","","","","","","","","","","","","0 : 2","","0 : 2","","","","","0 : 4","","","","","","","","5 : 1","","","","0 : 3","","","","","","","","","","","","","","","","","","","","","","","","0 : 0","","","1 : 3","","","","","","","","","","","4 : 0","","","","","","","","","","","","","0 : 0","","","","","","","","","1 : 5","","","","","","","","","","","","","","","","","","","0 : 3","","","","","","","","","3 : 0","","","","","","","","","9 : 2","","","","","","","","","","","","","",""]
[null,148,"TM 148",null,null,null,148,123,157,"TM 123","-","TM 157",5,":",2,null,148,"TM 97",16,5,3,8,29,":",31,-2,18,"","TM 97","","","","","","","","2 : 9","","","","","","","","","4 : 0","","","","","","","","","","","","","","","","","","","","","","","","","","","","","","","","0 : 0","0 : 0","","0 : 1","0 : 3","","","","0 : 2","","","","","2 : 5","","","","","","","","","","","","","","","","","","","2 : 5","","","","","","1 : 3","","","","","","","","","","","","","","","","","","","","","","9 : 2","0 : 1","","","","","","","","","","","","","","","","","","","3 : 0","","","","","","","","","","","","","","","","","","","","","","","","","","","","","","","","","","0 : 0","","","","","","","","","","","","","","","","","","","","","","","","4 : 0","","","","","","","","2 : 0","","","","","","","","","",""]
[null,149,"TM 149",null,null,null,149,182,114,"TM 182","-","TM 114",3,":",1,null,149,"Atalanta Bergamo",16,5,3,8,25,":",28,-3,18,"","Atalanta Bergamo","","","","","","","","","2 : 5","4 : 0","","","","","","","","","","","","","","","","","","","","","","","","","","","","1 : 3","","1 : 2","","","","","","","","","","","0 : 0","","","","","0 : 2","","","","","1 : 3","","","","","","","","","3 : 1","","","","","","","0 : 0","","","","","5 : 2","","","","","","","","0 : 4","","","","0 : 0","","","","","","","","","","","","","3 : 0","","","","","","","","","","","0 : 3","","","","","","","","","","","","","","0 : 2","","","","","","","","","","","","","","","","","","","","5 : 1","","","","","","","","","","","","","","","","","","","","","","","","","","","","","","","","","","","","","","","","","","","","","","","","","","","","",""]
[null,150,"TM 150",null,null,null,150,187,108,"TM 187","-","TM 108",0,":",3,null,150,"TM 65",16,5,3,8,24,":",28,-4,18,"","TM 65","","","","","","","","","","","","","","","","","","","","","0 : 1","","","","","","","","3 : 0","","","","","","","0 : 2","","","","","0 : 0","","","","","","","","","","","","","","","","","","","","","","","1 : 3","","","0 : 0","","","","","","","","","2 : 5","","","","2 : 9","","","","3 : 0","4 : 0","","","","0 : 1","","","","","","","","","","","","","","","","","","","","","","0 : 2","","","","4 : 0","","","","","","","","","","","","","5 : 2","","","0 : 3","","","","","","","","","","","","","","","","","","","","","","","","","","","0 : 0","","","","","","","","","","","","","","","","","","","","","","","","","","","","","","","","","","","","","","","","","","","","","","",""]
[null,151,"TM 151",null,null,null,151,110,186,"TM 110","-","TM 186",9,":",2,null,151,"TM 115",16,5,3,8,22,":",26,-4,18,"","TM 115","","","","","","","","","0 : 0","","","","","","1 : 3","","","","","0 : 1","","","","","","","","","","","1 : 3","","","","","","0 : 1","0 : 3","","","","","","","","","","","","","2 : 5","","","","","4 : 0","","","","","","","","","","","","","","1 : 5","","","","","","","","","","","","","","","","","","","","","3 : 0","","","","","","","","","","","","","","","","0 : 0","","","","","","","","","","","","","","","","","","","1 : 5","","","","","","","","","","","","","","","","","","","","","2 : 0","","","","","","","","","","","","","","","","","","","","4 : 0","","","","","","","","","","","0 : 0","","","","","","","","","","","","","","","","","","","3 : 0","","","","","","","",""]
[null,152,"TM 152",null,null,null,152,162,200,"TM 162","-","TM 200",2,":",1,null,152,"TM 72",16,5,3,8,24,":",29,-5,18,"","TM 72","","","","","","","","","","1 : 3","","","","","","","","","","0 : 3","","","","","","","","","","","","","","","","","","3 : 0","","0 : 0","","","","","","","","","","","0 : 2","","","","","3 : 1","","","","","2 : 5","","","","","","","","","0 : 1","","","","","","","","","","","","4 : 0","","","","","","","","1 : 5","","","","0 : 3","","","","","","","","","","","","","1 : 5","","","","","","","","","","","0 : 0","","","","","","","","","","","","","","","","","","","","","","","","","","","","","","","","","","","","","","","","","","","","","","","","","","","","","","","","","","","","","","","","","","","","","","","","","","","","","","","","","","","","","","",""]
[null,153,"TM 153",null,null,null,153,135,113,"TM 135","-","TM 113",1,":",3,null,153,"TM 138",16,5,3,8,22,":",28,-6,18,"","TM 138","","","","","","0 : 0","","","","","","0 : 2","0 : 3","","","","","","","","","","","","2 : 5","","","","","","","","","","","","","","","","","","","1 : 3","","","","","","","","","","","4 : 0","","","","","","","","","","","","","","1 : 5","","","","","","","","","","","","","","","","","","","","","","","","","","","","","1 : 3","3 : 1","","0 : 0","","","","","","","","","","","","","","","","","","","","","","","","","","","","","","","","3 : 0","","","","","","","","","0 : 1","","","","","","2 : 0","","","","","","","0 : 0","","","","","1 : 5","","","","","","","","4 : 0","","","","","","","","","","","","","","","","","","","","","","","","","","","","","","","","","","","","",""]
[null,154,"TM 154",null,null,null,154,107,53,"TM 107","-","TM 53",2,":",0,null,154,"TM 172",16,5,3,8,24,":",31,-7,18,"","TM 172","","","","","","","","","1 : 3","2 : 9","","","","","0 : 2","","","","","0 : 0","","","","","","","","","","","0 : 3","","","","","","3 : 1","3 : 1","","0 : 3","","","","","","","","","","","3 : 0","","","","","0 : 1","","","","","","","","","","","","","","0 : 0","","","","","","","","","","","","","","","","","","","","","0 : 3","","","","","","","","","","","","","","","","0 : 2","","","","","","","","","","","","","","","","","","","0 : 0","","","","","","","","","","","","","","","","","","","","","9 : 2","","","","","","","","","","","","","","","","","","","","","","","","","","","","","","","3 : 1","","","","","","","","","","","","","","","","","","","","","","","","","","",""]
[null,155,"TM 155",null,null,null,155,118,190,"TM 118","-","TM 190",0,":",0,null,155,"TM 74",16,5,3,8,23,":",31,-8,18,"","TM 74","","","","","","","","","","","","","","","","","","","","","1 : 3","","","","","","","","3 : 1","","","","","","","","","","","","1 : 5","","","","","","","","","","","","","","","","","","","","","","","0 : 0","","","2 : 5","","","","","","","","","0 : 3","","","","3 : 0","","","","0 : 4","0 : 0","","","","1 : 3","","","","","","","","","","","","","","","","","","","","","","3 : 0","","","","1 : 2","","","","","","","","","","","","","0 : 3","","","3 : 1","","","","","","","","","","","","","","","","","","","","","","","","","","","5 : 1","","","","","","","","","","","","","","","","","","","","","","0 : 0","","","","","","","","","","","","","","","","","","","","","","","","",""]
[null,156,"TM 156",null,null,null,156,43,105,"TM 43","-","TM 105",3,":",0,null,156,"TM 167",16,5,3,8,19,":",28,-9,18,"","TM 167","","","","","","","","","","","","","","","","","","","0 : 0","","","","","5 : 2","","","","","","","","","","","","","","","","","","","","","","0 : 3","0 : 1","","","0 : 2","","","","","","","","","","","","4 : 0","0 : 0","","0 : 2","","","","","","","","","","","","","","","","","","","","","","","","","","","","","","1 : 3","","","","","","","","","1 : 0","","","","","","","","","","","","","","","","","","0 : 4","","","","","","","","","","","","","","","","","","","0 : 1","","0 : 0","","","","","","","","","","","","","","","","","","","","","","3 : 1","","","","","","","","","","","","","","","","","","","","","","","","","","2 : 9","","","","","","","","","","","","","",""]
[null,157,"TM 157",null,null,null,157,85,111,"TM 85","-","TM 111",0,":",0,null,157,"TM 141",16,5,3,8,26,":",36,-10,18,"","TM 141","","","","","","","4 : 0","","","","","","","","","2 : 9","","","","","4 : 0","2 : 5","3 : 0","","","","","","2 : 9","","","","","","","1 : 3","","","","","0 : 1","","","","","","","","","","","","","0 : 1","","","","","","","","","","0 : 0","","","","","","","3 : 1","","","","","0 : 2","","","","0 : 0","","","","2 : 5","","","","","","","","","","","","","","","","","","","","","","","","","","","","","","","3 : 0","","0 : 0","","","","","","","","","","","","","","","","","","","","","","","","","","","","","","","","","","","","","","","","","","","","","","","","","","","","","","","","","","","","","","","","","","","","","","","","","","","","","","","","","","","","","","","",""]
[null,158,"TM 158",null,null,null,158,91,61,"TM 91","-","TM 61",1,":",0,null,158,"TM 51",16,5,3,8,25,":",35,-10,18,"","TM 51","","","","","","1 : 3","","","","","","2 : 5","","","","","","","","","","","","","","","","","","","","1 : 5","","","3 : 0","","","","","","","0 : 3","0 : 0","","0 : 2","","","","","","","","","","","","","3 : 0","4 : 0","","","","","","","2 : 9","","","0 : 0","","","","","","","","","","","","","","","","","","","","","","","","","","","","","","","","","","","","","","","","","","","","","1 : 3","","","","","","","","","","","","","","","","","","","","","","","","","","1 : 3","","","","","","","","","","","","","0 : 0","","","","","","","","","","","","","","","","","","","","","","","","","","","","","","","","","","","","2 : 0","","","","","","","","","","","","","","","","5 : 2"]
[null,159,"TM 159",null,null,null,159,179,151,"TM 179","-","TM 151",0,":",3,null,159,"TM 117",15,5,2,8,23,":",27,-4,17,"","TM 117","","","","","","","0 : 0","","","","1 : 3","","","0 : 2","","4 : 0","","","","","","2 : 5","","","","","3 : 0","","","","","","","","","","","","3 : 0","","","","","","","","","","","","","","","0 : 3","","","","","","","","","","","","","","","","","1 : 5","0 : 0","3 : 0","","","","","","2 : 5","","","","","","","","","","","","","","4 : 0","","","0 : 1","","","","","","0 : 3","","","","","","","","","","","","","","","","","","","","","","","","","","","","","","","","","","","","","","","","","","","","","","","","","","","","","","","","","","","","","","","","","","","","","","","","","","","","","","","","","","","","","","","","","","","","","","","","","","","","","","",""]
[null,160,"TM 160",null,null,null,160,19,138,"Feyenoord Rotterdam","-","TM 138",5,":",1,null,160,"TM 159",16,5,2,9,26,":",33,-7,17,"","TM 159","","","","","","","","2 : 9","","","","","","","","","","","0 : 3","","","","","1 : 3","","","","","","","","","","","","","","","","","","","","","","5 : 1","3 : 0","","","0 : 0","","0 : 1","","","","","","","","","","2 : 5","0 : 1","","0 : 0","","","","","","","","","","","","","","","","","","","","","","","","","","","","","","4 : 0","","","","","","","","","0 : 3","","","","","","","","","","","","","","","","0 : 2","","5 : 2","","","","","","","","","","","","","","","","","","","","","3 : 0","","","","","","","","","","","","","","","","","","1 : 3","","","","","","","","","","","","","","","","","","","","","","","","","","","","","","","","","","","","","","","","","","","",""]
[null,161,"TM 161",null,null,null,161,3,57,"FC Bayern München","-","TM 57",0,":",4,null,161,"TM 96",16,5,2,9,23,":",33,-10,17,"","TM 96","","","","","","","","","","","","","","","","","","3 : 0","","","","","","","","3 : 1","","0 : 1","","0 : 0","","","","0 : 2","","","","","","","","","","","","","","1 : 5","","","","","","","","","","","","4 : 0","","","","","","","","","","","","","","","","","","","","","","","","","","","","3 : 1","","","","2 : 9","","","","","0 : 1","","","4 : 0","","","","","","","","","","","","2 : 5","","","","","","","0 : 0","","","","","0 : 2","0 : 3","","","","","","","","","","","","","","","","","","","","","","","","","","","","","","","","","","","","","","","","","","","","","","","","","","1 : 3","","","","","","","","","","","","","","","","","","","","","","","","","","","","","",""]
[null,162,"TM 162",null,null,null,162,79,127,"TM 79","-","TM 127",5,":",2,null,162,"TM 113",16,5,2,9,20,":",30,-10,17,"","TM 113","","","","","","","","","","","","","","","","","","1 : 5","","","","","","","","1 : 3","","0 : 2","","3 : 0","","","1 : 3","4 : 0","","","","","","","","","","","","","","3 : 1","","","","","","","","","","","","0 : 0","","","","","","","","0 : 2","","","","","","3 : 1","","","","0 : 1","","","","","3 : 0","","","0 : 3","","","","","","","","","","","","","","","","","","","","1 : 5","","","","","","","","","","","","","","","","","","","","","","","","0 : 0","","","","","","","","","","","","","","","","","","","","","","","","","","0 : 4","","","","","","","","","","","","","","","","","","","","","","","","","","","","","","","","","","","","","","","","","","","","","","","","",""]
[null,163,"TM 163",null,null,null,163,152,49,"TM 152","-","TM 49",3,":",1,null,163,"TM 101",16,5,2,9,21,":",32,-11,17,"","TM 101","","","","","","","","","","","","","","","","","","","","","3 : 0","","0 : 3","","","","","","0 : 2","","","","","","","1 : 3","","","","","4 : 0","","","","","","","","","","","","","","","","","","","","","","","1 : 2","","","1 : 3","","","","","","","","","","","","","1 : 5","","","","3 : 0","0 : 3","","","","3 : 1","","","","","","","","","","","","","","","","","","","","","","1 : 5","","","","3 : 1","","","","","","","","","","","","","0 : 0","","","","","","","","","","","","","","","","","","","","","","","","","","","","","","0 : 4","","","","","","","","","","","","","","","","","","","","","","","","","","","","","","","","","","","","","","","","","","","","","","",""]
[null,164,"TM 164",null,null,null,164,69,126,"TM 69","-","TM 126",0,":",3,null,164,"Real Madrid",16,5,2,9,24,":",36,-12,17,"","Real Madrid","","","","","","","","","","","","","","","","3 : 0","","","","","1 : 5","4 : 0","0 : 1","","","","","","3 : 0","","","","","","","2 : 9","","","","","0 : 0","","","","","","","","","","","","","0 : 1","","","","","","","","","","0 : 2","","","2 : 9","","","","","","","","","3 : 1","","","","2 : 5","","","","4 : 0","0 : 1","","","","","","","","","","","","","","","","","","","","","","","","","","","","","","0 : 0","","0 : 2","","","","","","","","","","","","","","","","","","","","","","","","","","","","","","","","","","","","","","","","","","","","","","","","","","","","","","","","","","","","","","","","","","","","","","","","","","","","","","","","","","","","","","","",""]
[null,165,"TM 165",null,null,null,165,144,34,"TM 144","-","Stade Brest",9,":",2,null,165,"TM 64",16,5,2,9,23,":",35,-12,17,"","TM 64","","","","","","","1 : 3","","","","","","","","","3 : 0","","","","","0 : 0","0 : 3","3 : 1","","","","","","0 : 3","","","","","","","0 : 0","","","","","1 : 3","","","","","","","","","","","","","1 : 3","","","","","","","","","","1 : 3","","","1 : 5","","","","","","","","","3 : 0","","","","2 : 5","","","","3 : 1","","","","","","","","","","","","","","","","","","","","","","","","","","","","","","","3 : 0","","1 : 5","","","","","","","","","","","","","","","","","","","","","","","","","","","","","","","","","","","","","","","","","","","","","","","","","","","","","","","","","","","","","","","","","","","","","","","","","","","","","","","","","","","","","","","",""]
[null,166,"TM 166",null,null,null,166,184,9,"TM 184","-","FC Barcelona",3,":",1,null,166,"TM 120",15,5,1,9,25,":",32,-7,16,"","TM 120","","","","","","","2 : 5","","","","3 : 0","","","4 : 0","","0 : 0","","","","","","0 : 1","","","","","1 : 2","","","","","","","","","","","","1 : 5","","","","","","","","","","","","","","","1 : 3","","","","","","","","","","","","","","","","","0 : 3","3 : 0","4 : 0","","","","","","0 : 1","","","","","","","","","","","","","","","","","2 : 9","","","","","","1 : 3","","","","","","","","","","","","","","","3 : 0","","","","","","","","","","","","","","","","","","","","","","","","","","","","","","","","","","","","","","","","","","","","","","","","","","","","","","","","","","","","","","","","","","","","","","","","","","","","","","","","","","","","","","","",""]
[null,167,"TM 167",null,null,null,167,50,27,"TM 50","-","Young Boys Bern",1,":",3,null,167,"Atletico Madrid",16,4,4,8,17,":",29,-12,16,"","Atletico Madrid","","","","","","","1 : 3","","","","1 : 5","","","2 : 9","","0 : 1","","","","","","","","","","","3 : 0","","","","","","","","","","","","0 : 0","","","","","","","","","","","","","","","","","","","","","","","","","","","","","","","","0 : 0","0 : 2","0 : 3","","","","","","3 : 0","","","","","","","","","","","","","","0 : 1","","","0 : 0","","","","","","3 : 1","","","","","","","","","","","1 : 3","","","","","","","","","","","","","","","","","","","","","","","","","","","","","","","","","","","","","","","","","","","","","","","","","","","","","","","","","","","","","","","0 : 0","","","","","","","","","","","","","","","","","","","","","","","","","","","","",""]
[null,168,"TM 168",null,null,null,168,87,54,"TM 87","-","TM 54",2,":",0,null,168,"Eintracht Frankfurt",16,4,4,8,19,":",32,-13,16,"","Eintracht Frankfurt","","","","","","","","","1 : 3","2 : 5","","","","","","","","","","","","","","","","","","","","","","","","","","","","","","0 : 3","","","","","","","","","","","","","","","","0 : 1","","","","","4 : 0","","","","","","","","","0 : 0","","","","","1 : 3","","3 : 0","","","","","1 : 5","","","","","","","","2 : 9","","","","0 : 0","","","","","","","","","","","","","","","","","","","","","","","","0 : 0","","","","","","","","","","","","","","0 : 0","","","","","","","","","","","","","0 : 3","","","","","","","3 : 0","","","","","","","","","","","","","","","","","","","","","","","","","","","","","","","","","","","","","","","2 : 0","","","","","","","","","","","","","",""]
[null,169,"TM 169",null,null,null,169,147,84,"TM 147","-","TM 84",0,":",0,null,169,"TM 90",16,5,1,10,25,":",39,-14,16,"","TM 90","","","","","","","3 : 0","","","","","","","0 : 1","","2 : 9","","","","","2 : 5","1 : 3","0 : 2","","","","","","1 : 3","","","","","","","4 : 0","","","","","3 : 0","","","","","","","","","","","","","3 : 0","","","","","","","","","","","","","","","","","3 : 0","","1 : 3","","","0 : 0","","","","0 : 1","","","","","","","","","","","","","","","","","","","","","","","","","","","","","","","","","","","2 : 9","","0 : 3","","","","","","","","","","","","","","","","","","","","","","","","","","","","","","","","","","","","","","","","","","","","","","","","","","","","","","","","","","","","","","","","","","","","","","","","","","","","","","","","","","","","","","","",""]
[null,170,"TM 170",null,null,null,170,82,92,"TM 82","-","TM 92",3,":",0,null,170,"TM 195",16,5,1,10,27,":",43,-16,16,"","TM 195","","","","","","","1 : 3","","","","2 : 9","","","2 : 5","","","","","","","","","","","","","4 : 0","","","","","","","","","","","","1 : 2","","","","","","","","","","","","","","","","","","","","","","","","","","","","","","","","0 : 2","5 : 2","3 : 1","","","","","","0 : 3","","","","","","","","","","","","","","0 : 0","","","1 : 5","","","","","","0 : 4","","","0 : 3","","","","","","","","5 : 1","","","","","","","","","","","","","","","","","","","","","","","","","","","","","","","","","","","","","","","","","","","","","","","","","","","","","3 : 1","","","","","","","","","","0 : 2","","","","","","","","","","","","","","","","","","","","","","","","","","","","",""]
[null,171,"TM 171",null,null,null,171,169,96,"TM 169","-","TM 96",0,":",0,null,171,"TM 81",16,4,3,9,27,":",34,-7,15,"","TM 81","","","","","","","","","","","","","","","","","","2 : 9","","","","","","","","0 : 2","","","","0 : 1","","","","","","","","","","","","","","","","","","4 : 0","","","","","","","","","","","","2 : 5","","","","","","","","","","","","","","","","","","","","","","","","","","","","0 : 3","","","","1 : 3","","","","","1 : 3","","","2 : 5","","","","","","","","","","","","0 : 0","","","","","","","0 : 1","","","","","0 : 0","9 : 2","","","","","","","","","","","","","","","","","","","","","","","","","","","","","","","","","","","","","","","","","","","","","","","0 : 0","","","2 : 0","","","","","","","","","","","","","","","4 : 0","","","","","","","","","","","","","","",""]
[null,172,"TM 172",null,null,null,172,41,44,"TM 41","-","TM 44",1,":",0,null,172,"TM 177",15,4,3,8,18,":",27,-9,15,"","TM 177","","","","","","","3 : 0","","","","0 : 3","","","0 : 1","","0 : 2","","","","","","","","","","","0 : 0","","","","","","","","","","","","0 : 0","","","","","","","","","","","","","","","1 : 5","","","","","","","","","","","","","","","","","3 : 1","4 : 0","1 : 3","","","","","","0 : 0","","","","","","","","","","","","","","0 : 2","","","2 : 5","","","","","","1 : 5","","","","","","","","","","","3 : 0","","","","","","","","","","","","","","","","","","","","","","","","","","","","","","","","","","","","","","","","","","","","","","","","","","","","","","","","","","","","","","","","","","","","","","","","","","","","","","","","","","","","","","","","","","","",""]
[null,173,"TM 173",null,null,null,173,195,32,"TM 195","-","VfB Stuttgart",0,":",3,null,173,"TM 186",16,4,3,9,22,":",32,-10,15,"","TM 186","","","","","","","","","","","","","","","","","","2 : 9","","","","","","","","","","3 : 0","","0 : 1","","","0 : 0","0 : 0","","","","","","","","","","","","","","4 : 0","","","","","","","","","","","","2 : 5","","","","","","","","0 : 3","","","","","","0 : 1","","","","1 : 3","","","","","0 : 3","","","4 : 0","","","","","","","","","","","","","","","","","","","","0 : 2","","","","","","","","","","","","","","","","","","","","","","","","5 : 2","","","","","","","","","","","","","","","","","","","","","","","","","","0 : 0","","","1 : 3","","","","","","","","","","","","","","","","","","","","","","","","","","","","","","","","","","","","","","","","","","","","","",""]
[null,174,"TM 174",null,null,null,174,78,148,"TM 78","-","TM 148",5,":",1,null,174,"TM 133",16,4,3,9,20,":",30,-10,15,"","TM 133","","","","","","0 : 1","","","","","","1 : 3","3 : 0","","","","","","","","","","","","0 : 2","","","","","","","4 : 0","","","0 : 2","","","","","","","0 : 0","0 : 3","0 : 0","0 : 0","","","","","","","","","","3 : 1","","","","2 : 5","","","","","","","1 : 5","","","1 : 3","","","","","","","","","","","","","","","","","","","","","","","","","","","","","","4 : 0","","1 : 5","","","","","","","","","","","","","","","","","","","","","","","","","","","","","","","","","","","","","","","","","","","","","","","","","","","","","","","","","","","","","","","","","","","","","","","","","","","","","","","","","","","","","","","","","","","","","","","","","","","","","","","",""]
[null,175,"TM 175",null,null,null,175,62,81,"TM 62","-","TM 81",0,":",4,null,175,"TM 105",16,4,3,9,24,":",37,-13,15,"","TM 105","","","","","","1 : 3","","","","","","2 : 9","3 : 1","","","","","","","","","","","","3 : 0","","","","","","","","","","","","","","","","","0 : 3","","0 : 2","","","","","","","","","","","0 : 1","","","","1 : 4","","","","","","","","","","0 : 0","","","","","","","","","","","","","","","","","","","","","","","","","","","","","0 : 3","3 : 1","","2 : 5","","","","","","","","","","","","","","","","","","","","","","","","","","","","","","","","0 : 3","","","","","","","","","0 : 0","","","","","","9 : 2","","","","","","","","","","","","0 : 0","","","","","","","","","","","","","","","","","","","","","","","","","","","","","","","","","","","","","","","","","","","","",""]
[null,176,"TM 176",null,null,null,176,89,42,"TM 89","-","TM 42",5,":",2,null,176,"TM 145",16,4,3,9,23,":",36,-13,15,"","TM 145","","","","","","","","2 : 5","","","","","","","","","0 : 0","","4 : 0","","","","","0 : 2","","","","","","","","","","","","","","","","","","","","","","2 : 9","3 : 0","","0 : 2","0 : 0","","1 : 2","0 : 1","","","","2 : 9","","","","","3 : 0","0 : 0","","","","","","","","","","","","","","","","","","","","","","","","","","","","","","","","0 : 1","","","","","","","","","","","","","","","","","","","","","","","","","2 : 5","","","","","","","","","4 : 0","","","","","","","","","","","","","","","","","","","","","","","","","","","","","","","","","","","","","","","","","","","","","","","","","","","","","","","","","","","","","","","","","","","","","","","","","","","",""]
[null,177,"TM 177",null,null,null,177,11,181,"Atletico Madrid","-","TM 181",1,":",3,null,177,"TM 119",16,4,3,9,19,":",32,-13,15,"","TM 119","","","","","","","","","","0 : 2","","","","","1 : 3","","","","","","","","","","","","","","","","","","","","","","","0 : 3","","0 : 2","","","","","","","","","","","2 : 9","","","","","3 : 0","","","","","3 : 0","","","","","","","","","1 : 3","","","","","","","5 : 2","","","","","0 : 1","","","","","","","","0 : 0","","","","3 : 1","","","","","","","","","","","","","0 : 0","","","","","","","","","","","1 : 3","","","","","","","","","","","","","","","","","","","","","","","","","","","","","","","","","","0 : 3","","","","","","","","","","","","","","","","","","","","","","","","","","","","","","","","","","","","","","","","","","","","","","","","","","","","",""]
[null,178,"TM 178",null,null,null,178,103,112,"TM 103","-","TM 112",3,":",1,null,178,"TM 57",16,4,3,9,23,":",37,-14,15,"","TM 57","","","","","","","","","","","","","","","","","","2 : 5","","","","","","","","2 : 9","","3 : 0","","1 : 2","","","2 : 9","0 : 0","","","","","","","","","","","","","","0 : 0","","","","","","","","","","","","3 : 1","","","","","","","","","","","","","","","","","","0 : 2","","","","","4 : 0","","","0 : 1","","0 : 1","","","","0 : 0","","","","","4 : 0","","","","","","","","","2 : 5","","","","","","0 : 2","","","","","","","","","","","","","","","","","","","","","","","","","","","","","","","","","","","","","","","","","","","","","","","","","","","","","","","","","","","","","","","","","","","","","","","","","","","","","","","","","","","","","","","","","","","","",""]
[null,179,"TM 179",null,null,null,179,177,40,"TM 177","-","Hertha BSC",0,":",2,null,179,"TM 132",15,5,0,10,25,":",40,-15,15,"","TM 132","","","","","","","0 : 1","","","","1 : 2","","","1 : 3","","3 : 0","","","","","","2 : 9","1 : 3","","","","2 : 5","","","","","","","","","","","","3 : 1","","","","","","","","","","","","","","","3 : 0","","","","","","","","","","","","","","","","","1 : 3","1 : 5","0 : 2","","","","","","2 : 1","","","","","","","","","","","","","","","","","4 : 0","","","","","","","","","","","","","","","","","","","","","1 : 5","","","","","","","","","","","","","","","","","","","","","","","","","","","","","","","","","","","","","","","","","","","","","","","","","","","","","","","","","","","","","","","","","","","","","","","","","","","","","","","","","","","","","","","",""]
[null,180,"TM 180",null,null,null,180,180,130,"TM 180","-","TM 130",4,":",0,null,180,"TM 75",16,4,3,9,20,":",35,-15,15,"","TM 75","","","","","","","","","0 : 3","0 : 0","","","","","4 : 0","","","","","2 : 5","","","","","","","","","","","0 : 2","","","","","","3 : 1","0 : 0","","1 : 3","","","","","","","","","","","1 : 3","","","","","2 : 9","","","","","0 : 2","","","","","","","","","3 : 0","","","","","","","","","","","","","","","","","","","","","3 : 1","","","","","","","","","","","","","","","","1 : 3","","","","","","","","","","","","","","","","","","","0 : 3","","","","","","","","","","","","","","","","","","","","","0 : 0","","","","","","","","","","","","","","","","","","","","","","","","","","","","","","","","","","","","","","","","","","","","","","","","","","","","","","","","","",""]
[null,181,"TM 181",null,null,null,181,117,4,"TM 117","-","Paris Saint-Germain",0,":",3,null,181,"TM 63",16,4,3,9,24,":",40,-16,15,"","TM 63","","","","","","","","","1 : 5","3 : 0","","","","","2 : 5","","","","","1 : 3","","","","","","","","","","","0 : 1","","","","","","0 : 0","0 : 0","","3 : 0","","","","","","","","","","","4 : 0","","","","","1 : 5","","","","","0 : 1","","","","","","","","","2 : 9","","","","","","","","","","","","0 : 0","","","","","","","","","","","","5 : 3","","","","","","","","","","","","","0 : 3","","","","","","","","","","","2 : 5","","","","","","","","","","","","","","","","","","","","","","","","","","","","","","","","","","","","","","","","","","","","","","","","","","","","","","","","","","","","","","","","","","","","","","","","","","","","","","","","","","","","","","",""]
[null,182,"TM 182",null,null,null,182,66,140,"TM 66","-","TM 140",0,":",0,null,182,"TM 150",16,4,3,9,20,":",36,-16,15,"","TM 150","","","","","","0 : 0","","","","","","0 : 2","0 : 3","","","","","","","","","","","","2 : 9","","","","","","","0 : 1","","","5 : 2","","","","","","","2 : 5","3 : 1","","1 : 3","","","","","","","","","","3 : 0","","","0 : 3","3 : 0","","","","","","","0 : 0","","","1 : 3","","","","","","","","","","","","","","","","","","","","","","","","","","","","","","","","0 : 0","","","","","","","","","","","","","","","","","","","","","","","","","","","","","","","","","","","","","","","","","","","","","","","","","","","","0 : 4","","","","","","","","","","","","","","","","","","","","","","","","","","","","","","","","","","","","","","","","","","","","","","","","","","","",""]
[null,183,"TM 183",null,null,null,183,120,122,"TM 120","-","TM 122",0,":",1,null,183,"TM 53",16,4,3,9,22,":",39,-17,15,"","TM 53","","","","","","0 : 3","","","","","","0 : 0","0 : 0","","","","","","","","","","","","1 : 5","","","","","","","","","","","","","","","","","1 : 3","2 : 5","4 : 0","","","","","","","","","","","2 : 9","","","","0 : 2","","","","","","","","","","3 : 0","","","","","","","","","","","","","","","","","","","","","","","","","","","","","0 : 2","3 : 1","","1 : 3","","","","","","","","","","","","","","","","","","","","","","","","","","","","","","","","3 : 1","","","","","","","","","2 : 5","","","","","","0 : 0","","","","","","","","","","","","","","","","","","","","","","","","","","","","","","","","","","","","","","","","","","","","","","","","","","","","","","","","",""]
[null,184,"TM 184",null,null,null,184,74,88,"TM 74","-","TM 88",3,":",0,null,184,"TM 196",16,4,3,9,21,":",38,-17,15,"","TM 196","","","","","","","","3 : 0","","","","","","","","","1 : 5","","","","","","","2 : 9","","","","","","","","","","","","","","","","","","","","","","","0 : 1","","2 : 5","","","0 : 0","0 : 0","","","","3 : 1","","","","","4 : 0","","","","","","","","","","","","","","","","","","","4 : 0","","","","","","2 : 9","","","","","","","","","","","","","","","","","","","","","","0 : 3","0 : 0","","","","","","","","","","","","","","","","","","","0 : 1","","","","","","","","","","","","","","","","","","","","","","","","","","","","","","","","","","0 : 2","","","","","","","","","","","","","","","","","","","","","","","","","","","","","","","","","","","","","","","","","",""]
[null,185,"TM 185",null,null,null,185,132,14,"TM 132","-","Benfica Lissabon",1,":",5,null,185,"TM 62",16,4,3,9,20,":",37,-17,15,"","TM 62","","","","","","","0 : 3","","","","3 : 1","","","0 : 0","","2 : 9","","","","","","","","","","","0 : 2","","","","","","","","","","","","2 : 5","","","","","","","","","","","","","","","","","","","","","","","","","","","","","","","","3 : 0","0 : 1","1 : 3","","","","","","1 : 3","","","","","","","","","","","","","","5 : 2","","","3 : 1","","","","","","0 : 0","","","0 : 0","","","","","","","","0 : 3","","","","","","","","","","","","","","","","","","","","","","","","","","","","","","","","","","","","","","","","","","","","","","","","","","","","","","","","","","","","","","","0 : 4","","","","","","","","","","","","","","","","","","","","","","","","","","","","",""]
[null,186,"TM 186",null,null,null,186,65,77,"TM 65","-","TM 77",4,":",0,null,186,"TM 176",16,4,2,10,29,":",42,-13,14,"","TM 176","","","","","","","","","","","","","","","","","","","","","","","","","","","","","","","","","","","","","","","","","","","","","","","","","","","","","","","","","","","","","","","4 : 0","","1 : 3","","","","","","","","","","3 : 1","","0 : 1","","","","","0 : 0","","","","","","","","0 : 0","","","","","3 : 4","","","","","","","","","3 : 1","","","","","","","","","","","","","","0 : 3","","2 : 5","","1 : 5","","","","","","","","","","1 : 3","","","","","","","","","","","0 : 3","","","","","","","","","2 : 9","","","","","","","","","9 : 2","","","","","","","","","","","","0 : 2","","","","","","","","","","","","","","","","","","","","","","","","","","","","","","","",""]
[null,187,"TM 187",null,null,null,187,197,71,"TM 197","-","TM 71",2,":",5,null,187,"TM 45",16,4,2,10,23,":",38,-15,14,"","TM 45","","","","","","","","3 : 1","","","","","","","","","1 : 3","","1 : 2","","","","","2 : 5","","","","","","","","","","","","","","","","","","","","","","3 : 0","0 : 0","","3 : 4","0 : 0","","1 : 5","1 : 3","","","","0 : 3","","","","","3 : 0","1 : 5","","","","","","","","","","","","","","","","","","","","","","","","","","","","","","","","1 : 3","","","","","","","","","","","","","","","","","","","","","","","","","0 : 3","","3 : 1","","","","","","","","","","","","","","","","","","","","","","","","","","","","","","","","","","","","","","","","","","","","","","","","","","","","","","","","","","","","","","","","","","","","","","","","","","","","","","","","","","",""]
[null,188,"TM 188",null,null,null,188,101,13,"TM 101","-","Juventus Turin",1,":",3,null,188,"Bayer Leverkusen",16,4,2,10,24,":",41,-17,14,"","Bayer Leverkusen","","","","","","","","1 : 2","","","","","","","","","2 : 5","","2 : 9","","","","","3 : 1","","","","","","","","","","","","","","","","","","","","","","0 : 1","1 : 5","","","0 : 3","","3 : 0","","","","","0 : 0","","","","","1 : 3","3 : 0","","0 : 3","","","","","","","","","","","","","","","","","","","","","","","","","","","","","","2 : 5","","","","","","","","","5 : 1","","","","","","","","","","","","","","","","0 : 0","","1 : 3","","","","","","","","","","","","","","","","","","","","","","","","","","","","","","","","","","","","","","","","","","","","","","","","","","","","","","","","","","","","","","","","","","","","","","","","","","","","","","","","","","",""]
[null,189,"TM 189",null,null,null,189,129,106,"TM 129","-","TM 106",3,":",0,null,189,"TM 151",16,4,2,10,22,":",42,-20,14,"","TM 151","","","","","","","","","","","","","","","","","","3 : 1","","","","","","","","0 : 3","","0 : 0","","1 : 5","","","3 : 0","2 : 9","","","","","","","","","","","","","","1 : 3","","","","","","","","","","","","3 : 0","","","","","","","","","","","","","","1 : 5","","","","2 : 5","","","","","1 : 2","","","1 : 3","","1 : 3","","","","","","","","","0 : 0","","","","","","","","","0 : 3","","","","","","3 : 0","","","","","","","","","","","","","","","","","","","","","","","","","","","","","","","","","","","","","","","","","","","","","","","","","","","","","","","","","","","","","","","","","","","","","","","","","","","","","","","","","","","","","","","","","","","","",""]
[null,190,"TM 190",null,null,null,190,128,25,"TM 128","-","OSC Lille",2,":",9,null,190,"Schachtjor Donezk",16,3,4,9,18,":",33,-15,13,"","Schachtjor Donezk","","","","","","2 : 5","","","","","","4 : 0","1 : 3","","","","","","","","","","","","0 : 0","","","","","","","5 : 2","","","0 : 0","","","","","","","1 : 2","0 : 0","","","","","","","","","","","","0 : 2","","","1 : 1","1 : 5","","","","","","","0 : 4","","","3 : 1","","","","","","","","","","","","","","","","","","","","","","","","","","","","","","","","","","","","","","","","","","","","","0 : 3","","","","","","","","","","","","","","","","","","","","","","","","","","","","","","","","","","","","","","","0 : 2","","","","","","","","","","","","","","","","","","","","","","","","","","","","","","","","","","","","","","","","","","","","","","","","","","","",""]
[null,191,"TM 191",null,null,null,191,188,191,"TM 188","-","TM 191",1,":",3,null,191,"TM 197",15,4,1,10,24,":",48,-24,13,"","TM 197","","","","","","","2 : 9","","","","2 : 5","","","0 : 3","","1 : 5","","","","","","4 : 0","2 : 5","","","","0 : 0","","","","","","","","","0 : 2","","","1 : 3","","","","","","","","","","","","","","","1 : 3","","","","","","","","","","","","","","","","","","3 : 1","3 : 0","","","","","","","","","","","","","","","","","","","","","","","0 : 2","","","","","","","","","","","","","","","","","","","","","","","","","","","","","","","","","","","","","","","","","","","","","","","","","","","","","","","","","","","","","","","","","","","","","","","","","","","","","","","","","","","","","","","","","","","","","","","","","","","","","","","","","","","","",""]
[null,192,"TM 192",null,null,null,192,56,183,"TM 56","-","TM 183",3,":",1,null,192,"TM 190",16,3,3,10,22,":",41,-19,12,"","TM 190","","","","","","","","","","","","","","","","","","1 : 2","","","","","","","","0 : 0","","1 : 5","","3 : 0","","","0 : 1","0 : 3","","","","","","","","","","","","","","2 : 5","","","","","","","","","","","","1 : 3","","","","","","","","","","","","","","3 : 0","","","","4 : 0","","","","","2 : 9","","","2 : 5","","2 : 2","","","","","","","","","","","","","","","","","","0 : 0","","","","","","","","","","","","","","","","","","","","","","","","1 : 3","","","","","","","","","","","","","","","","","","","","","","","","","","0 : 3","","","","","","","","","","","","","","","","","","","","","","","","","","","","","","","","","","","","","","","","","","","","","","","","",""]
[null,193,"TM 193",null,null,null,193,36,95,"Mainz 05","-","TM 95",0,":",2,null,193,"Stade Brest",16,3,3,10,21,":",40,-19,12,"","Stade Brest","","","","","","","","","","","","","","","","","","0 : 0","","","","","","","","1 : 3","","2 : 9","","4 : 0","","","1 : 2","0 : 1","","","","","","","","","","","","","","0 : 3","","","","","","","","","","","","","","","","","","","","","","","","","","","","","","","","","","","2 : 5","","","","","3 : 0","","","","0 : 1","","","","","2 : 5","","","2 : 9","","","","","","","","","","","","0 : 0","","","","","","","","","","","","4 : 0","","","","","","","","","","","","","","","","","","","","","","","","","","","","","","","","","","","","","","","","","","","","","","","","","","","","","","","","","","","","","","","","","","","","","","","","","","","","","","","","",""]
[null,194,"TM 194",null,null,null,194,178,109,{"$f":"IFERROR(VLOOKUP($H199,$B$6:$C$205,2,0),\"\")","v":"TM 178"},"-",{"$f":"IFERROR(VLOOKUP($I199,$B$6:$C$205,2,0),\"\")","v":"TM 109"},0,":",0,null,194,"TM 188",15,3,2,10,17,":",36,-19,11,"","TM 188","","","","","","","1 : 5","","","","","","","3 : 0","","3 : 4","","","","","","0 : 3","0 : 3","","","","0 : 1","","","","","","","","","0 : 2","","","1 : 3","","","","","","","","","","","","","","","0 : 0","","","","","","","","","","","","","","","","","0 : 2","","3 : 1","","","","","","","2 : 9","","","","","","","","","","","","","","","","0 : 0","","","","","","","","","","","","","","","","","","","4 : 0","","0 : 3","","","","","","","","","","","","","","","","","","","","","","","","","","","","","","","","","","","","","","","","","","","","","","","","","","","","","","","","","","","","","","","","","","","","","","","","","","","","","","","","","","","","","","","",""]
[null,195,"TM 195",null,null,null,195,174,156,"TM 174","-","TM 156",0,":",3,null,195,"TM 84",16,3,2,11,21,":",42,-21,11,"","TM 84","","","","","","","","","","","","","","","","","","0 : 1","","","","","","","","4 : 0","","1 : 3","","2 : 5","","","","3 : 0","","","","","","","","","","","","","","2 : 9","","","","","","","","","","","","0 : 0","","","","","","","","","","","","","","","","","","0 : 3","","","","","","","","","","1 : 5","","","","3 : 0","","","","","1 : 3","","","1 : 3","","","","","","","","","","","","0 : 3","","","","","","","1 : 2","","","","","2 : 5","0 : 0","","","","","","","","","","","","","","","","","","","","","","","","","","","","","","","","","","","","","","","","","","","","","","","","","","","","","","","","","","","","","","","","","","","","","","","","","","","","","","","",""]
[null,196,"TM 196",null,null,null,196,1,171,"Real Madrid","-","TM 171",0,":",1,null,196,"TM 125",16,3,2,11,21,":",43,-22,11,"","TM 125","","","","","","","","1 : 3","","","","","","","","","0 : 3","","2 : 5","","","","","0 : 0","","","","","","","","","","","","","","","","","","","","","","1 : 2","2 : 9","","0 : 0","0 : 1","","4 : 0","3 : 0","","","","1 : 3","","","","","0 : 2","","","","","","","","","","","","","","","","","","","2 : 9","","","","","","0 : 1","","","","","","","","3 : 0","","","","","","","","","","","","","","","","","","","","","","","","","","","","","","","","","","2 : 5","","","","","","","","","","","","","","","","","","","","","","","","","","","","","","","","","","","","","","","","","","","","","","","","","","","","","","","","","","","","","","","","","","","","","","","","","","","",""]
[null,197,"TM 197",null,null,null,197,90,39,"TM 90","-","FC Lille",0,":",1,null,196,"TM 128",16,3,2,11,21,":",43,-22,11,"","TM 128","","","","","","","","","","","","","","","","","","","","","3 : 0","","2 : 9","","","","","","0 : 2","","","","","","","0 : 0","","","","","0 : 3","","","","","","","","","","","","","","","","","","","","","","","4 : 0","","","0 : 1","","","","","","","","","1 : 3","","","","1 : 2","","","","2 : 9","2 : 5","","","","3 : 0","","","","","","","","","","","","","","","","","","","","","","0 : 0","","","","2 : 5","","0 : 1","","","","","","","","","","","1 : 3","","","","","","","","","","","","","","","","","","","","","","","","","","","","","","","","","","","","","","","","","","","","","","","","","","","","","","","","","","","","","","","","","","","","","","","","","","","","",""]
[null,198,"TM 198",null,null,null,198,64,131,"TM 64","-","TM 131",3,":",0,null,198,"TM 178",16,3,2,11,20,":",43,-23,11,"","TM 178","","","","","","","","","","","","","","","","","","","","","1 : 5","0 : 0","1 : 3","","","","","","0 : 0","","","","","","","0 : 3","","","","","2 : 9","","","","","","","","","","","","","2 : 5","","","","","","","","","","2 : 5","","","3 : 0","","","","","","","","","0 : 1","","","","3 : 1","","","","1 : 2","1 : 3","","","","","","","","","","","","","","","","","","","","","","","","","","0 : 3","","","","1 : 3","","3 : 0","","","","","","","","","","","","","","","","","","","","","","","","","","","","","","","","","","","","","","","","","","","","","","","","","","","","","","","","","","","","","","","","","","","","","","","","","","","","","","","","","","","","","","","",""]
[null,199,"TM 199",null,null,null,199,8,55,"RB Leipzig","-","TM 55",1,":",5,null,199,"TM 157",16,3,2,11,19,":",46,-27,11,"","TM 157","","","","","","0 : 2","","","","","","3 : 0","0 : 0","","","","","","","","","","","","4 : 0","","","","","","","0 : 7","","","","","","","","","","3 : 0","1 : 3","2 : 5","2 : 5","","","","","","","","","","1 : 5","","","","0 : 1","","","","","","","0 : 3","","","2 : 9","","","","","","","","","","","","","","","","","","","","","","","","","","","","","","0 : 0","","0 : 3","","","","","","","","","","","","","","","","","","","","","","","","","","","","","","","","","","","","","","","","","1 : 3","","","","","","","","","","","","","","","","","","","","","","","","","","","","","","","","","","","","","","","","","","","","","","","","","","","","","","","","","","","","","","",""]
[null,200,"TM 200",null,null,null,200,141,18,"TM 141","-","AC Mailand",4,":",0,null,200,"TM 149",16,3,1,12,20,":",50,-30,10,"","TM 149","","","","","","","","0 : 1","","","","","","","","","2 : 9","","1 : 3","","","","","0 : 3","","","","","","","","","","","","","","","","","","","","","","","1 : 3","","0 : 3","3 : 0","","2 : 5","1 : 5","","","","3 : 1","","","","","0 : 0","","","","","","","","","","","","","","","","","","","1 : 3","","","","","","3 : 0","","","","","","","","","","","","","","","","","","","","","","0 : 6","","","","","","","","","","","","","","","","","","","","1 : 3","","","","","","","","","","","","","","","","","","","","","","","","","","","","","","","","","","2 : 5","","","","","","","","","","","","","","","","","","","","","","","","","","","","","","","","","","","","","","","","","",""]
[null,null,null,null,null,null,201,176,33,"TM 176","-","Sturm Graz",2,":",5]
[null,null,null,null,null,null,202,31,35,"FC Girona","-","Eintracht Frankfurt",3,":",1]
[null,null,null,null,null,null,203,47,30,"TM 47","-","FC Bologna",0,":",3]
[null,null,null,null,null,null,204,46,58,"TM 46","-","TM 58",9,":",2]
[null,null,null,null,null,null,205,104,28,"TM 104","-","AS Monaco",3,":",1]
[null,null,null,null,null,null,206,26,175,"Roter Stern Belgrad","-","TM 175",1,":",3]
[null,null,null,null,null,null,207,76,23,"TM 76","-","Dinamo Zagreb",2,":",0]
[null,null,null,null,null,null,208,22,12,"Celtic Glasgow","-","Atalanta Bergamo",0,":",0]
[null,null,null,null,null,null,209,124,21,"TM 124","-","PSV Eindhoven",3,":",0]
[null,null,null,null,null,null,210,20,119,"Sporting Lissabon","-","TM 119",0,":",0]
[null,null,null,null,null,null,211,80,167,"TM 80","-","TM 167",1,":",0]
[null,null,null,null,null,null,212,165,146,"TM 165","-","TM 146",0,":",3]
[null,null,null,null,null,null,213,139,164,"TM 139","-","TM 164",5,":",1]
[null,null,null,null,null,null,214,163,72,"TM 163","-","TM 72",0,":",4]
[null,null,null,null,null,null,215,73,159,"TM 73","-","TM 159",5,":",2]
[null,null,null,null,null,null,216,161,63,"TM 161","-","TM 63",3,":",5]
[null,null,null,null,null,null,217,153,15,"TM 153","-","FC Arsenal",0,":",3]
[null,null,null,null,null,null,218,7,189,"Borussia Dortmund","-","TM 189",9,":",2]
[null,null,null,null,null,null,219,102,10,"TM 102","-","Bayer Leverkusen",2,":",1]
[null,null,null,null,null,null,220,158,83,"TM 158","-","TM 83",1,":",3]
[null,null,null,null,null,null,221,16,6,"FC Brügge","-","Inter Mailand",2,":",0]
[null,null,null,null,null,null,222,5,75,"FC Liverpool","-","TM 75",0,":",0]
[null,null,null,null,null,null,223,67,45,"TM 67","-","TM 45",3,":",0]
[null,null,null,null,null,null,224,2,172,"Manchester City","-","TM 172",0,":",0]
[null,null,null,null,null,null,225,48,145,"TM 48","-","TM 145",1,":",0]
[null,null,null,null,null,null,226,199,136,"TM 199","-","TM 136",0,":",3]
[null,null,null,null,null,null,227,60,143,"TM 60","-","TM 143",5,":",1]
[null,null,null,null,null,null,228,134,115,"TM 134","-","TM 115",0,":",4]
[null,null,null,null,null,null,229,100,125,"TM 100","-","TM 125",5,":",2]
[null,null,null,null,null,null,230,121,185,"TM 121","-","TM 185",3,":",1]
[null,null,null,null,null,null,231,155,99,"TM 155","-","TM 99",0,":",3]
[null,null,null,null,null,null,232,98,154,"TM 98","-","TM 154",2,":",2]
[null,null,null,null,null,null,233,68,149,"TM 68","-","TM 149",3,":",1]
[null,null,null,null,null,null,234,198,93,"TM 198","-","TM 93",1,":",3]
[null,null,null,null,null,null,235,51,196,"TM 51","-","TM 196",2,":",0]
[null,null,null,null,null,null,236,194,52,"TM 194","-","TM 52",0,":",0]
[null,null,null,null,null,null,237,59,29,"TM 59","-","Aston Villa",6,":",0]
[null,null,null,null,null,null,238,193,94,"TM 193","-","TM 94",0,":",0]
[null,null,null,null,null,null,239,160,97,"TM 160","-","TM 97",1,":",0]
[null,null,null,null,null,null,240,142,38,"TM 142","-","FC Basel",5,":",2]
[null,null,null,null,null,null,241,17,116,"Schachtjor Donezk","-","TM 116",1,":",1]
[null,null,null,null,null,null,242,24,137,"Red Bull Salzburg","-","TM 137",0,":",4]
[null,null,null,null,null,null,243,150,166,"TM 150","-","TM 166",5,":",2]
[null,null,null,null,null,null,244,37,170,"AC Roma","-","TM 170",1,":",3]
[null,null,null,null,null,null,245,168,70,"TM 168","-","TM 70",3,":",1]
[null,null,null,null,null,null,246,192,86,"TM 192","-","TM 86",0,":",2]
[null,null,null,null,null,null,247,133,123,"TM 133","-","TM 123",0,":",0]
[null,null,null,null,null,null,248,114,173,"TM 114","-","TM 173",0,":",3]
[null,null,null,null,null,null,249,157,187,"TM 157","-","TM 187",0,":",7]
[null,null,null,null,null,null,250,186,182,"TM 186","-","TM 182",0,":",1]
[null,null,null,null,null,null,251,108,162,"TM 108","-","TM 162",3,":",0]
[null,null,null,null,null,null,252,113,110,"TM 113","-","TM 110",1,":",5]
[null,null,null,null,null,null,253,200,107,"TM 200","-","TM 107",4,":",0]
[null,null,null,null,null,null,254,190,135,"TM 190","-","TM 135",2,":",5]
[null,null,null,null,null,null,255,53,43,"TM 53","-","TM 43",1,":",3]
[null,null,null,null,null,null,256,111,118,"TM 111","-","TM 118",3,":",0]
[null,null,null,null,null,null,257,105,91,"TM 105","-","TM 91",2,":",9]
[null,null,null,null,null,null,258,151,85,{"$f":"IFERROR(VLOOKUP($H263,$B$6:$C$205,2,0),\"\")","v":"TM 151"},"-",{"$f":"IFERROR(VLOOKUP($I263,$B$6:$C$205,2,0),\"\")","v":"TM 85"},1,":",3]
[null,null,null,null,null,null,259,61,19,"TM 61","-","Feyenoord Rotterdam",3,":",1]
[null,null,null,null,null,null,260,57,179,"TM 57","-","TM 179",0,":",2]
[null,null,null,null,null,null,261,138,79,"TM 138","-","TM 79",0,":",0]
[null,null,null,null,null,null,262,49,3,"TM 49","-","FC Bayern München",0,":",3]
[null,null,null,null,null,null,263,127,69,"TM 127","-","TM 69",0,":",0]
[null,null,null,null,null,null,264,34,152,"Stade Brest","-","TM 152",0,":",1]
[null,null,null,null,null,null,265,126,184,"TM 126","-","TM 184",3,":",0]
[null,null,null,null,null,null,266,27,144,"Young Boys Bern","-","TM 144",1,":",5]
[null,null,null,null,null,null,267,9,87,"FC Barcelona","-","TM 87",4,":",0]
[null,null,null,null,null,null,268,84,50,"TM 84","-","TM 50",2,":",5]
[null,null,null,null,null,null,269,54,82,"TM 54","-","TM 82",3,":",1]
[null,null,null,null,null,null,270,96,147,"TM 96","-","TM 147",0,":",3]
[null,null,null,null,null,null,271,92,41,"TM 92","-","TM 41",9,":",2]
[null,null,null,null,null,null,272,32,169,"VfB Stuttgart","-","TM 169",3,":",1]
[null,null,null,null,null,null,273,44,78,"TM 44","-","TM 78",1,":",3]
[null,null,null,null,null,null,274,81,195,"TM 81","-","TM 195",2,":",0]
[null,null,null,null,null,null,275,148,89,"TM 148","-","TM 89",0,":",0]
[null,null,null,null,null,null,276,181,62,"TM 181","-","TM 62",3,":",0]
[null,null,null,null,null,null,277,42,103,"TM 42","-","TM 103",0,":",0]
[null,null,null,null,null,null,278,40,11,"Hertha BSC","-","Atletico Madrid",1,":",0]
[null,null,null,null,null,null,279,112,180,"TM 112","-","TM 180",0,":",3]
[null,null,null,null,null,null,280,4,177,"Paris Saint-Germain","-","TM 177",5,":",1]
[null,null,null,null,null,null,281,130,66,"TM 130","-","TM 66",0,":",4]
[null,null,null,null,null,null,282,122,117,"TM 122","-","TM 117",5,":",2]
[null,null,null,null,null,null,283,140,74,"TM 140","-","TM 74",3,":",1]
[null,null,null,null,null,null,284,14,120,"Benfica Lissabon","-","TM 120",0,":",3]
[null,null,null,null,null,null,285,88,65,"TM 88","-","TM 65",9,":",2]
[null,null,null,null,null,null,286,71,132,"TM 71","-","TM 132",2,":",1]
[null,null,null,null,null,null,287,77,101,"TM 77","-","TM 101",1,":",3]
[null,null,null,null,null,null,288,106,197,"TM 106","-","TM 197",2,":",0]
[null,null,null,null,null,null,289,13,128,"Juventus Turin","-","TM 128",0,":",0]
[null,null,null,null,null,null,290,191,129,"TM 191","-","TM 129",3,":",0]
[null,null,null,null,null,null,291,25,56,"OSC Lille","-","TM 56",0,":",0]
[null,null,null,null,null,null,292,95,188,"TM 95","-","TM 188",1,":",0]
[null,null,null,null,null,null,293,183,178,"TM 183","-","TM 178",0,":",3]
[null,null,null,null,null,null,294,156,36,"TM 156","-","Mainz 05",5,":",1]
[null,null,null,null,null,null,295,109,1,"TM 109","-","Real Madrid",0,":",4]
[null,null,null,null,null,null,296,39,174,"FC Lille","-","TM 174",5,":",2]
[null,null,null,null,null,null,297,171,64,"TM 171","-","TM 64",3,":",1]
[null,null,null,null,null,null,298,55,90,"TM 55","-","TM 90",0,":",3]
[null,null,null,null,null,null,299,131,141,"TM 131","-","TM 141",9,":",2]
[null,null,null,null,null,null,300,18,8,"AC Mailand","-","RB Leipzig",3,":",1]
[null,null,null,null,null,null,301,31,176,"FC Girona","-","TM 176",1,":",3]
[null,null,null,null,null,null,302,30,33,"FC Bologna","-","Sturm Graz",2,":",0]
[null,null,null,null,null,null,303,35,46,"Eintracht Frankfurt","-","TM 46",0,":",0]
[null,null,null,null,null,null,304,28,47,"AS Monaco","-","TM 47",3,":",0]
[null,null,null,null,null,null,305,58,26,"TM 58","-","Roter Stern Belgrad",0,":",0]
[null,null,null,null,null,null,306,23,104,"Dinamo Zagreb","-","TM 104",1,":",0]
[null,null,null,null,null,null,307,175,22,"TM 175","-","Celtic Glasgow",0,":",3]
[null,null,null,null,null,null,308,21,76,"PSV Eindhoven","-","TM 76",5,":",1]
[null,null,null,null,null,null,309,12,20,"Atalanta Bergamo","-","Sporting Lissabon",0,":",4]
[null,null,null,null,null,null,310,167,124,"TM 167","-","TM 124",5,":",2]
[null,null,null,null,null,null,311,119,165,"TM 119","-","TM 165",1,":",3]
[null,null,null,null,null,null,312,164,80,"TM 164","-","TM 80",3,":",1]
[null,null,null,null,null,null,313,146,163,"TM 146","-","TM 163",0,":",2]
[null,null,null,null,null,null,314,159,139,"TM 159","-","TM 139",0,":",0]
[null,null,null,null,null,null,315,72,161,"TM 72","-","TM 161",0,":",3]
[null,null,null,null,null,null,316,15,73,"FC Arsenal","-","TM 73",0,":",0]
[null,null,null,null,null,null,317,63,7,"TM 63","-","Borussia Dortmund",0,":",1]
[null,null,null,null,null,null,318,10,153,"Bayer Leverkusen","-","TM 153",3,":",0]
[null,null,null,null,null,null,319,189,158,"TM 189","-","TM 158",1,":",5]
[null,null,null,null,null,null,320,6,102,"Inter Mailand","-","TM 102",4,":",0]
[null,null,null,null,null,null,321,83,5,"TM 83","-","FC Liverpool",2,":",5]
[null,null,null,null,null,null,322,45,16,{"$f":"IFERROR(VLOOKUP($H327,$B$6:$C$205,2,0),\"\")","v":"TM 45"},"-",{"$f":"IFERROR(VLOOKUP($I327,$B$6:$C$205,2,0),\"\")","v":"FC Brügge"},1,":",3]
[null,null,null,null,null,null,323,75,2,"TM 75","-","Manchester City",3,":",0]
[null,null,null,null,null,null,324,145,67,"TM 145","-","TM 67",2,":",9]
[null,null,null,null,null,null,325,172,199,"TM 172","-","TM 199",1,":",3]
[null,null,null,null,null,null,326,143,48,"TM 143","-","TM 48",3,":",1]
[null,null,null,null,null,null,327,136,134,"TM 136","-","TM 134",0,":",2]
[null,null,null,null,null,null,328,125,60,"TM 125","-","TM 60",0,":",0]
[null,null,null,null,null,null,329,115,121,"TM 115","-","TM 121",0,":",3]
[null,null,null,null,null,null,330,99,100,"TM 99","-","TM 100",0,":",0]
[null,null,null,null,null,null,331,185,98,"TM 185","-","TM 98",0,":",1]
[null,null,null,null,null,null,332,149,155,"TM 149","-","TM 155",3,":",0]
[null,null,null,null,null,null,333,154,198,"TM 154","-","TM 198",1,":",5]
[null,null,null,null,null,null,334,196,68,"TM 196","-","TM 68",4,":",0]
[null,null,null,null,null,null,335,93,194,"TM 93","-","TM 194",2,":",5]
[null,null,null,null,null,null,336,29,51,"Aston Villa","-","TM 51",3,":",1]
[null,null,null,null,null,null,337,52,193,"TM 52","-","TM 193",0,":",3]
[null,null,null,null,null,null,338,97,59,"TM 97","-","TM 59",9,":",2]
[null,null,null,null,null,null,339,94,142,"TM 94","-","TM 142",3,":",1]
[null,null,null,null,null,null,340,116,160,"TM 116","-","TM 160",1,":",3]
[null,null,null,null,null,null,341,38,24,"FC Basel","-","Red Bull Salzburg",2,":",0]
[null,null,null,null,null,null,342,166,17,"TM 166","-","Schachtjor Donezk",0,":",0]
[null,null,null,null,null,null,343,137,37,"TM 137","-","AC Roma",3,":",0]
[null,null,null,null,null,null,344,70,150,"TM 70","-","TM 150",0,":",0]
[null,null,null,null,null,null,345,170,192,"TM 170","-","TM 192",1,":",0]
[null,null,null,null,null,null,346,123,168,"TM 123","-","TM 168",0,":",3]
[null,null,null,null,null,null,347,86,114,"TM 86","-","TM 114",5,":",1]
[null,null,null,null,null,null,348,187,133,"TM 187","-","TM 133",0,":",4]
[null,null,null,null,null,null,349,173,186,"TM 173","-","TM 186",5,":",2]
[null,null,null,null,null,null,350,162,157,"TM 162","-","TM 157",3,":",1]
[null,null,null,null,null,null,351,182,113,"TM 182","-","TM 113",0,":",3]
[null,null,null,null,null,null,352,107,108,"TM 107","-","TM 108",9,":",2]
[null,null,null,null,null,null,353,110,190,"TM 110","-","TM 190",2,":",1]
[null,null,null,null,null,null,354,43,200,"TM 43","-","TM 200",1,":",3]
[null,null,null,null,null,null,355,135,111,"TM 135","-","TM 111",2,":",0]
[null,null,null,null,null,null,356,91,53,"TM 91","-","TM 53",0,":",0]
[null,null,null,null,null,null,357,118,151,"TM 118","-","TM 151",3,":",0]
[null,null,null,null,null,null,358,19,105,"Feyenoord Rotterdam","-","TM 105",0,":",0]
[null,null,null,null,null,null,359,85,57,"TM 85","-","TM 57",1,":",0]
[null,null,null,null,null,null,360,79,61,"TM 79","-","TM 61",0,":",3]
[null,null,null,null,null,null,361,179,49,"TM 179","-","TM 49",5,":",1]
[null,null,null,null,null,null,362,69,138,"TM 69","-","TM 138",0,":",4]
[null,null,null,null,null,null,363,3,34,"FC Bayern München","-","Stade Brest",5,":",2]
[null,null,null,null,null,null,364,184,127,"TM 184","-","TM 127",3,":",1]
[null,null,null,null,null,null,365,152,27,"TM 152","-","Young Boys Bern",0,":",3]
[null,null,null,null,null,null,366,87,126,"TM 87","-","TM 126",9,":",2]
[null,null,null,null,null,null,367,144,84,"TM 144","-","TM 84",3,":",1]
[null,null,null,null,null,null,368,82,9,"TM 82","-","FC Barcelona",1,":",3]
[null,null,null,null,null,null,369,50,96,"TM 50","-","TM 96",2,":",0]
[null,null,null,null,null,null,370,41,54,"TM 41","-","TM 54",0,":",0]
[null,null,null,null,null,null,371,147,32,"TM 147","-","VfB Stuttgart",3,":",0]
[null,null,null,null,null,null,372,78,92,"TM 78","-","TM 92",0,":",0]
[null,null,null,null,null,null,373,169,81,"TM 169","-","TM 81",1,":",0]
[null,null,null,null,null,null,374,89,44,"TM 89","-","TM 44",0,":",3]
[null,null,null,null,null,null,375,195,181,"TM 195","-","TM 181",5,":",1]
[null,null,null,null,null,null,376,103,148,"TM 103","-","TM 148",0,":",4]
[null,null,null,null,null,null,377,62,40,"TM 62","-","Hertha BSC",5,":",2]
[null,null,null,null,null,null,378,180,42,"TM 180","-","TM 42",1,":",3]
[null,null,null,null,null,null,379,11,4,"Atletico Madrid","-","Paris Saint-Germain",3,":",1]
[null,null,null,null,null,null,380,66,112,"TM 66","-","TM 112",0,":",2]
[null,null,null,null,null,null,381,177,122,"TM 177","-","TM 122",0,":",0]
[null,null,null,null,null,null,382,74,130,"TM 74","-","TM 130",0,":",3]
[null,null,null,null,null,null,383,117,14,"TM 117","-","Benfica Lissabon",0,":",0]
[null,null,null,null,null,null,384,65,140,"TM 65","-","TM 140",0,":",1]
[null,null,null,null,null,null,385,120,71,"TM 120","-","TM 71",3,":",0]
[null,null,null,null,null,null,386,101,88,{"$f":"IFERROR(VLOOKUP($H391,$B$6:$C$205,2,0),\"\")","v":"TM 101"},"-",{"$f":"IFERROR(VLOOKUP($I391,$B$6:$C$205,2,0),\"\")","v":"TM 88"},1,":",5]
[null,null,null,null,null,null,387,132,106,"TM 132","-","TM 106",4,":",0]
[null,null,null,null,null,null,388,128,77,"TM 128","-","TM 77",2,":",5]
[null,null,null,null,null,null,389,197,191,"TM 197","-","TM 191",1,":",3]
[null,null,null,null,null,null,390,56,13,"TM 56","-","Juventus Turin",3,":",0]
[null,null,null,null,null,null,391,129,95,"TM 129","-","TM 95",2,":",9]
[null,null,null,null,null,null,392,178,25,"TM 178","-","OSC Lille",1,":",3]
[null,null,null,null,null,null,393,188,156,"TM 188","-","TM 156",3,":",1]
[null,null,null,null,null,null,394,1,183,"Real Madrid","-","TM 183",0,":",2]
[null,null,null,null,null,null,395,36,39,"Mainz 05","-","FC Lille",0,":",0]
[null,null,null,null,null,null,396,64,109,"TM 64","-","TM 109",0,":",3]
[null,null,null,null,null,null,397,174,55,"TM 174","-","TM 55",0,":",0]
[null,null,null,null,null,null,398,141,171,"TM 141","-","TM 171",0,":",1]
[null,null,null,null,null,null,399,90,18,"TM 90","-","AC Mailand",3,":",0]
[null,null,null,null,null,null,400,8,131,"RB Leipzig","-","TM 131",1,":",5]
[null,null,null,null,null,null,401,176,30,"TM 176","-","FC Bologna",4,":",0]
[null,null,null,null,null,null,402,46,31,"TM 46","-","FC Girona",2,":",5]
[null,null,null,null,null,null,403,33,28,"Sturm Graz","-","AS Monaco",3,":",1]
[null,null,null,null,null,null,404,26,35,"Roter Stern Belgrad","-","Eintracht Frankfurt",0,":",3]
[null,null,null,null,null,null,405,47,23,"TM 47","-","Dinamo Zagreb",9,":",2]
[null,null,null,null,null,null,406,22,58,"Celtic Glasgow","-","TM 58",3,":",1]
[null,null,null,null,null,null,407,104,21,"TM 104","-","PSV Eindhoven",1,":",3]
[null,null,null,null,null,null,408,20,175,"Sporting Lissabon","-","TM 175",2,":",0]
[null,null,null,null,null,null,409,76,167,"TM 76","-","TM 167",0,":",0]
[null,null,null,null,null,null,410,165,12,"TM 165","-","Atalanta Bergamo",3,":",0]
[null,null,null,null,null,null,411,124,164,"TM 124","-","TM 164",0,":",0]
[null,null,null,null,null,null,412,163,119,"TM 163","-","TM 119",1,":",0]
[null,null,null,null,null,null,413,80,159,"TM 80","-","TM 159",0,":",3]
[null,null,null,null,null,null,414,161,146,"TM 161","-","TM 146",5,":",1]
[null,null,null,null,null,null,415,139,15,"TM 139","-","FC Arsenal",0,":",4]
[null,null,null,null,null,null,416,7,72,"Borussia Dortmund","-","TM 72",5,":",2]
[null,null,null,null,null,null,417,73,10,"TM 73","-","Bayer Leverkusen",3,":",1]
[null,null,null,null,null,null,418,158,63,"TM 158","-","TM 63",0,":",3]
[null,null,null,null,null,null,419,153,6,"TM 153","-","Inter Mailand",9,":",2]
[null,null,null,null,null,null,420,5,189,"FC Liverpool","-","TM 189",2,":",1]
[null,null,null,null,null,null,421,102,45,"TM 102","-","TM 45",1,":",3]
[null,null,null,null,null,null,422,2,83,"Manchester City","-","TM 83",2,":",0]
[null,null,null,null,null,null,423,16,145,"FC Brügge","-","TM 145",0,":",0]
[null,null,null,null,null,null,424,199,75,"TM 199","-","TM 75",3,":",0]
[null,null,null,null,null,null,425,67,143,"TM 67","-","TM 143",0,":",0]
[null,null,null,null,null,null,426,134,172,"TM 134","-","TM 172",1,":",0]
[null,null,null,null,null,null,427,48,125,"TM 48","-","TM 125",0,":",3]
[null,null,null,null,null,null,428,121,136,"TM 121","-","TM 136",5,":",1]
[null,null,null,null,null,null,429,60,99,"TM 60","-","TM 99",0,":",4]
[null,null,null,null,null,null,430,98,115,"TM 98","-","TM 115",5,":",2]
[null,null,null,null,null,null,431,100,149,"TM 100","-","TM 149",3,":",1]
[null,null,null,null,null,null,432,198,185,"TM 198","-","TM 185",0,":",3]
[null,null,null,null,null,null,433,155,196,"TM 155","-","TM 196",9,":",2]
[null,null,null,null,null,null,434,194,154,"TM 194","-","TM 154",3,":",1]
[null,null,null,null,null,null,435,68,29,"TM 68","-","Aston Villa",1,":",3]
[null,null,null,null,null,null,436,193,93,"TM 193","-","TM 93",2,":",0]
[null,null,null,null,null,null,437,51,97,"TM 51","-","TM 97",0,":",0]
[null,null,null,null,null,null,438,142,52,"TM 142","-","TM 52",3,":",0]
[null,null,null,null,null,null,439,59,116,"TM 59","-","TM 116",0,":",0]
[null,null,null,null,null,null,440,24,94,"Red Bull Salzburg","-","TM 94",1,":",0]
[null,null,null,null,null,null,441,160,166,"TM 160","-","TM 166",0,":",3]
[null,null,null,null,null,null,442,37,38,"AC Roma","-","FC Basel",5,":",1]
[null,null,null,null,null,null,443,17,70,"Schachtjor Donezk","-","TM 70",0,":",4]
[null,null,null,null,null,null,444,192,137,"TM 192","-","TM 137",5,":",2]
[null,null,null,null,null,null,445,150,123,"TM 150","-","TM 123",1,":",3]
[null,null,null,null,null,null,446,114,170,"TM 114","-","TM 170",3,":",1]
[null,null,null,null,null,null,447,168,187,"TM 168","-","TM 187",0,":",2]
[null,null,null,null,null,null,448,186,86,"TM 186","-","TM 86",0,":",0]
[null,null,null,null,null,null,449,133,162,"TM 133","-","TM 162",0,":",3]
[null,null,null,null,null,null,450,113,173,{"$f":"IFERROR(VLOOKUP($H455,$B$6:$C$205,2,0),\"\")","v":"TM 113"},"-",{"$f":"IFERROR(VLOOKUP($I455,$B$6:$C$205,2,0),\"\")","v":"TM 173"},0,":",0]
[null,null,null,null,null,null,451,157,107,"TM 157","-","TM 107",0,":",1]
[null,null,null,null,null,null,452,190,182,"TM 190","-","TM 182",3,":",0]
[null,null,null,null,null,null,453,108,43,"TM 108","-","TM 43",1,":",5]
[null,null,null,null,null,null,454,111,110,"TM 111","-","TM 110",4,":",0]
[null,null,null,null,null,null,455,200,91,"TM 200","-","TM 91",2,":",5]
[null,null,null,null,null,null,456,151,135,"TM 151","-","TM 135",1,":",3]
[null,null,null,null,null,null,457,53,19,"TM 53","-","Feyenoord Rotterdam",3,":",0]
[null,null,null,null,null,null,458,57,118,"TM 57","-","TM 118",2,":",9]
[null,null,null,null,null,null,459,105,79,"TM 105","-","TM 79",1,":",3]
[null,null,null,null,null,null,460,49,85,"TM 49","-","TM 85",3,":",1]
[null,null,null,null,null,null,461,61,69,"TM 61","-","TM 69",0,":",2]
[null,null,null,null,null,null,462,34,179,"Stade Brest","-","TM 179",0,":",0]
[null,null,null,null,null,null,463,138,184,"TM 138","-","TM 184",0,":",3]
[null,null,null,null,null,null,464,27,3,"Young Boys Bern","-","FC Bayern München",0,":",0]
[null,null,null,null,null,null,465,127,87,"TM 127","-","TM 87",0,":",1]
[null,null,null,null,null,null,466,84,152,"TM 84","-","TM 152",3,":",0]
[null,null,null,null,null,null,467,126,82,"TM 126","-","TM 82",1,":",5]
[null,null,null,null,null,null,468,96,144,"TM 96","-","TM 144",4,":",0]
[null,null,null,null,null,null,469,9,41,"FC Barcelona","-","TM 41",2,":",5]
[null,null,null,null,null,null,470,32,50,"VfB Stuttgart","-","TM 50",3,":",1]
[null,null,null,null,null,null,471,54,78,"TM 54","-","TM 78",0,":",3]
[null,null,null,null,null,null,472,81,147,"TM 81","-","TM 147",9,":",2]
[null,null,null,null,null,null,473,92,89,"TM 92","-","TM 89",3,":",1]
[null,null,null,null,null,null,474,181,169,"TM 181","-","TM 169",1,":",3]
[null,null,null,null,null,null,475,44,103,"TM 44","-","TM 103",2,":",0]
[null,null,null,null,null,null,476,40,195,"Hertha BSC","-","TM 195",0,":",0]
[null,null,null,null,null,null,477,148,180,"TM 148","-","TM 180",3,":",0]
[null,null,null,null,null,null,478,4,62,"Paris Saint-Germain","-","TM 62",0,":",0]
[null,null,null,null,null,null,479,42,66,"TM 42","-","TM 66",1,":",0]
[null,null,null,null,null,null,480,122,11,"TM 122","-","Atletico Madrid",0,":",3]
[null,null,null,null,null,null,481,112,74,"TM 112","-","TM 74",5,":",1]
[null,null,null,null,null,null,482,14,177,"Benfica Lissabon","-","TM 177",0,":",4]
[null,null,null,null,null,null,483,130,65,"TM 130","-","TM 65",5,":",2]
[null,null,null,null,null,null,484,71,117,"TM 71","-","TM 117",3,":",1]
[null,null,null,null,null,null,485,140,101,"TM 140","-","TM 101",0,":",3]
[null,null,null,null,null,null,486,106,120,"TM 106","-","TM 120",9,":",2]
[null,null,null,null,null,null,487,88,128,"TM 88","-","TM 128",2,":",1]
[null,null,null,null,null,null,488,191,132,"TM 191","-","TM 132",1,":",3]
[null,null,null,null,null,null,489,77,56,"TM 77","-","TM 56",2,":",0]
[null,null,null,null,null,null,490,95,197,"TM 95","-","TM 197",0,":",0]
[null,null,null,null,null,null,491,13,178,"Juventus Turin","-","TM 178",3,":",0]
[null,null,null,null,null,null,492,156,129,"TM 156","-","TM 129",0,":",0]
[null,null,null,null,null,null,493,25,1,"OSC Lille","-","Real Madrid",1,":",0]
[null,null,null,null,null,null,494,39,188,"FC Lille","-","TM 188",0,":",3]
[null,null,null,null,null,null,495,183,64,"TM 183","-","TM 64",5,":",1]
[null,null,null,null,null,null,496,55,36,"TM 55","-","Mainz 05",0,":",4]
[null,null,null,null,null,null,497,109,141,"TM 109","-","TM 141",5,":",2]
[null,null,null,null,null,null,498,18,174,"AC Mailand","-","TM 174",3,":",1]
[null,null,null,null,null,null,499,171,8,"TM 171","-","RB Leipzig",0,":",3]
[null,null,null,null,null,null,500,131,90,"TM 131","-","TM 90",9,":",2]
[null,null,null,null,null,null,501,46,176,"TM 46","-","TM 176",3,":",1]
[null,null,null,null,null,null,502,28,30,"AS Monaco","-","FC Bologna",1,":",3]
[null,null,null,null,null,null,503,31,26,"FC Girona","-","Roter Stern Belgrad",2,":",0]
[null,null,null,null,null,null,504,23,33,"Dinamo Zagreb","-","Sturm Graz",0,":",0]
[null,null,null,null,null,null,505,35,22,"Eintracht Frankfurt","-","Celtic Glasgow",3,":",0]
[null,null,null,null,null,null,506,21,47,"PSV Eindhoven","-","TM 47",0,":",0]
[null,null,null,null,null,null,507,58,20,"TM 58","-","Sporting Lissabon",1,":",0]
[null,null,null,null,null,null,508,167,104,"TM 167","-","TM 104",0,":",3]
[null,null,null,null,null,null,509,175,165,"TM 175","-","TM 165",5,":",1]
[null,null,null,null,null,null,510,164,76,"TM 164","-","TM 76",0,":",4]
[null,null,null,null,null,null,511,12,163,"Atalanta Bergamo","-","TM 163",5,":",2]
[null,null,null,null,null,null,512,159,124,"TM 159","-","TM 124",1,":",3]
[null,null,null,null,null,null,513,119,161,"TM 119","-","TM 161",3,":",1]
[null,null,null,null,null,null,514,15,80,{"$f":"IFERROR(VLOOKUP($H519,$B$6:$C$205,2,0),\"\")","v":"FC Arsenal"},"-",{"$f":"IFERROR(VLOOKUP($I519,$B$6:$C$205,2,0),\"\")","v":"TM 80"},0,":",2]
[null,null,null,null,null,null,515,146,7,"TM 146","-","Borussia Dortmund",0,":",0]
[null,null,null,null,null,null,516,10,139,"Bayer Leverkusen","-","TM 139",0,":",3]
[null,null,null,null,null,null,517,72,158,"TM 72","-","TM 158",0,":",0]
[null,null,null,null,null,null,518,6,73,"Inter Mailand","-","TM 73",0,":",1]
[null,null,null,null,null,null,519,63,5,"TM 63","-","FC Liverpool",3,":",0]
[null,null,null,null,null,null,520,45,153,"TM 45","-","TM 153",1,":",5]
[null,null,null,null,null,null,521,189,2,"TM 189","-","Manchester City",4,":",0]
[null,null,null,null,null,null,522,145,102,"TM 145","-","TM 102",2,":",5]
[null,null,null,null,null,null,523,83,199,"TM 83","-","TM 199",1,":",3]
[null,null,null,null,null,null,524,143,16,"TM 143","-","FC Brügge",3,":",0]
[null,null,null,null,null,null,525,75,134,"TM 75","-","TM 134",2,":",9]
[null,null,null,null,null,null,526,125,67,"TM 125","-","TM 67",1,":",3]
[null,null,null,null,null,null,527,172,121,"TM 172","-","TM 121",3,":",1]
[null,null,null,null,null,null,528,99,48,"TM 99","-","TM 48",0,":",2]
[null,null,null,null,null,null,529,136,98,"TM 136","-","TM 98",0,":",0]
[null,null,null,null,null,null,530,149,60,"TM 149","-","TM 60",0,":",3]
[null,null,null,null,null,null,531,115,198,"TM 115","-","TM 198",0,":",0]
[null,null,null,null,null,null,532,196,100,"TM 196","-","TM 100",0,":",1]
[null,null,null,null,null,null,533,185,194,"TM 185","-","TM 194",3,":",0]
[null,null,null,null,null,null,534,29,155,"Aston Villa","-","TM 155",1,":",5]
[null,null,null,null,null,null,535,154,193,"TM 154","-","TM 193",4,":",0]
[null,null,null,null,null,null,536,97,68,"TM 97","-","TM 68",2,":",5]
[null,null,null,null,null,null,537,93,142,"TM 93","-","TM 142",3,":",1]
[null,null,null,null,null,null,538,116,51,"TM 116","-","TM 51",0,":",3]
[null,null,null,null,null,null,539,52,24,"TM 52","-","Red Bull Salzburg",9,":",2]
[null,null,null,null,null,null,540,166,59,"TM 166","-","TM 59",3,":",1]
[null,null,null,null,null,null,541,94,37,"TM 94","-","AC Roma",1,":",3]
[null,null,null,null,null,null,542,70,160,"TM 70","-","TM 160",2,":",0]
[null,null,null,null,null,null,543,38,192,"FC Basel","-","TM 192",0,":",0]
[null,null,null,null,null,null,544,123,17,"TM 123","-","Schachtjor Donezk",3,":",0]
[null,null,null,null,null,null,545,137,114,"TM 137","-","TM 114",0,":",0]
[null,null,null,null,null,null,546,187,150,"TM 187","-","TM 150",1,":",0]
[null,null,null,null,null,null,547,170,186,"TM 170","-","TM 186",0,":",3]
[null,null,null,null,null,null,548,162,168,"TM 162","-","TM 168",5,":",1]
[null,null,null,null,null,null,549,86,113,"TM 86","-","TM 113",0,":",4]
[null,null,null,null,null,null,550,107,133,"TM 107","-","TM 133",5,":",2]
[null,null,null,null,null,null,551,173,190,"TM 173","-","TM 190",3,":",1]
[null,null,null,null,null,null,552,43,157,"TM 43","-","TM 157",0,":",3]
[null,null,null,null,null,null,553,182,111,"TM 182","-","TM 111",9,":",2]
[null,null,null,null,null,null,554,91,108,"TM 91","-","TM 108",2,":",1]
[null,null,null,null,null,null,555,110,151,"TM 110","-","TM 151",1,":",3]
[null,null,null,null,null,null,556,19,200,"Feyenoord Rotterdam","-","TM 200",2,":",0]
[null,null,null,null,null,null,557,135,57,"TM 135","-","TM 57",0,":",0]
[null,null,null,null,null,null,558,79,53,"TM 79","-","TM 53",3,":",0]
[null,null,null,null,null,null,559,118,49,"TM 118","-","TM 49",0,":",0]
[null,null,null,null,null,null,560,69,105,"TM 69","-","TM 105",1,":",0]
[null,null,null,null,null,null,561,85,34,"TM 85","-","Stade Brest",0,":",3]
[null,null,null,null,null,null,562,184,61,"TM 184","-","TM 61",5,":",1]
[null,null,null,null,null,null,563,179,27,"TM 179","-","Young Boys Bern",0,":",4]
[null,null,null,null,null,null,564,87,138,"TM 87","-","TM 138",5,":",2]
[null,null,null,null,null,null,565,3,84,"FC Bayern München","-","TM 84",3,":",1]
[null,null,null,null,null,null,566,82,127,"TM 82","-","TM 127",0,":",3]
[null,null,null,null,null,null,567,152,96,"TM 152","-","TM 96",9,":",2]
[null,null,null,null,null,null,568,41,126,"TM 41","-","TM 126",3,":",1]
[null,null,null,null,null,null,569,144,32,"TM 144","-","VfB Stuttgart",1,":",3]
[null,null,null,null,null,null,570,78,9,"TM 78","-","FC Barcelona",2,":",0]
[null,null,null,null,null,null,571,50,81,"TM 50","-","TM 81",0,":",0]
[null,null,null,null,null,null,572,89,54,"TM 89","-","TM 54",3,":",0]
[null,null,null,null,null,null,573,147,181,"TM 147","-","TM 181",0,":",0]
[null,null,null,null,null,null,574,103,92,"TM 103","-","TM 92",1,":",0]
[null,null,null,null,null,null,575,169,40,"TM 169","-","Hertha BSC",0,":",3]
[null,null,null,null,null,null,576,180,44,"TM 180","-","TM 44",5,":",1]
[null,null,null,null,null,null,577,195,4,"TM 195","-","Paris Saint-Germain",0,":",4]
[null,null,null,null,null,null,578,66,148,{"$f":"IFERROR(VLOOKUP($H583,$B$6:$C$205,2,0),\"\")","v":"TM 66"},"-",{"$f":"IFERROR(VLOOKUP($I583,$B$6:$C$205,2,0),\"\")","v":"TM 148"},5,":",2]
[null,null,null,null,null,null,579,62,122,"TM 62","-","TM 122",1,":",3]
[null,null,null,null,null,null,580,74,42,"TM 74","-","TM 42",3,":",1]
[null,null,null,null,null,null,581,11,14,"Atletico Madrid","-","Benfica Lissabon",0,":",2]
[null,null,null,null,null,null,582,65,112,"TM 65","-","TM 112",0,":",0]
[null,null,null,null,null,null,583,177,71,"TM 177","-","TM 71",0,":",3]
[null,null,null,null,null,null,584,101,130,"TM 101","-","TM 130",0,":",0]
[null,null,null,null,null,null,585,117,106,"TM 117","-","TM 106",0,":",1]
[null,null,null,null,null,null,586,128,140,"TM 128","-","TM 140",3,":",0]
[null,null,null,null,null,null,587,120,191,"TM 120","-","TM 191",1,":",5]
[null,null,null,null,null,null,588,56,88,"TM 56","-","TM 88",4,":",0]
[null,null,null,null,null,null,589,132,95,"TM 132","-","TM 95",2,":",5]
[null,null,null,null,null,null,590,178,77,"TM 178","-","TM 77",1,":",3]
[null,null,null,null,null,null,591,197,156,"TM 197","-","TM 156",3,":",0]
[null,null,null,null,null,null,592,1,13,"Real Madrid","-","Juventus Turin",2,":",9]
[null,null,null,null,null,null,593,129,39,"TM 129","-","FC Lille",1,":",3]
[null,null,null,null,null,null,594,64,25,"TM 64","-","OSC Lille",3,":",1]
[null,null,null,null,null,null,595,188,55,"TM 188","-","TM 55",0,":",2]
[null,null,null,null,null,null,596,141,183,"TM 141","-","TM 183",0,":",0]
[null,null,null,null,null,null,597,36,18,"Mainz 05","-","AC Mailand",0,":",3]
[null,null,null,null,null,null,598,8,109,"RB Leipzig","-","TM 109",0,":",0]
[null,null,null,null,null,null,599,174,131,"TM 174","-","TM 131",0,":",1]
[null,null,null,null,null,null,600,90,171,"TM 90","-","TM 171",3,":",0]
[null,null,null,null,null,null,601,176,28,"TM 176","-","AS Monaco",1,":",5]
[null,null,null,null,null,null,602,26,46,"Roter Stern Belgrad","-","TM 46",4,":",0]
[null,null,null,null,null,null,603,30,23,"FC Bologna","-","Dinamo Zagreb",2,":",5]
[null,null,null,null,null,null,604,22,31,"Celtic Glasgow","-","FC Girona",3,":",1]
[null,null,null,null,null,null,605,33,21,"Sturm Graz","-","PSV Eindhoven",0,":",3]
[null,null,null,null,null,null,606,20,35,"Sporting Lissabon","-","Eintracht Frankfurt",9,":",2]
[null,null,null,null,null,null,607,47,167,"TM 47","-","TM 167",3,":",1]
[null,null,null,null,null,null,608,165,58,"TM 165","-","TM 58",1,":",3]
[null,null,null,null,null,null,609,104,164,"TM 104","-","TM 164",2,":",0]
[null,null,null,null,null,null,610,163,175,"TM 163","-","TM 175",0,":",0]
[null,null,null,null,null,null,611,76,159,"TM 76","-","TM 159",3,":",0]
[null,null,null,null,null,null,612,161,12,"TM 161","-","Atalanta Bergamo",0,":",0]
[null,null,null,null,null,null,613,124,15,"TM 124","-","FC Arsenal",1,":",0]
[null,null,null,null,null,null,614,7,119,"Borussia Dortmund","-","TM 119",0,":",3]
[null,null,null,null,null,null,615,80,10,"TM 80","-","Bayer Leverkusen",5,":",1]
[null,null,null,null,null,null,616,158,146,"TM 158","-","TM 146",0,":",4]
[null,null,null,null,null,null,617,139,6,"TM 139","-","Inter Mailand",5,":",2]
[null,null,null,null,null,null,618,5,72,"FC Liverpool","-","TM 72",3,":",1]
[null,null,null,null,null,null,619,73,45,"TM 73","-","TM 45",0,":",3]
[null,null,null,null,null,null,620,2,63,"Manchester City","-","TM 63",9,":",2]
[null,null,null,null,null,null,621,153,145,"TM 153","-","TM 145",2,":",1]
[null,null,null,null,null,null,622,199,189,"TM 199","-","TM 189",1,":",3]
[null,null,null,null,null,null,623,102,143,"TM 102","-","TM 143",2,":",0]
[null,null,null,null,null,null,624,134,83,"TM 134","-","TM 83",0,":",0]
[null,null,null,null,null,null,625,16,125,"FC Brügge","-","TM 125",3,":",0]
[null,null,null,null,null,null,626,121,75,"TM 121","-","TM 75",0,":",0]
[null,null,null,null,null,null,627,67,99,"TM 67","-","TM 99",1,":",0]
[null,null,null,null,null,null,628,98,172,"TM 98","-","TM 172",0,":",3]
[null,null,null,null,null,null,629,48,149,"TM 48","-","TM 149",5,":",1]
[null,null,null,null,null,null,630,198,136,"TM 198","-","TM 136",0,":",4]
[null,null,null,null,null,null,631,60,196,"TM 60","-","TM 196",5,":",2]
[null,null,null,null,null,null,632,194,115,"TM 194","-","TM 115",3,":",1]
[null,null,null,null,null,null,633,100,29,"TM 100","-","Aston Villa",0,":",3]
[null,null,null,null,null,null,634,193,185,"TM 193","-","TM 185",9,":",2]
[null,null,null,null,null,null,635,155,97,"TM 155","-","TM 97",3,":",1]
[null,null,null,null,null,null,636,142,154,"TM 142","-","TM 154",1,":",3]
[null,null,null,null,null,null,637,68,116,"TM 68","-","TM 116",2,":",0]
[null,null,null,null,null,null,638,24,93,"Red Bull Salzburg","-","TM 93",0,":",0]
[null,null,null,null,null,null,639,51,166,"TM 51","-","TM 166",3,":",0]
[null,null,null,null,null,null,640,37,52,"AC Roma","-","TM 52",0,":",0]
[null,null,null,null,null,null,641,59,70,"TM 59","-","TM 70",1,":",0]
[null,null,null,null,null,null,642,192,94,{"$f":"IFERROR(VLOOKUP($H647,$B$6:$C$205,2,0),\"\")","v":"TM 192"},"-",{"$f":"IFERROR(VLOOKUP($I647,$B$6:$C$205,2,0),\"\")","v":"TM 94"},0,":",3]
[null,null,null,null,null,null,643,160,123,"TM 160","-","TM 123",5,":",1]
[null,null,null,null,null,null,644,114,38,"TM 114","-","FC Basel",0,":",4]
[null,null,null,null,null,null,645,17,187,"Schachtjor Donezk","-","TM 187",5,":",2]
[null,null,null,null,null,null,646,186,137,"TM 186","-","TM 137",1,":",3]
[null,null,null,null,null,null,647,150,162,"TM 150","-","TM 162",3,":",1]
[null,null,null,null,null,null,648,113,170,"TM 113","-","TM 170",0,":",2]
[null,null,null,null,null,null,649,168,107,"TM 168","-","TM 107",0,":",0]
[null,null,null,null,null,null,650,190,86,"TM 190","-","TM 86",0,":",3]
[null,null,null,null,null,null,651,133,43,"TM 133","-","TM 43",0,":",0]
[null,null,null,null,null,null,652,111,173,"TM 111","-","TM 173",0,":",1]
[null,null,null,null,null,null,653,157,91,"TM 157","-","TM 91",3,":",0]
[null,null,null,null,null,null,654,151,182,"TM 151","-","TM 182",1,":",5]
[null,null,null,null,null,null,655,108,19,"TM 108","-","Feyenoord Rotterdam",4,":",0]
[null,null,null,null,null,null,656,57,110,"TM 57","-","TM 110",2,":",5]
[null,null,null,null,null,null,657,200,79,"TM 200","-","TM 79",1,":",3]
[null,null,null,null,null,null,658,49,135,"TM 49","-","TM 135",3,":",0]
[null,null,null,null,null,null,659,53,69,"TM 53","-","TM 69",2,":",9]
[null,null,null,null,null,null,660,34,118,"Stade Brest","-","TM 118",1,":",3]
[null,null,null,null,null,null,661,105,184,"TM 105","-","TM 184",3,":",1]
[null,null,null,null,null,null,662,27,85,"Young Boys Bern","-","TM 85",0,":",2]
[null,null,null,null,null,null,663,61,87,"TM 61","-","TM 87",0,":",0]
[null,null,null,null,null,null,664,84,179,"TM 84","-","TM 179",0,":",3]
[null,null,null,null,null,null,665,138,82,"TM 138","-","TM 82",0,":",0]
[null,null,null,null,null,null,666,96,3,"TM 96","-","FC Bayern München",0,":",1]
[null,null,null,null,null,null,667,127,41,"TM 127","-","TM 41",3,":",0]
[null,null,null,null,null,null,668,32,152,"VfB Stuttgart","-","TM 152",1,":",5]
[null,null,null,null,null,null,669,126,78,"TM 126","-","TM 78",4,":",0]
[null,null,null,null,null,null,670,81,144,"TM 81","-","TM 144",2,":",5]
[null,null,null,null,null,null,671,9,89,"FC Barcelona","-","TM 89",3,":",1]
[null,null,null,null,null,null,672,181,50,"TM 181","-","TM 50",0,":",3]
[null,null,null,null,null,null,673,54,103,"TM 54","-","TM 103",9,":",2]
[null,null,null,null,null,null,674,40,147,"Hertha BSC","-","TM 147",3,":",1]
[null,null,null,null,null,null,675,92,180,"TM 92","-","TM 180",1,":",3]
[null,null,null,null,null,null,676,4,169,"Paris Saint-Germain","-","TM 169",2,":",0]
[null,null,null,null,null,null,677,44,66,"TM 44","-","TM 66",0,":",0]
[null,null,null,null,null,null,678,122,195,"TM 122","-","TM 195",3,":",0]
[null,null,null,null,null,null,679,148,74,"TM 148","-","TM 74",0,":",0]
[null,null,null,null,null,null,680,14,62,"Benfica Lissabon","-","TM 62",1,":",0]
[null,null,null,null,null,null,681,42,65,"TM 42","-","TM 65",0,":",3]
[null,null,null,null,null,null,682,71,11,"TM 71","-","Atletico Madrid",5,":",1]
[null,null,null,null,null,null,683,112,101,"TM 112","-","TM 101",0,":",4]
[null,null,null,null,null,null,684,106,177,"TM 106","-","TM 177",5,":",2]
[null,null,null,null,null,null,685,130,128,"TM 130","-","TM 128",3,":",1]
[null,null,null,null,null,null,686,191,117,"TM 191","-","TM 117",0,":",3]
[null,null,null,null,null,null,687,140,56,"TM 140","-","TM 56",9,":",2]
[null,null,null,null,null,null,688,95,120,"TM 95","-","TM 120",2,":",1]
[null,null,null,null,null,null,689,88,178,"TM 88","-","TM 178",1,":",3]
[null,null,null,null,null,null,690,156,132,"TM 156","-","TM 132",2,":",0]
[null,null,null,null,null,null,691,77,1,"TM 77","-","Real Madrid",0,":",0]
[null,null,null,null,null,null,692,39,197,"FC Lille","-","TM 197",3,":",0]
[null,null,null,null,null,null,693,13,64,"Juventus Turin","-","TM 64",0,":",0]
[null,null,null,null,null,null,694,55,129,"TM 55","-","TM 129",1,":",0]
[null,null,null,null,null,null,695,25,141,"OSC Lille","-","TM 141",0,":",3]
[null,null,null,null,null,null,696,18,188,"AC Mailand","-","TM 188",5,":",1]
[null,null,null,null,null,null,697,183,8,"TM 183","-","RB Leipzig",0,":",4]
[null,null,null,null,null,null,698,131,36,"TM 131","-","Mainz 05",5,":",2]
[null,null,null,null,null,null,699,109,90,"TM 109","-","TM 90",3,":",1]
[null,null,null,null,null,null,700,171,174,"TM 171","-","TM 174",0,":",3]
[null,null,null,null,null,null,701,26,176,"Roter Stern Belgrad","-","TM 176",9,":",2]
[null,null,null,null,null,null,702,23,28,"Dinamo Zagreb","-","AS Monaco",3,":",1]
[null,null,null,null,null,null,703,46,22,"TM 46","-","Celtic Glasgow",1,":",3]
[null,null,null,null,null,null,704,21,30,"PSV Eindhoven","-","FC Bologna",2,":",0]
[null,null,null,null,null,null,705,31,20,"FC Girona","-","Sporting Lissabon",0,":",0]
[null,null,null,null,null,null,706,167,33,{"$f":"IFERROR(VLOOKUP($H711,$B$6:$C$205,2,0),\"\")","v":"TM 167"},"-",{"$f":"IFERROR(VLOOKUP($I711,$B$6:$C$205,2,0),\"\")","v":"Sturm Graz"},3,":",0]
[null,null,null,null,null,null,707,35,165,"Eintracht Frankfurt","-","TM 165",0,":",0]
[null,null,null,null,null,null,708,164,47,"TM 164","-","TM 47",1,":",0]
[null,null,null,null,null,null,709,58,163,"TM 58","-","TM 163",0,":",3]
[null,null,null,null,null,null,710,159,104,"TM 159","-","TM 104",5,":",1]
[null,null,null,null,null,null,711,175,161,"TM 175","-","TM 161",0,":",4]
[null,null,null,null,null,null,712,15,76,"FC Arsenal","-","TM 76",5,":",2]
[null,null,null,null,null,null,713,12,7,"Atalanta Bergamo","-","Borussia Dortmund",1,":",3]
[null,null,null,null,null,null,714,10,124,"Bayer Leverkusen","-","TM 124",3,":",1]
[null,null,null,null,null,null,715,119,158,"TM 119","-","TM 158",0,":",2]
[null,null,null,null,null,null,716,6,80,"Inter Mailand","-","TM 80",0,":",0]
[null,null,null,null,null,null,717,146,5,"TM 146","-","FC Liverpool",0,":",3]
[null,null,null,null,null,null,718,45,139,"TM 45","-","TM 139",0,":",0]
[null,null,null,null,null,null,719,72,2,"TM 72","-","Manchester City",0,":",1]
[null,null,null,null,null,null,720,145,73,"TM 145","-","TM 73",3,":",0]
[null,null,null,null,null,null,721,63,199,"TM 63","-","TM 199",1,":",5]
[null,null,null,null,null,null,722,143,153,"TM 143","-","TM 153",4,":",0]
[null,null,null,null,null,null,723,189,134,"TM 189","-","TM 134",2,":",5]
[null,null,null,null,null,null,724,125,102,"TM 125","-","TM 102",1,":",3]
[null,null,null,null,null,null,725,83,121,"TM 83","-","TM 121",3,":",0]
[null,null,null,null,null,null,726,99,16,"TM 99","-","FC Brügge",2,":",9]
[null,null,null,null,null,null,727,75,98,"TM 75","-","TM 98",1,":",3]
[null,null,null,null,null,null,728,149,67,"TM 149","-","TM 67",3,":",1]
[null,null,null,null,null,null,729,172,198,"TM 172","-","TM 198",0,":",2]
[null,null,null,null,null,null,730,196,48,"TM 196","-","TM 48",0,":",0]
[null,null,null,null,null,null,731,136,194,"TM 136","-","TM 194",0,":",3]
[null,null,null,null,null,null,732,29,60,"Aston Villa","-","TM 60",0,":",0]
[null,null,null,null,null,null,733,115,193,"TM 115","-","TM 193",0,":",1]
[null,null,null,null,null,null,734,97,100,"TM 97","-","TM 100",3,":",0]
[null,null,null,null,null,null,735,185,142,"TM 185","-","TM 142",1,":",5]
[null,null,null,null,null,null,736,116,155,"TM 116","-","TM 155",4,":",0]
[null,null,null,null,null,null,737,154,24,"TM 154","-","Red Bull Salzburg",2,":",5]
[null,null,null,null,null,null,738,166,68,"TM 166","-","TM 68",3,":",1]
[null,null,null,null,null,null,739,93,37,"TM 93","-","AC Roma",0,":",3]
[null,null,null,null,null,null,740,70,51,"TM 70","-","TM 51",9,":",2]
[null,null,null,null,null,null,741,52,192,"TM 52","-","TM 192",3,":",1]
[null,null,null,null,null,null,742,123,59,"TM 123","-","TM 59",1,":",3]
[null,null,null,null,null,null,743,94,114,"TM 94","-","TM 114",2,":",0]
[null,null,null,null,null,null,744,187,160,"TM 187","-","TM 160",0,":",0]
[null,null,null,null,null,null,745,38,186,"FC Basel","-","TM 186",3,":",0]
[null,null,null,null,null,null,746,162,17,"TM 162","-","Schachtjor Donezk",0,":",0]
[null,null,null,null,null,null,747,137,113,"TM 137","-","TM 113",1,":",0]
[null,null,null,null,null,null,748,107,150,"TM 107","-","TM 150",0,":",3]
[null,null,null,null,null,null,749,170,190,"TM 170","-","TM 190",5,":",1]
[null,null,null,null,null,null,750,43,168,"TM 43","-","TM 168",0,":",4]
[null,null,null,null,null,null,751,86,111,"TM 86","-","TM 111",5,":",2]
[null,null,null,null,null,null,752,91,133,"TM 91","-","TM 133",3,":",1]
[null,null,null,null,null,null,753,173,151,"TM 173","-","TM 151",0,":",3]
[null,null,null,null,null,null,754,19,157,"Feyenoord Rotterdam","-","TM 157",9,":",2]
[null,null,null,null,null,null,755,182,57,"TM 182","-","TM 57",2,":",1]
[null,null,null,null,null,null,756,79,108,"TM 79","-","TM 108",1,":",3]
[null,null,null,null,null,null,757,110,49,"TM 110","-","TM 49",2,":",0]
[null,null,null,null,null,null,758,69,200,"TM 69","-","TM 200",0,":",0]
[null,null,null,null,null,null,759,135,34,"TM 135","-","Stade Brest",3,":",0]
[null,null,null,null,null,null,760,184,53,"TM 184","-","TM 53",0,":",0]
[null,null,null,null,null,null,761,118,27,"TM 118","-","Young Boys Bern",1,":",0]
[null,null,null,null,null,null,762,87,105,"TM 87","-","TM 105",0,":",3]
[null,null,null,null,null,null,763,85,84,"TM 85","-","TM 84",5,":",1]
[null,null,null,null,null,null,764,82,61,"TM 82","-","TM 61",0,":",4]
[null,null,null,null,null,null,765,179,96,"TM 179","-","TM 96",5,":",2]
[null,null,null,null,null,null,766,41,138,"TM 41","-","TM 138",3,":",1]
[null,null,null,null,null,null,767,3,32,"FC Bayern München","-","VfB Stuttgart",0,":",3]
[null,null,null,null,null,null,768,78,127,"TM 78","-","TM 127",9,":",2]
[null,null,null,null,null,null,769,152,81,"TM 152","-","TM 81",3,":",1]
[null,null,null,null,null,null,770,89,126,{"$f":"IFERROR(VLOOKUP($H775,$B$6:$C$205,2,0),\"\")","v":"TM 89"},"-",{"$f":"IFERROR(VLOOKUP($I775,$B$6:$C$205,2,0),\"\")","v":"TM 126"},1,":",3]
[null,null,null,null,null,null,771,144,181,"TM 144","-","TM 181",2,":",0]
[null,null,null,null,null,null,772,103,9,"TM 103","-","FC Barcelona",0,":",0]
[null,null,null,null,null,null,773,50,40,"TM 50","-","Hertha BSC",3,":",0]
[null,null,null,null,null,null,774,180,54,"TM 180","-","TM 54",0,":",0]
[null,null,null,null,null,null,775,147,4,"TM 147","-","Paris Saint-Germain",1,":",0]
[null,null,null,null,null,null,776,66,92,"TM 66","-","TM 92",0,":",3]
[null,null,null,null,null,null,777,169,122,"TM 169","-","TM 122",5,":",1]
[null,null,null,null,null,null,778,74,44,"TM 74","-","TM 44",0,":",4]
[null,null,null,null,null,null,779,195,14,"TM 195","-","Benfica Lissabon",5,":",2]
[null,null,null,null,null,null,780,65,148,"TM 65","-","TM 148",1,":",3]
[null,null,null,null,null,null,781,62,71,"TM 62","-","TM 71",3,":",1]
[null,null,null,null,null,null,782,101,42,"TM 101","-","TM 42",0,":",2]
[null,null,null,null,null,null,783,11,106,"Atletico Madrid","-","TM 106",0,":",0]
[null,null,null,null,null,null,784,128,112,"TM 128","-","TM 112",0,":",3]
[null,null,null,null,null,null,785,177,191,"TM 177","-","TM 191",0,":",0]
[null,null,null,null,null,null,786,56,130,"TM 56","-","TM 130",0,":",1]
[null,null,null,null,null,null,787,117,95,"TM 117","-","TM 95",3,":",0]
[null,null,null,null,null,null,788,178,140,"TM 178","-","TM 140",1,":",5]
[null,null,null,null,null,null,789,120,156,"TM 120","-","TM 156",4,":",0]
[null,null,null,null,null,null,790,1,88,"Real Madrid","-","TM 88",2,":",5]
[null,null,null,null,null,null,791,132,39,"TM 132","-","FC Lille",1,":",3]
[null,null,null,null,null,null,792,64,77,"TM 64","-","TM 77",3,":",0]
[null,null,null,null,null,null,793,197,55,"TM 197","-","TM 55",2,":",9]
[null,null,null,null,null,null,794,141,13,"TM 141","-","Juventus Turin",1,":",3]
[null,null,null,null,null,null,795,129,18,"TM 129","-","AC Mailand",3,":",1]
[null,null,null,null,null,null,796,8,25,"RB Leipzig","-","OSC Lille",0,":",2]
[null,null,null,null,null,null,797,188,131,"TM 188","-","TM 131",3,":",4]
[null,null,null,null,null,null,798,90,183,"TM 90","-","TM 183",0,":",3]
[null,null,null,null,null,null,799,36,171,"Mainz 05","-","TM 171",9,":",2]
[null,null,null,null,null,null,800,174,109,"TM 174","-","TM 109",3,":",1]
[null,null,null,null,null,null,801,176,23,"TM 176","-","Dinamo Zagreb",1,":",3]
[null,null,null,null,null,null,802,22,26,"Celtic Glasgow","-","Roter Stern Belgrad",2,":",0]
[null,null,null,null,null,null,803,28,21,"AS Monaco","-","PSV Eindhoven",0,":",0]
[null,null,null,null,null,null,804,20,46,"Sporting Lissabon","-","TM 46",3,":",0]
[null,null,null,null,null,null,805,30,167,"FC Bologna","-","TM 167",0,":",0]
[null,null,null,null,null,null,806,165,31,"TM 165","-","FC Girona",1,":",2]
[null,null,null,null,null,null,807,33,164,"Sturm Graz","-","TM 164",0,":",3]
[null,null,null,null,null,null,808,163,35,"TM 163","-","Eintracht Frankfurt",5,":",1]
[null,null,null,null,null,null,809,47,159,"TM 47","-","TM 159",0,":",4]
[null,null,null,null,null,null,810,161,58,"TM 161","-","TM 58",5,":",2]
[null,null,null,null,null,null,811,104,15,"TM 104","-","FC Arsenal",3,":",1]
[null,null,null,null,null,null,812,7,175,"Borussia Dortmund","-","TM 175",0,":",3]
[null,null,null,null,null,null,813,76,10,"TM 76","-","Bayer Leverkusen",9,":",2]
[null,null,null,null,null,null,814,158,12,"TM 158","-","Atalanta Bergamo",2,":",1]
[null,null,null,null,null,null,815,124,6,"TM 124","-","Inter Mailand",1,":",3]
[null,null,null,null,null,null,816,5,119,"FC Liverpool","-","TM 119",2,":",0]
[null,null,null,null,null,null,817,80,45,"TM 80","-","TM 45",0,":",0]
[null,null,null,null,null,null,818,2,146,"Manchester City","-","TM 146",3,":",0]
[null,null,null,null,null,null,819,139,145,"TM 139","-","TM 145",0,":",0]
[null,null,null,null,null,null,820,199,72,"TM 199","-","TM 72",1,":",5]
[null,null,null,null,null,null,821,73,143,"TM 73","-","TM 143",0,":",3]
[null,null,null,null,null,null,822,134,63,"TM 134","-","TM 63",5,":",1]
[null,null,null,null,null,null,823,153,125,"TM 153","-","TM 125",0,":",4]
[null,null,null,null,null,null,824,121,189,"TM 121","-","TM 189",5,":",2]
[null,null,null,null,null,null,825,102,99,"TM 102","-","TM 99",3,":",1]
[null,null,null,null,null,null,826,98,83,"TM 98","-","TM 83",0,":",3]
[null,null,null,null,null,null,827,16,149,"FC Brügge","-","TM 149",9,":",2]
[null,null,null,null,null,null,828,198,75,"TM 198","-","TM 75",3,":",1]
[null,null,null,null,null,null,829,67,196,"TM 67","-","TM 196",1,":",3]
[null,null,null,null,null,null,830,194,172,"TM 194","-","TM 172",2,":",0]
[null,null,null,null,null,null,831,48,29,"TM 48","-","Aston Villa",0,":",0]
[null,null,null,null,null,null,832,193,136,"TM 193","-","TM 136",3,":",0]
[null,null,null,null,null,null,833,60,97,"TM 60","-","TM 97",0,":",0]
[null,null,null,null,null,null,834,142,115,{"$f":"IFERROR(VLOOKUP($H839,$B$6:$C$205,2,0),\"\")","v":"TM 142"},"-",{"$f":"IFERROR(VLOOKUP($I839,$B$6:$C$205,2,0),\"\")","v":"TM 115"},1,":",0]
[null,null,null,null,null,null,835,100,116,"TM 100","-","TM 116",0,":",3]
[null,null,null,null,null,null,836,24,185,"Red Bull Salzburg","-","TM 185",5,":",1]
[null,null,null,null,null,null,837,155,166,"TM 155","-","TM 166",0,":",4]
[null,null,null,null,null,null,838,37,154,"AC Roma","-","TM 154",5,":",2]
[null,null,null,null,null,null,839,68,70,"TM 68","-","TM 70",1,":",3]
[null,null,null,null,null,null,840,192,93,"TM 192","-","TM 93",3,":",1]
[null,null,null,null,null,null,841,51,123,"TM 51","-","TM 123",0,":",2]
[null,null,null,null,null,null,842,114,52,"TM 114","-","TM 52",0,":",0]
[null,null,null,null,null,null,843,59,187,"TM 59","-","TM 187",0,":",3]
[null,null,null,null,null,null,844,186,94,"TM 186","-","TM 94",0,":",0]
[null,null,null,null,null,null,845,160,162,"TM 160","-","TM 162",0,":",1]
[null,null,null,null,null,null,846,113,38,"TM 113","-","FC Basel",3,":",0]
[null,null,null,null,null,null,847,17,107,"Schachtjor Donezk","-","TM 107",1,":",5]
[null,null,null,null,null,null,848,190,137,"TM 190","-","TM 137",4,":",0]
[null,null,null,null,null,null,849,150,43,"TM 150","-","TM 43",2,":",5]
[null,null,null,null,null,null,850,111,170,"TM 111","-","TM 170",1,":",3]
[null,null,null,null,null,null,851,168,91,"TM 168","-","TM 91",3,":",0]
[null,null,null,null,null,null,852,151,86,"TM 151","-","TM 86",2,":",9]
[null,null,null,null,null,null,853,133,19,"TM 133","-","Feyenoord Rotterdam",1,":",3]
[null,null,null,null,null,null,854,57,173,"TM 57","-","TM 173",3,":",1]
[null,null,null,null,null,null,855,157,79,"TM 157","-","TM 79",0,":",2]
[null,null,null,null,null,null,856,49,182,"TM 49","-","TM 182",0,":",0]
[null,null,null,null,null,null,857,108,69,"TM 108","-","TM 69",0,":",3]
[null,null,null,null,null,null,858,34,110,"Stade Brest","-","TM 110",0,":",0]
[null,null,null,null,null,null,859,200,184,"TM 200","-","TM 184",0,":",1]
[null,null,null,null,null,null,860,27,135,"Young Boys Bern","-","TM 135",3,":",0]
[null,null,null,null,null,null,861,53,87,"TM 53","-","TM 87",1,":",5]
[null,null,null,null,null,null,862,84,118,"TM 84","-","TM 118",4,":",0]
[null,null,null,null,null,null,863,105,82,"TM 105","-","TM 82",2,":",5]
[null,null,null,null,null,null,864,96,85,"TM 96","-","TM 85",3,":",1]
[null,null,null,null,null,null,865,61,41,"TM 61","-","TM 41",0,":",3]
[null,null,null,null,null,null,866,32,179,"VfB Stuttgart","-","TM 179",9,":",2]
[null,null,null,null,null,null,867,138,78,"TM 138","-","TM 78",3,":",1]
[null,null,null,null,null,null,868,81,3,"TM 81","-","FC Bayern München",1,":",3]
[null,null,null,null,null,null,869,127,89,"TM 127","-","TM 89",2,":",0]
[null,null,null,null,null,null,870,181,152,"TM 181","-","TM 152",0,":",0]
[null,null,null,null,null,null,871,126,103,"TM 126","-","TM 103",3,":",0]
[null,null,null,null,null,null,872,40,144,"Hertha BSC","-","TM 144",0,":",0]
[null,null,null,null,null,null,873,9,180,"FC Barcelona","-","TM 180",1,":",0]
[null,null,null,null,null,null,874,4,50,"Paris Saint-Germain","-","TM 50",0,":",3]
[null,null,null,null,null,null,875,54,66,"TM 54","-","TM 66",5,":",1]
[null,null,null,null,null,null,876,122,147,"TM 122","-","TM 147",0,":",4]
[null,null,null,null,null,null,877,92,74,"TM 92","-","TM 74",5,":",2]
[null,null,null,null,null,null,878,14,169,"Benfica Lissabon","-","TM 169",3,":",1]
[null,null,null,null,null,null,879,44,65,"TM 44","-","TM 65",0,":",3]
[null,null,null,null,null,null,880,71,195,"TM 71","-","TM 195",9,":",2]
[null,null,null,null,null,null,881,148,101,"TM 148","-","TM 101",2,":",1]
[null,null,null,null,null,null,882,106,62,"TM 106","-","TM 62",1,":",3]
[null,null,null,null,null,null,883,42,128,"TM 42","-","TM 128",2,":",0]
[null,null,null,null,null,null,884,191,11,"TM 191","-","Atletico Madrid",0,":",0]
[null,null,null,null,null,null,885,112,56,"TM 112","-","TM 56",3,":",0]
[null,null,null,null,null,null,886,95,177,"TM 95","-","TM 177",0,":",0]
[null,null,null,null,null,null,887,130,178,"TM 130","-","TM 178",1,":",0]
[null,null,null,null,null,null,888,156,117,"TM 156","-","TM 117",0,":",3]
[null,null,null,null,null,null,889,140,1,"TM 140","-","Real Madrid",5,":",1]
[null,null,null,null,null,null,890,39,120,"FC Lille","-","TM 120",0,":",4]
[null,null,null,null,null,null,891,88,64,"TM 88","-","TM 64",5,":",2]
[null,null,null,null,null,null,892,55,132,"TM 55","-","TM 132",3,":",1]
[null,null,null,null,null,null,893,77,141,"TM 77","-","TM 141",0,":",3]
[null,null,null,null,null,null,894,18,197,"AC Mailand","-","TM 197",9,":",2]
[null,null,null,null,null,null,895,13,8,"Juventus Turin","-","RB Leipzig",3,":",1]
[null,null,null,null,null,null,896,131,129,"TM 131","-","TM 129",1,":",3]
[null,null,null,null,null,null,897,25,90,"OSC Lille","-","TM 90",2,":",0]
[null,null,null,null,null,null,898,171,188,{"$f":"IFERROR(VLOOKUP($H903,$B$6:$C$205,2,0),\"\")","v":"TM 171"},"-",{"$f":"IFERROR(VLOOKUP($I903,$B$6:$C$205,2,0),\"\")","v":"TM 188"},0,":",0]
[null,null,null,null,null,null,899,183,174,"TM 183","-","TM 174",3,":",0]
[null,null,null,null,null,null,900,109,36,"TM 109","-","Mainz 05",0,":",0]
[null,null,null,null,null,null,901,22,176,"Celtic Glasgow","-","TM 176",1,":",0]
[null,null,null,null,null,null,902,21,23,"PSV Eindhoven","-","Dinamo Zagreb",0,":",3]
[null,null,null,null,null,null,903,26,20,"Roter Stern Belgrad","-","Sporting Lissabon",5,":",1]
[null,null,null,null,null,null,904,167,28,"TM 167","-","AS Monaco",0,":",4]
[null,null,null,null,null,null,905,46,165,"TM 46","-","TM 165",5,":",2]
[null,null,null,null,null,null,906,164,30,"TM 164","-","FC Bologna",1,":",3]
[null,null,null,null,null,null,907,31,163,"FC Girona","-","TM 163",3,":",1]
[null,null,null,null,null,null,908,159,33,"TM 159","-","Sturm Graz",0,":",2]
[null,null,null,null,null,null,909,35,161,"Eintracht Frankfurt","-","TM 161",0,":",0]
[null,null,null,null,null,null,910,15,47,"FC Arsenal","-","TM 47",0,":",3]
[null,null,null,null,null,null,911,58,7,"TM 58","-","Borussia Dortmund",0,":",0]
[null,null,null,null,null,null,912,10,104,"Bayer Leverkusen","-","TM 104",0,":",1]
[null,null,null,null,null,null,913,175,158,"TM 175","-","TM 158",3,":",0]
[null,null,null,null,null,null,914,6,76,"Inter Mailand","-","TM 76",1,":",5]
[null,null,null,null,null,null,915,12,5,"Atalanta Bergamo","-","FC Liverpool",4,":",0]
[null,null,null,null,null,null,916,45,124,"TM 45","-","TM 124",2,":",5]
[null,null,null,null,null,null,917,119,2,"TM 119","-","Manchester City",1,":",3]
[null,null,null,null,null,null,918,145,80,"TM 145","-","TM 80",3,":",0]
[null,null,null,null,null,null,919,146,199,"TM 146","-","TM 199",2,":",9]
[null,null,null,null,null,null,920,143,139,"TM 143","-","TM 139",1,":",3]
[null,null,null,null,null,null,921,72,134,"TM 72","-","TM 134",3,":",1]
[null,null,null,null,null,null,922,125,73,"TM 125","-","TM 73",0,":",2]
[null,null,null,null,null,null,923,63,121,"TM 63","-","TM 121",0,":",0]
[null,null,null,null,null,null,924,99,153,"TM 99","-","TM 153",0,":",3]
[null,null,null,null,null,null,925,189,98,"TM 189","-","TM 98",0,":",0]
[null,null,null,null,null,null,926,149,102,"TM 149","-","TM 102",0,":",1]
[null,null,null,null,null,null,927,83,198,"TM 83","-","TM 198",3,":",0]
[null,null,null,null,null,null,928,196,16,"TM 196","-","FC Brügge",1,":",5]
[null,null,null,null,null,null,929,75,194,"TM 75","-","TM 194",4,":",0]
[null,null,null,null,null,null,930,29,67,"Aston Villa","-","TM 67",2,":",5]
[null,null,null,null,null,null,931,172,193,"TM 172","-","TM 193",3,":",1]
[null,null,null,null,null,null,932,97,48,"TM 97","-","TM 48",0,":",3]
[null,null,null,null,null,null,933,136,142,"TM 136","-","TM 142",9,":",2]
[null,null,null,null,null,null,934,116,60,"TM 116","-","TM 60",3,":",1]
[null,null,null,null,null,null,935,115,24,"TM 115","-","Red Bull Salzburg",1,":",3]
[null,null,null,null,null,null,936,166,100,"TM 166","-","TM 100",2,":",0]
[null,null,null,null,null,null,937,185,37,"TM 185","-","AC Roma",0,":",0]
[null,null,null,null,null,null,938,70,155,"TM 70","-","TM 155",3,":",0]
[null,null,null,null,null,null,939,154,192,"TM 154","-","TM 192",0,":",0]
[null,null,null,null,null,null,940,123,68,"TM 123","-","TM 68",1,":",0]
[null,null,null,null,null,null,941,93,114,"TM 93","-","TM 114",0,":",3]
[null,null,null,null,null,null,942,187,51,"TM 187","-","TM 51",5,":",1]
[null,null,null,null,null,null,943,52,186,"TM 52","-","TM 186",0,":",4]
[null,null,null,null,null,null,944,162,59,"TM 162","-","TM 59",5,":",2]
[null,null,null,null,null,null,945,94,113,"TM 94","-","TM 113",3,":",1]
[null,null,null,null,null,null,946,107,160,"TM 107","-","TM 160",0,":",3]
[null,null,null,null,null,null,947,38,190,"FC Basel","-","TM 190",9,":",2]
[null,null,null,null,null,null,948,43,17,"TM 43","-","Schachtjor Donezk",2,":",1]
[null,null,null,null,null,null,949,137,111,"TM 137","-","TM 111",1,":",3]
[null,null,null,null,null,null,950,91,150,"TM 91","-","TM 150",2,":",0]
[null,null,null,null,null,null,951,170,151,"TM 170","-","TM 151",0,":",0]
[null,null,null,null,null,null,952,19,168,"Feyenoord Rotterdam","-","TM 168",3,":",0]
[null,null,null,null,null,null,953,86,57,"TM 86","-","TM 57",0,":",0]
[null,null,null,null,null,null,954,79,133,"TM 79","-","TM 133",1,":",0]
[null,null,null,null,null,null,955,173,49,"TM 173","-","TM 49",0,":",3]
[null,null,null,null,null,null,956,69,157,"TM 69","-","TM 157",5,":",1]
[null,null,null,null,null,null,957,182,34,"TM 182","-","Stade Brest",0,":",4]
[null,null,null,null,null,null,958,184,108,"TM 184","-","TM 108",5,":",2]
[null,null,null,null,null,null,959,110,27,"TM 110","-","Young Boys Bern",3,":",1]
[null,null,null,null,null,null,960,87,200,"TM 87","-","TM 200",0,":",3]
[null,null,null,null,null,null,961,135,84,"TM 135","-","TM 84",9,":",2]
[null,null,null,null,null,null,962,82,53,{"$f":"IFERROR(VLOOKUP($H967,$B$6:$C$205,2,0),\"\")","v":"TM 82"},"-",{"$f":"IFERROR(VLOOKUP($I967,$B$6:$C$205,2,0),\"\")","v":"TM 53"},3,":",1]
[null,null,null,null,null,null,963,118,96,"TM 118","-","TM 96",1,":",3]
[null,null,null,null,null,null,964,41,105,"TM 41","-","TM 105",2,":",0]
[null,null,null,null,null,null,965,85,32,"TM 85","-","VfB Stuttgart",0,":",0]
[null,null,null,null,null,null,966,78,61,"TM 78","-","TM 61",3,":",0]
[null,null,null,null,null,null,967,179,81,"TM 179","-","TM 81",0,":",0]
[null,null,null,null,null,null,968,89,138,"TM 89","-","TM 138",1,":",0]
[null,null,null,null,null,null,969,3,181,"FC Bayern München","-","TM 181",0,":",3]
[null,null,null,null,null,null,970,103,127,"TM 103","-","TM 127",5,":",1]
[null,null,null,null,null,null,971,152,40,"TM 152","-","Hertha BSC",0,":",4]
[null,null,null,null,null,null,972,180,126,"TM 180","-","TM 126",5,":",2]
[null,null,null,null,null,null,973,144,4,"TM 144","-","Paris Saint-Germain",1,":",3]
[null,null,null,null,null,null,974,66,9,"TM 66","-","FC Barcelona",3,":",1]
[null,null,null,null,null,null,975,50,122,"TM 50","-","TM 122",0,":",2]
[null,null,null,null,null,null,976,74,54,"TM 74","-","TM 54",0,":",0]
[null,null,null,null,null,null,977,147,14,"TM 147","-","Benfica Lissabon",0,":",3]
[null,null,null,null,null,null,978,65,92,"TM 65","-","TM 92",0,":",0]
[null,null,null,null,null,null,979,169,71,"TM 169","-","TM 71",0,":",1]
[null,null,null,null,null,null,980,101,44,"TM 101","-","TM 44",3,":",0]
[null,null,null,null,null,null,981,195,106,"TM 195","-","TM 106",1,":",5]
[null,null,null,null,null,null,982,128,148,"TM 128","-","TM 148",4,":",0]
[null,null,null,null,null,null,983,62,191,"TM 62","-","TM 191",2,":",5]
[null,null,null,null,null,null,984,56,42,"TM 56","-","TM 42",1,":",3]
[null,null,null,null,null,null,985,11,95,"Atletico Madrid","-","TM 95",3,":",0]
[null,null,null,null,null,null,986,178,112,"TM 178","-","TM 112",2,":",9]
[null,null,null,null,null,null,987,177,156,"TM 177","-","TM 156",1,":",3]
[null,null,null,null,null,null,988,1,130,"Real Madrid","-","TM 130",3,":",1]
[null,null,null,null,null,null,989,117,39,"TM 117","-","FC Lille",0,":",2]
[null,null,null,null,null,null,990,64,140,"TM 64","-","TM 140",0,":",0]
[null,null,null,null,null,null,991,120,55,"TM 120","-","TM 55",0,":",3]
[null,null,null,null,null,null,992,141,88,"TM 141","-","TM 88",0,":",0]
[null,null,null,null,null,null,993,132,18,"TM 132","-","AC Mailand",0,":",1]
[null,null,null,null,null,null,994,8,77,"RB Leipzig","-","TM 77",3,":",0]
[null,null,null,null,null,null,995,197,131,"TM 197","-","TM 131",1,":",5]
[null,null,null,null,null,null,996,90,13,"TM 90","-","Juventus Turin",4,":",0]
[null,null,null,null,null,null,997,129,171,"TM 129","-","TM 171",2,":",5]
[null,null,null,null,null,null,998,174,25,"TM 174","-","OSC Lille",3,":",1]
[null,null,null,null,null,null,999,188,109,"TM 188","-","TM 109",0,":",3]
[null,null,null,null,null,null,1000,36,183,"Mainz 05","-","TM 183",9,":",2]
[null,null,null,null,null,null,1001,176,21,"TM 176","-","PSV Eindhoven",3,":",1]
[null,null,null,null,null,null,1002,20,22,"Sporting Lissabon","-","Celtic Glasgow",1,":",3]
[null,null,null,null,null,null,1003,23,167,"Dinamo Zagreb","-","TM 167",2,":",0]
[null,null,null,null,null,null,1004,165,26,"TM 165","-","Roter Stern Belgrad",0,":",0]
[null,null,null,null,null,null,1005,28,164,"AS Monaco","-","TM 164",3,":",0]
[null,null,null,null,null,null,1006,163,46,"TM 163","-","TM 46",0,":",0]
[null,null,null,null,null,null,1007,30,159,"FC Bologna","-","TM 159",1,":",0]
[null,null,null,null,null,null,1008,161,31,"TM 161","-","FC Girona",0,":",3]
[null,null,null,null,null,null,1009,33,15,"Sturm Graz","-","FC Arsenal",5,":",1]
[null,null,null,null,null,null,1010,7,35,"Borussia Dortmund","-","Eintracht Frankfurt",0,":",4]
[null,null,null,null,null,null,1011,47,10,"TM 47","-","Bayer Leverkusen",5,":",2]
[null,null,null,null,null,null,1012,158,58,"TM 158","-","TM 58",3,":",1]
[null,null,null,null,null,null,1013,104,6,"TM 104","-","Inter Mailand",0,":",3]
[null,null,null,null,null,null,1014,5,175,"FC Liverpool","-","TM 175",9,":",2]
[null,null,null,null,null,null,1015,76,45,"TM 76","-","TM 45",2,":",1]
[null,null,null,null,null,null,1016,2,12,"Manchester City","-","Atalanta Bergamo",1,":",3]
[null,null,null,null,null,null,1017,124,145,"TM 124","-","TM 145",2,":",0]
[null,null,null,null,null,null,1018,199,119,"TM 199","-","TM 119",0,":",0]
[null,null,null,null,null,null,1019,80,143,"TM 80","-","TM 143",3,":",0]
[null,null,null,null,null,null,1020,134,146,"TM 134","-","TM 146",0,":",0]
[null,null,null,null,null,null,1021,139,125,"TM 139","-","TM 125",1,":",0]
[null,null,null,null,null,null,1022,121,72,"TM 121","-","TM 72",0,":",3]
[null,null,null,null,null,null,1023,73,99,"TM 73","-","TM 99",5,":",1]
[null,null,null,null,null,null,1024,98,63,"TM 98","-","TM 63",0,":",4]
[null,null,null,null,null,null,1025,153,149,"TM 153","-","TM 149",5,":",2]
[null,null,null,null,null,null,1026,198,189,{"$f":"IFERROR(VLOOKUP($H1031,$B$6:$C$205,2,0),\"\")","v":"TM 198"},"-",{"$f":"IFERROR(VLOOKUP($I1031,$B$6:$C$205,2,0),\"\")","v":"TM 189"},3,":",1]
[null,null,null,null,null,null,1027,102,196,"TM 102","-","TM 196",0,":",3]
[null,null,null,null,null,null,1028,194,83,"TM 194","-","TM 83",9,":",2]
[null,null,null,null,null,null,1029,16,29,"FC Brügge","-","Aston Villa",3,":",1]
[null,null,null,null,null,null,1030,193,75,"TM 193","-","TM 75",1,":",3]
[null,null,null,null,null,null,1031,67,97,"TM 67","-","TM 97",2,":",0]
[null,null,null,null,null,null,1032,142,172,"TM 142","-","TM 172",0,":",0]
[null,null,null,null,null,null,1033,48,116,"TM 48","-","TM 116",3,":",0]
[null,null,null,null,null,null,1034,24,136,"Red Bull Salzburg","-","TM 136",0,":",0]
[null,null,null,null,null,null,1035,60,166,"TM 60","-","TM 166",1,":",0]
[null,null,null,null,null,null,1036,37,115,"AC Roma","-","TM 115",0,":",3]
[null,null,null,null,null,null,1037,100,70,"TM 100","-","TM 70",5,":",1]
[null,null,null,null,null,null,1038,192,185,"TM 192","-","TM 185",0,":",4]
[null,null,null,null,null,null,1039,155,123,"TM 155","-","TM 123",5,":",2]
[null,null,null,null,null,null,1040,114,154,"TM 114","-","TM 154",1,":",3]
[null,null,null,null,null,null,1041,68,187,"TM 68","-","TM 187",3,":",1]
[null,null,null,null,null,null,1042,186,93,"TM 186","-","TM 93",0,":",2]
[null,null,null,null,null,null,1043,51,162,"TM 51","-","TM 162",0,":",0]
[null,null,null,null,null,null,1044,113,52,"TM 113","-","TM 52",0,":",3]
[null,null,null,null,null,null,1045,59,107,"TM 59","-","TM 107",0,":",0]
[null,null,null,null,null,null,1046,190,94,"TM 190","-","TM 94",0,":",1]
[null,null,null,null,null,null,1047,160,43,"TM 160","-","TM 43",3,":",0]
[null,null,null,null,null,null,1048,111,38,"TM 111","-","FC Basel",1,":",5]
[null,null,null,null,null,null,1049,17,91,"Schachtjor Donezk","-","TM 91",4,":",0]
[null,null,null,null,null,null,1050,151,137,"TM 151","-","TM 137",2,":",5]
[null,null,null,null,null,null,1051,150,19,"TM 150","-","Feyenoord Rotterdam",1,":",3]
[null,null,null,null,null,null,1052,57,170,"TM 57","-","TM 170",3,":",0]
[null,null,null,null,null,null,1053,168,79,"TM 168","-","TM 79",2,":",9]
[null,null,null,null,null,null,1054,49,86,"TM 49","-","TM 86",1,":",3]
[null,null,null,null,null,null,1055,133,69,"TM 133","-","TM 69",3,":",1]
[null,null,null,null,null,null,1056,34,173,"Stade Brest","-","TM 173",0,":",2]
[null,null,null,null,null,null,1057,157,184,"TM 157","-","TM 184",0,":",0]
[null,null,null,null,null,null,1058,27,182,"Young Boys Bern","-","TM 182",0,":",3]
[null,null,null,null,null,null,1059,108,87,"TM 108","-","TM 87",0,":",0]
[null,null,null,null,null,null,1060,84,110,"TM 84","-","TM 110",0,":",1]
[null,null,null,null,null,null,1061,200,82,"TM 200","-","TM 82",3,":",0]
[null,null,null,null,null,null,1062,96,135,"TM 96","-","TM 135",1,":",5]
[null,null,null,null,null,null,1063,53,41,"TM 53","-","TM 41",4,":",0]
[null,null,null,null,null,null,1064,32,118,"VfB Stuttgart","-","TM 118",2,":",5]
[null,null,null,null,null,null,1065,105,78,"TM 105","-","TM 78",3,":",1]
[null,null,null,null,null,null,1066,81,85,"TM 81","-","TM 85",0,":",3]
[null,null,null,null,null,null,1067,61,89,"TM 61","-","TM 89",9,":",2]
[null,null,null,null,null,null,1068,181,179,"TM 181","-","TM 179",3,":",1]
[null,null,null,null,null,null,1069,138,103,"TM 138","-","TM 103",1,":",3]
[null,null,null,null,null,null,1070,40,3,"Hertha BSC","-","FC Bayern München",2,":",0]
[null,null,null,null,null,null,1071,127,180,"TM 127","-","TM 180",0,":",0]
[null,null,null,null,null,null,1072,4,152,"Paris Saint-Germain","-","TM 152",3,":",0]
[null,null,null,null,null,null,1073,126,66,"TM 126","-","TM 66",0,":",0]
[null,null,null,null,null,null,1074,122,144,"TM 122","-","TM 144",1,":",0]
[null,null,null,null,null,null,1075,9,74,"FC Barcelona","-","TM 74",0,":",3]
[null,null,null,null,null,null,1076,14,50,"Benfica Lissabon","-","TM 50",5,":",1]
[null,null,null,null,null,null,1077,54,65,"TM 54","-","TM 65",0,":",4]
[null,null,null,null,null,null,1078,71,147,"TM 71","-","TM 147",5,":",2]
[null,null,null,null,null,null,1079,92,101,"TM 92","-","TM 101",3,":",1]
[null,null,null,null,null,null,1080,106,169,"TM 106","-","TM 169",0,":",3]
[null,null,null,null,null,null,1081,44,128,"TM 44","-","TM 128",9,":",2]
[null,null,null,null,null,null,1082,191,195,"TM 191","-","TM 195",2,":",1]
[null,null,null,null,null,null,1083,148,56,"TM 148","-","TM 56",1,":",3]
[null,null,null,null,null,null,1084,95,62,"TM 95","-","TM 62",2,":",0]
[null,null,null,null,null,null,1085,42,178,"TM 42","-","TM 178",0,":",0]
[null,null,null,null,null,null,1086,156,11,"TM 156","-","Atletico Madrid",3,":",0]
[null,null,null,null,null,null,1087,112,1,"TM 112","-","Real Madrid",0,":",0]
[null,null,null,null,null,null,1088,39,177,"FC Lille","-","TM 177",1,":",0]
[null,null,null,null,null,null,1089,130,64,"TM 130","-","TM 64",0,":",3]
[null,null,null,null,null,null,1090,55,117,{"$f":"IFERROR(VLOOKUP($H1095,$B$6:$C$205,2,0),\"\")","v":"TM 55"},"-",{"$f":"IFERROR(VLOOKUP($I1095,$B$6:$C$205,2,0),\"\")","v":"TM 117"},5,":",1]
[null,null,null,null,null,null,1091,140,141,"TM 140","-","TM 141",0,":",4]
[null,null,null,null,null,null,1092,18,120,"AC Mailand","-","TM 120",5,":",2]
[null,null,null,null,null,null,1093,88,8,"TM 88","-","RB Leipzig",3,":",1]
[null,null,null,null,null,null,1094,131,132,"TM 131","-","TM 132",0,":",3]
[null,null,null,null,null,null,1095,77,90,"TM 77","-","TM 90",9,":",2]
[null,null,null,null,null,null,1096,171,197,"TM 171","-","TM 197",3,":",1]
[null,null,null,null,null,null,1097,13,174,"Juventus Turin","-","TM 174",1,":",3]
[null,null,null,null,null,null,1098,109,129,"TM 109","-","TM 129",2,":",0]
[null,null,null,null,null,null,1099,25,36,"OSC Lille","-","Mainz 05",0,":",0]
[null,null,null,null,null,null,1100,183,188,"TM 183","-","TM 188",3,":",0]
[null,null,null,null,null,null,1101,20,176,"Sporting Lissabon","-","TM 176",0,":",0]
[null,null,null,null,null,null,1102,167,21,"TM 167","-","PSV Eindhoven",1,":",0]
[null,null,null,null,null,null,1103,22,165,"Celtic Glasgow","-","TM 165",0,":",3]
[null,null,null,null,null,null,1104,164,23,"TM 164","-","Dinamo Zagreb",5,":",1]
[null,null,null,null,null,null,1105,26,163,"Roter Stern Belgrad","-","TM 163",0,":",4]
[null,null,null,null,null,null,1106,159,28,"TM 159","-","AS Monaco",5,":",2]
[null,null,null,null,null,null,1107,46,161,"TM 46","-","TM 161",1,":",3]
[null,null,null,null,null,null,1108,15,30,"FC Arsenal","-","FC Bologna",3,":",1]
[null,null,null,null,null,null,1109,31,7,"FC Girona","-","Borussia Dortmund",0,":",2]
[null,null,null,null,null,null,1110,10,33,"Bayer Leverkusen","-","Sturm Graz",0,":",0]
[null,null,null,null,null,null,1111,35,158,"Eintracht Frankfurt","-","TM 158",0,":",3]
[null,null,null,null,null,null,1112,6,47,"Inter Mailand","-","TM 47",0,":",0]
[null,null,null,null,null,null,1113,58,5,"TM 58","-","FC Liverpool",0,":",1]
[null,null,null,null,null,null,1114,45,104,"TM 45","-","TM 104",3,":",0]
[null,null,null,null,null,null,1115,175,2,"TM 175","-","Manchester City",1,":",5]
[null,null,null,null,null,null,1116,145,76,"TM 145","-","TM 76",4,":",0]
[null,null,null,null,null,null,1117,12,199,"Atalanta Bergamo","-","TM 199",2,":",5]
[null,null,null,null,null,null,1118,143,124,"TM 143","-","TM 124",1,":",3]
[null,null,null,null,null,null,1119,119,134,"TM 119","-","TM 134",3,":",0]
[null,null,null,null,null,null,1120,125,80,"TM 125","-","TM 80",2,":",9]
[null,null,null,null,null,null,1121,146,121,"TM 146","-","TM 121",1,":",3]
[null,null,null,null,null,null,1122,99,139,"TM 99","-","TM 139",3,":",1]
[null,null,null,null,null,null,1123,72,98,"TM 72","-","TM 98",0,":",2]
[null,null,null,null,null,null,1124,149,73,"TM 149","-","TM 73",0,":",0]
[null,null,null,null,null,null,1125,63,198,"TM 63","-","TM 198",0,":",3]
[null,null,null,null,null,null,1126,196,153,"TM 196","-","TM 153",0,":",0]
[null,null,null,null,null,null,1127,189,194,"TM 189","-","TM 194",0,":",1]
[null,null,null,null,null,null,1128,29,102,"Aston Villa","-","TM 102",3,":",0]
[null,null,null,null,null,null,1129,83,193,"TM 83","-","TM 193",1,":",5]
[null,null,null,null,null,null,1130,97,16,"TM 97","-","FC Brügge",4,":",0]
[null,null,null,null,null,null,1131,75,142,"TM 75","-","TM 142",2,":",5]
[null,null,null,null,null,null,1132,116,67,"TM 116","-","TM 67",3,":",1]
[null,null,null,null,null,null,1133,172,24,"TM 172","-","Red Bull Salzburg",0,":",3]
[null,null,null,null,null,null,1134,166,48,"TM 166","-","TM 48",9,":",2]
[null,null,null,null,null,null,1135,136,37,"TM 136","-","AC Roma",3,":",1]
[null,null,null,null,null,null,1136,70,60,"TM 70","-","TM 60",1,":",3]
[null,null,null,null,null,null,1137,115,192,"TM 115","-","TM 192",2,":",0]
[null,null,null,null,null,null,1138,123,100,"TM 123","-","TM 100",0,":",0]
[null,null,null,null,null,null,1139,185,114,"TM 185","-","TM 114",3,":",0]
[null,null,null,null,null,null,1140,187,155,"TM 187","-","TM 155",0,":",0]
[null,null,null,null,null,null,1141,154,186,"TM 154","-","TM 186",1,":",0]
[null,null,null,null,null,null,1142,162,68,"TM 162","-","TM 68",0,":",3]
[null,null,null,null,null,null,1143,93,113,"TM 93","-","TM 113",5,":",1]
[null,null,null,null,null,null,1144,107,51,"TM 107","-","TM 51",0,":",4]
[null,null,null,null,null,null,1145,52,190,"TM 52","-","TM 190",5,":",2]
[null,null,null,null,null,null,1146,43,59,"TM 43","-","TM 59",3,":",1]
[null,null,null,null,null,null,1147,94,111,"TM 94","-","TM 111",0,":",3]
[null,null,null,null,null,null,1148,91,160,"TM 91","-","TM 160",9,":",2]
[null,null,null,null,null,null,1149,38,151,"FC Basel","-","TM 151",2,":",1]
[null,null,null,null,null,null,1150,19,17,"Feyenoord Rotterdam","-","Schachtjor Donezk",1,":",3]
[null,null,null,null,null,null,1151,137,57,"TM 137","-","TM 57",2,":",0]
[null,null,null,null,null,null,1152,79,150,"TM 79","-","TM 150",0,":",0]
[null,null,null,null,null,null,1153,170,49,"TM 170","-","TM 49",3,":",0]
[null,null,null,null,null,null,1154,69,168,{"$f":"IFERROR(VLOOKUP($H1159,$B$6:$C$205,2,0),\"\")","v":"TM 69"},"-",{"$f":"IFERROR(VLOOKUP($I1159,$B$6:$C$205,2,0),\"\")","v":"TM 168"},0,":",0]
[null,null,null,null,null,null,1155,86,34,"TM 86","-","Stade Brest",1,":",0]
[null,null,null,null,null,null,1156,184,133,"TM 184","-","TM 133",0,":",3]
[null,null,null,null,null,null,1157,173,27,"TM 173","-","Young Boys Bern",5,":",1]
[null,null,null,null,null,null,1158,87,157,"TM 87","-","TM 157",0,":",4]
[null,null,null,null,null,null,1159,182,84,"TM 182","-","TM 84",5,":",2]
[null,null,null,null,null,null,1160,82,108,"TM 82","-","TM 108",3,":",1]
[null,null,null,null,null,null,1161,110,96,"TM 110","-","TM 96",0,":",3]
[null,null,null,null,null,null,1162,41,200,"TM 41","-","TM 200",9,":",2]
[null,null,null,null,null,null,1163,135,32,"TM 135","-","VfB Stuttgart",3,":",1]
[null,null,null,null,null,null,1164,78,53,"TM 78","-","TM 53",1,":",3]
[null,null,null,null,null,null,1165,118,81,"TM 118","-","TM 81",2,":",0]
[null,null,null,null,null,null,1166,89,105,"TM 89","-","TM 105",0,":",0]
[null,null,null,null,null,null,1167,85,181,"TM 85","-","TM 181",3,":",0]
[null,null,null,null,null,null,1168,103,61,"TM 103","-","TM 61",0,":",0]
[null,null,null,null,null,null,1169,179,40,"TM 179","-","Hertha BSC",1,":",0]
[null,null,null,null,null,null,1170,180,138,"TM 180","-","TM 138",0,":",3]
[null,null,null,null,null,null,1171,3,4,"FC Bayern München","-","Paris Saint-Germain",5,":",1]
[null,null,null,null,null,null,1172,66,127,"TM 66","-","TM 127",0,":",4]
[null,null,null,null,null,null,1173,152,122,"TM 152","-","TM 122",5,":",2]
[null,null,null,null,null,null,1174,74,126,"TM 74","-","TM 126",1,":",3]
[null,null,null,null,null,null,1175,144,14,"TM 144","-","Benfica Lissabon",3,":",1]
[null,null,null,null,null,null,1176,65,9,"TM 65","-","FC Barcelona",0,":",2]
[null,null,null,null,null,null,1177,50,71,"TM 50","-","TM 71",0,":",0]
[null,null,null,null,null,null,1178,101,54,"TM 101","-","TM 54",0,":",3]
[null,null,null,null,null,null,1179,147,106,"TM 147","-","TM 106",0,":",0]
[null,null,null,null,null,null,1180,128,92,"TM 128","-","TM 92",0,":",1]
[null,null,null,null,null,null,1181,169,191,"TM 169","-","TM 191",3,":",0]
[null,null,null,null,null,null,1182,56,44,"TM 56","-","TM 44",1,":",5]
[null,null,null,null,null,null,1183,195,95,"TM 195","-","TM 95",4,":",0]
[null,null,null,null,null,null,1184,178,148,"TM 178","-","TM 148",2,":",5]
[null,null,null,null,null,null,1185,62,156,"TM 62","-","TM 156",1,":",3]
[null,null,null,null,null,null,1186,1,42,"Real Madrid","-","TM 42",3,":",0]
[null,null,null,null,null,null,1187,11,39,"Atletico Madrid","-","FC Lille",2,":",9]
[null,null,null,null,null,null,1188,64,112,"TM 64","-","TM 112",1,":",3]
[null,null,null,null,null,null,1189,177,55,"TM 177","-","TM 55",3,":",1]
[null,null,null,null,null,null,1190,141,130,"TM 141","-","TM 130",0,":",2]
[null,null,null,null,null,null,1191,117,18,"TM 117","-","AC Mailand",0,":",0]
[null,null,null,null,null,null,1192,8,140,"RB Leipzig","-","TM 140",0,":",3]
[null,null,null,null,null,null,1193,120,131,"TM 120","-","TM 131",0,":",0]
[null,null,null,null,null,null,1194,90,88,"TM 90","-","TM 88",0,":",1]
[null,null,null,null,null,null,1195,132,171,"TM 132","-","TM 171",3,":",0]
[null,null,null,null,null,null,1196,174,77,"TM 174","-","TM 77",1,":",5]
[null,null,null,null,null,null,1197,197,109,"TM 197","-","TM 109",4,":",0]
[null,null,null,null,null,null,1198,36,13,"Mainz 05","-","Juventus Turin",2,":",5]
[null,null,null,null,null,null,1199,129,183,"TM 129","-","TM 183",3,":",1]
[null,null,null,null,null,null,1200,188,25,"TM 188","-","OSC Lille",0,":",3]
[null,null,null,null,null,null,1201,176,167,"TM 176","-","TM 167",9,":",2]
[null,null,null,null,null,null,1202,165,20,"TM 165","-","Sporting Lissabon",3,":",1]
[null,null,null,null,null,null,1203,21,164,"PSV Eindhoven","-","TM 164",1,":",3]
[null,null,null,null,null,null,1204,163,22,"TM 163","-","Celtic Glasgow",2,":",0]
[null,null,null,null,null,null,1205,23,159,"Dinamo Zagreb","-","TM 159",0,":",0]
[null,null,null,null,null,null,1206,161,26,"TM 161","-","Roter Stern Belgrad",3,":",0]
[null,null,null,null,null,null,1207,28,15,"AS Monaco","-","FC Arsenal",0,":",0]
[null,null,null,null,null,null,1208,7,46,"Borussia Dortmund","-","TM 46",1,":",0]
[null,null,null,null,null,null,1209,30,10,"FC Bologna","-","Bayer Leverkusen",0,":",3]
[null,null,null,null,null,null,1210,158,31,"TM 158","-","FC Girona",5,":",1]
[null,null,null,null,null,null,1211,33,6,"Sturm Graz","-","Inter Mailand",0,":",4]
[null,null,null,null,null,null,1212,5,35,"FC Liverpool","-","Eintracht Frankfurt",5,":",2]
[null,null,null,null,null,null,1213,47,45,"TM 47","-","TM 45",3,":",1]
[null,null,null,null,null,null,1214,2,58,"Manchester City","-","TM 58",0,":",3]
[null,null,null,null,null,null,1215,104,145,"TM 104","-","TM 145",9,":",2]
[null,null,null,null,null,null,1216,199,175,"TM 199","-","TM 175",2,":",1]
[null,null,null,null,null,null,1217,76,143,"TM 76","-","TM 143",1,":",3]
[null,null,null,null,null,null,1218,134,12,{"$f":"IFERROR(VLOOKUP($H1223,$B$6:$C$205,2,0),\"\")","v":"TM 134"},"-",{"$f":"IFERROR(VLOOKUP($I1223,$B$6:$C$205,2,0),\"\")","v":"Atalanta Bergamo"},2,":",0]
[null,null,null,null,null,null,1219,124,125,"TM 124","-","TM 125",0,":",0]
[null,null,null,null,null,null,1220,121,119,"TM 121","-","TM 119",3,":",0]
[null,null,null,null,null,null,1221,80,99,"TM 80","-","TM 99",0,":",0]
[null,null,null,null,null,null,1222,98,146,"TM 98","-","TM 146",1,":",0]
[null,null,null,null,null,null,1223,139,149,"TM 139","-","TM 149",0,":",3]
[null,null,null,null,null,null,1224,198,72,"TM 198","-","TM 72",5,":",1]
[null,null,null,null,null,null,1225,73,196,"TM 73","-","TM 196",0,":",4]
[null,null,null,null,null,null,1226,194,63,"TM 194","-","TM 63",5,":",2]
[null,null,null,null,null,null,1227,153,29,"TM 153","-","Aston Villa",3,":",1]
[null,null,null,null,null,null,1228,193,189,"TM 193","-","TM 189",0,":",3]
[null,null,null,null,null,null,1229,102,97,"TM 102","-","TM 97",9,":",2]
[null,null,null,null,null,null,1230,142,83,"TM 142","-","TM 83",3,":",1]
[null,null,null,null,null,null,1231,16,116,"FC Brügge","-","TM 116",1,":",3]
[null,null,null,null,null,null,1232,24,75,"Red Bull Salzburg","-","TM 75",2,":",0]
[null,null,null,null,null,null,1233,67,166,"TM 67","-","TM 166",0,":",0]
[null,null,null,null,null,null,1234,37,172,"AC Roma","-","TM 172",3,":",0]
[null,null,null,null,null,null,1235,48,70,"TM 48","-","TM 70",0,":",0]
[null,null,null,null,null,null,1236,192,136,"TM 192","-","TM 136",1,":",0]
[null,null,null,null,null,null,1237,60,123,"TM 60","-","TM 123",0,":",3]
[null,null,null,null,null,null,1238,114,115,"TM 114","-","TM 115",5,":",1]
[null,null,null,null,null,null,1239,100,187,"TM 100","-","TM 187",0,":",4]
[null,null,null,null,null,null,1240,186,185,"TM 186","-","TM 185",5,":",2]
[null,null,null,null,null,null,1241,155,162,"TM 155","-","TM 162",1,":",3]
[null,null,null,null,null,null,1242,113,154,"TM 113","-","TM 154",3,":",1]
[null,null,null,null,null,null,1243,68,107,"TM 68","-","TM 107",0,":",2]
[null,null,null,null,null,null,1244,190,93,"TM 190","-","TM 93",0,":",0]
[null,null,null,null,null,null,1245,51,43,"TM 51","-","TM 43",0,":",3]
[null,null,null,null,null,null,1246,111,52,"TM 111","-","TM 52",0,":",0]
[null,null,null,null,null,null,1247,59,91,"TM 59","-","TM 91",0,":",1]
[null,null,null,null,null,null,1248,151,94,"TM 151","-","TM 94",3,":",0]
[null,null,null,null,null,null,1249,160,19,"TM 160","-","Feyenoord Rotterdam",1,":",5]
[null,null,null,null,null,null,1250,57,38,"TM 57","-","FC Basel",4,":",0]
[null,null,null,null,null,null,1251,17,79,"Schachtjor Donezk","-","TM 79",2,":",5]
[null,null,null,null,null,null,1252,49,137,"TM 49","-","TM 137",1,":",3]
[null,null,null,null,null,null,1253,150,69,"TM 150","-","TM 69",3,":",0]
[null,null,null,null,null,null,1254,34,170,"Stade Brest","-","TM 170",2,":",9]
[null,null,null,null,null,null,1255,168,184,"TM 168","-","TM 184",1,":",3]
[null,null,null,null,null,null,1256,27,86,"Young Boys Bern","-","TM 86",3,":",1]
[null,null,null,null,null,null,1257,133,87,"TM 133","-","TM 87",0,":",2]
[null,null,null,null,null,null,1258,84,173,"TM 84","-","TM 173",0,":",0]
[null,null,null,null,null,null,1259,157,82,"TM 157","-","TM 82",0,":",3]
[null,null,null,null,null,null,1260,96,182,"TM 96","-","TM 182",0,":",0]
[null,null,null,null,null,null,1261,108,41,"TM 108","-","TM 41",0,":",1]
[null,null,null,null,null,null,1262,32,110,"VfB Stuttgart","-","TM 110",3,":",0]
[null,null,null,null,null,null,1263,200,78,"TM 200","-","TM 78",1,":",5]
[null,null,null,null,null,null,1264,81,135,"TM 81","-","TM 135",4,":",0]
[null,null,null,null,null,null,1265,53,89,"TM 53","-","TM 89",2,":",5]
[null,null,null,null,null,null,1266,181,118,"TM 181","-","TM 118",3,":",1]
[null,null,null,null,null,null,1267,105,103,"TM 105","-","TM 103",0,":",3]
[null,null,null,null,null,null,1268,40,85,"Hertha BSC","-","TM 85",9,":",2]
[null,null,null,null,null,null,1269,61,180,"TM 61","-","TM 180",3,":",1]
[null,null,null,null,null,null,1270,4,179,"Paris Saint-Germain","-","TM 179",1,":",3]
[null,null,null,null,null,null,1271,138,66,"TM 138","-","TM 66",2,":",0]
[null,null,null,null,null,null,1272,122,3,"TM 122","-","FC Bayern München",0,":",0]
[null,null,null,null,null,null,1273,127,74,"TM 127","-","TM 74",3,":",0]
[null,null,null,null,null,null,1274,14,152,"Benfica Lissabon","-","TM 152",0,":",0]
[null,null,null,null,null,null,1275,126,65,"TM 126","-","TM 65",1,":",0]
[null,null,null,null,null,null,1276,71,144,"TM 71","-","TM 144",0,":",3]
[null,null,null,null,null,null,1277,9,101,"FC Barcelona","-","TM 101",5,":",1]
[null,null,null,null,null,null,1278,106,50,"TM 106","-","TM 50",0,":",4]
[null,null,null,null,null,null,1279,54,128,"TM 54","-","TM 128",5,":",2]
[null,null,null,null,null,null,1280,191,147,"TM 191","-","TM 147",3,":",1]
[null,null,null,null,null,null,1281,92,56,"TM 92","-","TM 56",0,":",3]
[null,null,null,null,null,null,1282,95,169,{"$f":"IFERROR(VLOOKUP($H1287,$B$6:$C$205,2,0),\"\")","v":"TM 95"},"-",{"$f":"IFERROR(VLOOKUP($I1287,$B$6:$C$205,2,0),\"\")","v":"TM 169"},9,":",2]
[null,null,null,null,null,null,1283,44,178,"TM 44","-","TM 178",2,":",1]
[null,null,null,null,null,null,1284,156,195,"TM 156","-","TM 195",1,":",3]
[null,null,null,null,null,null,1285,148,1,"TM 148","-","Real Madrid",2,":",0]
[null,null,null,null,null,null,1286,39,62,"FC Lille","-","TM 62",0,":",0]
[null,null,null,null,null,null,1287,42,64,"TM 42","-","TM 64",3,":",0]
[null,null,null,null,null,null,1288,55,11,"TM 55","-","Atletico Madrid",0,":",0]
[null,null,null,null,null,null,1289,112,141,"TM 112","-","TM 141",1,":",0]
[null,null,null,null,null,null,1290,18,177,"AC Mailand","-","TM 177",0,":",3]
[null,null,null,null,null,null,1291,130,8,"TM 130","-","RB Leipzig",5,":",1]
[null,null,null,null,null,null,1292,131,117,"TM 131","-","TM 117",0,":",4]
[null,null,null,null,null,null,1293,140,90,"TM 140","-","TM 90",5,":",2]
[null,null,null,null,null,null,1294,171,120,"TM 171","-","TM 120",3,":",1]
[null,null,null,null,null,null,1295,88,174,"TM 88","-","TM 174",0,":",3]
[null,null,null,null,null,null,1296,109,132,"TM 109","-","TM 132",9,":",2]
[null,null,null,null,null,null,1297,77,36,"TM 77","-","Mainz 05",3,":",1]
[null,null,null,null,null,null,1298,183,197,"TM 183","-","TM 197",1,":",3]
[null,null,null,null,null,null,1299,13,188,"Juventus Turin","-","TM 188",2,":",0]
[null,null,null,null,null,null,1300,25,129,"OSC Lille","-","TM 129",0,":",0]
[null,null,null,null,null,null,1301,165,176,"TM 165","-","TM 176",3,":",0]
[null,null,null,null,null,null,1302,164,167,"TM 164","-","TM 167",0,":",0]
[null,null,null,null,null,null,1303,20,163,"Sporting Lissabon","-","TM 163",1,":",0]
[null,null,null,null,null,null,1304,159,21,"TM 159","-","PSV Eindhoven",0,":",3]
[null,null,null,null,null,null,1305,22,161,"Celtic Glasgow","-","TM 161",5,":",1]
[null,null,null,null,null,null,1306,15,23,"FC Arsenal","-","Dinamo Zagreb",0,":",4]
[null,null,null,null,null,null,1307,26,7,"Roter Stern Belgrad","-","Borussia Dortmund",5,":",2]
[null,null,null,null,null,null,1308,10,28,"Bayer Leverkusen","-","AS Monaco",1,":",3]
[null,null,null,null,null,null,1309,46,158,"TM 46","-","TM 158",3,":",1]
[null,null,null,null,null,null,1310,6,30,"Inter Mailand","-","FC Bologna",0,":",2]
[null,null,null,null,null,null,1311,31,5,"FC Girona","-","FC Liverpool",0,":",0]
[null,null,null,null,null,null,1312,45,33,"TM 45","-","Sturm Graz",0,":",3]
[null,null,null,null,null,null,1313,35,2,"Eintracht Frankfurt","-","Manchester City",0,":",0]
[null,null,null,null,null,null,1314,145,47,"TM 145","-","TM 47",0,":",1]
[null,null,null,null,null,null,1315,58,199,"TM 58","-","TM 199",3,":",0]
[null,null,null,null,null,null,1316,143,104,"TM 143","-","TM 104",1,":",5]
[null,null,null,null,null,null,1317,175,134,"TM 175","-","TM 134",4,":",0]
[null,null,null,null,null,null,1318,125,76,"TM 125","-","TM 76",2,":",5]
[null,null,null,null,null,null,1319,12,121,"Atalanta Bergamo","-","TM 121",1,":",3]
[null,null,null,null,null,null,1320,99,124,"TM 99","-","TM 124",3,":",0]
[null,null,null,null,null,null,1321,119,98,"TM 119","-","TM 98",2,":",9]
[null,null,null,null,null,null,1322,149,80,"TM 149","-","TM 80",1,":",3]
[null,null,null,null,null,null,1323,146,198,"TM 146","-","TM 198",3,":",1]
[null,null,null,null,null,null,1324,196,139,"TM 196","-","TM 139",0,":",2]
[null,null,null,null,null,null,1325,72,194,"TM 72","-","TM 194",0,":",0]
[null,null,null,null,null,null,1326,29,73,"Aston Villa","-","TM 73",0,":",3]
[null,null,null,null,null,null,1327,63,193,"TM 63","-","TM 193",0,":",0]
[null,null,null,null,null,null,1328,97,153,"TM 97","-","TM 153",0,":",1]
[null,null,null,null,null,null,1329,189,142,"TM 189","-","TM 142",3,":",0]
[null,null,null,null,null,null,1330,116,102,"TM 116","-","TM 102",1,":",5]
[null,null,null,null,null,null,1331,83,24,"TM 83","-","Red Bull Salzburg",4,":",0]
[null,null,null,null,null,null,1332,166,16,"TM 166","-","FC Brügge",2,":",5]
[null,null,null,null,null,null,1333,75,37,"TM 75","-","AC Roma",3,":",1]
[null,null,null,null,null,null,1334,70,67,"TM 70","-","TM 67",0,":",3]
[null,null,null,null,null,null,1335,172,192,"TM 172","-","TM 192",9,":",2]
[null,null,null,null,null,null,1336,123,48,"TM 123","-","TM 48",3,":",1]
[null,null,null,null,null,null,1337,136,114,"TM 136","-","TM 114",1,":",3]
[null,null,null,null,null,null,1338,187,60,"TM 187","-","TM 60",2,":",0]
[null,null,null,null,null,null,1339,115,186,"TM 115","-","TM 186",0,":",0]
[null,null,null,null,null,null,1340,162,100,"TM 162","-","TM 100",3,":",0]
[null,null,null,null,null,null,1341,185,113,"TM 185","-","TM 113",0,":",0]
[null,null,null,null,null,null,1342,107,155,"TM 107","-","TM 155",1,":",0]
[null,null,null,null,null,null,1343,154,190,"TM 154","-","TM 190",0,":",3]
[null,null,null,null,null,null,1344,43,68,"TM 43","-","TM 68",5,":",1]
[null,null,null,null,null,null,1345,93,111,"TM 93","-","TM 111",0,":",4]
[null,null,null,null,null,null,1346,91,51,{"$f":"IFERROR(VLOOKUP($H1351,$B$6:$C$205,2,0),\"\")","v":"TM 91"},"-",{"$f":"IFERROR(VLOOKUP($I1351,$B$6:$C$205,2,0),\"\")","v":"TM 51"},5,":",2]
[null,null,null,null,null,null,1347,52,151,"TM 52","-","TM 151",3,":",1]
[null,null,null,null,null,null,1348,19,59,"Feyenoord Rotterdam","-","TM 59",0,":",3]
[null,null,null,null,null,null,1349,94,57,"TM 94","-","TM 57",9,":",2]
[null,null,null,null,null,null,1350,79,160,"TM 79","-","TM 160",2,":",1]
[null,null,null,null,null,null,1351,38,49,"FC Basel","-","TM 49",1,":",3]
[null,null,null,null,null,null,1352,69,17,"TM 69","-","Schachtjor Donezk",2,":",0]
[null,null,null,null,null,null,1353,137,34,"TM 137","-","Stade Brest",0,":",0]
[null,null,null,null,null,null,1354,184,150,"TM 184","-","TM 150",3,":",0]
[null,null,null,null,null,null,1355,170,27,"TM 170","-","Young Boys Bern",0,":",0]
[null,null,null,null,null,null,1356,87,168,"TM 87","-","TM 168",1,":",0]
[null,null,null,null,null,null,1357,86,84,"TM 86","-","TM 84",0,":",3]
[null,null,null,null,null,null,1358,82,133,"TM 82","-","TM 133",5,":",1]
[null,null,null,null,null,null,1359,173,96,"TM 173","-","TM 96",0,":",4]
[null,null,null,null,null,null,1360,41,157,"TM 41","-","TM 157",5,":",2]
[null,null,null,null,null,null,1361,182,32,"TM 182","-","VfB Stuttgart",3,":",1]
[null,null,null,null,null,null,1362,78,108,"TM 78","-","TM 108",0,":",3]
[null,null,null,null,null,null,1363,110,81,"TM 110","-","TM 81",9,":",2]
[null,null,null,null,null,null,1364,89,200,"TM 89","-","TM 200",3,":",1]
[null,null,null,null,null,null,1365,135,181,"TM 135","-","TM 181",1,":",3]
[null,null,null,null,null,null,1366,103,53,"TM 103","-","TM 53",2,":",0]
[null,null,null,null,null,null,1367,118,40,"TM 118","-","Hertha BSC",0,":",0]
[null,null,null,null,null,null,1368,180,105,"TM 180","-","TM 105",3,":",0]
[null,null,null,null,null,null,1369,85,4,"TM 85","-","Paris Saint-Germain",0,":",0]
[null,null,null,null,null,null,1370,66,61,"TM 66","-","TM 61",1,":",0]
[null,null,null,null,null,null,1371,179,122,"TM 179","-","TM 122",0,":",3]
[null,null,null,null,null,null,1372,74,138,"TM 74","-","TM 138",5,":",1]
[null,null,null,null,null,null,1373,3,14,"FC Bayern München","-","Benfica Lissabon",0,":",4]
[null,null,null,null,null,null,1374,65,127,"TM 65","-","TM 127",5,":",2]
[null,null,null,null,null,null,1375,152,71,"TM 152","-","TM 71",1,":",3]
[null,null,null,null,null,null,1376,101,126,"TM 101","-","TM 126",3,":",1]
[null,null,null,null,null,null,1377,144,106,"TM 144","-","TM 106",0,":",2]
[null,null,null,null,null,null,1378,128,9,"TM 128","-","FC Barcelona",0,":",0]
[null,null,null,null,null,null,1379,50,191,"TM 50","-","TM 191",0,":",3]
[null,null,null,null,null,null,1380,56,54,"TM 56","-","TM 54",0,":",0]
[null,null,null,null,null,null,1381,147,95,"TM 147","-","TM 95",0,":",1]
[null,null,null,null,null,null,1382,178,92,"TM 178","-","TM 92",3,":",0]
[null,null,null,null,null,null,1383,169,156,"TM 169","-","TM 156",1,":",5]
[null,null,null,null,null,null,1384,1,44,"Real Madrid","-","TM 44",4,":",0]
[null,null,null,null,null,null,1385,195,39,"TM 195","-","FC Lille",2,":",5]
[null,null,null,null,null,null,1386,64,148,"TM 64","-","TM 148",1,":",3]
[null,null,null,null,null,null,1387,62,55,"TM 62","-","TM 55",3,":",0]
[null,null,null,null,null,null,1388,141,42,"TM 141","-","TM 42",2,":",9]
[null,null,null,null,null,null,1389,11,18,"Atletico Madrid","-","AC Mailand",1,":",3]
[null,null,null,null,null,null,1390,8,112,"RB Leipzig","-","TM 112",3,":",1]
[null,null,null,null,null,null,1391,177,131,"TM 177","-","TM 131",0,":",2]
[null,null,null,null,null,null,1392,90,130,"TM 90","-","TM 130",0,":",0]
[null,null,null,null,null,null,1393,117,171,"TM 117","-","TM 171",0,":",3]
[null,null,null,null,null,null,1394,174,140,"TM 174","-","TM 140",0,":",0]
[null,null,null,null,null,null,1395,120,109,"TM 120","-","TM 109",0,":",1]
[null,null,null,null,null,null,1396,36,88,"Mainz 05","-","TM 88",3,":",0]
[null,null,null,null,null,null,1397,132,183,"TM 132","-","TM 183",1,":",5]
[null,null,null,null,null,null,1398,188,77,"TM 188","-","TM 77",4,":",0]
[null,null,null,null,null,null,1399,197,25,"TM 197","-","OSC Lille",2,":",5]
[null,null,null,null,null,null,1400,129,13,"TM 129","-","Juventus Turin",3,":",1]
[null,null,null,null,null,null,1401,176,164,"TM 176","-","TM 164",0,":",3]
[null,null,null,null,null,null,1402,163,165,"TM 163","-","TM 165",9,":",2]
[null,null,null,null,null,null,1403,167,159,"TM 167","-","TM 159",3,":",1]
[null,null,null,null,null,null,1404,161,20,"TM 161","-","Sporting Lissabon",1,":",3]
[null,null,null,null,null,null,1405,21,15,"PSV Eindhoven","-","FC Arsenal",2,":",0]
[null,null,null,null,null,null,1406,7,22,"Borussia Dortmund","-","Celtic Glasgow",0,":",0]
[null,null,null,null,null,null,1407,23,10,"Dinamo Zagreb","-","Bayer Leverkusen",3,":",0]
[null,null,null,null,null,null,1408,158,26,"TM 158","-","Roter Stern Belgrad",0,":",0]
[null,null,null,null,null,null,1409,28,6,"AS Monaco","-","Inter Mailand",1,":",0]
[null,null,null,null,null,null,1410,5,46,{"$f":"IFERROR(VLOOKUP($H1415,$B$6:$C$205,2,0),\"\")","v":"FC Liverpool"},"-",{"$f":"IFERROR(VLOOKUP($I1415,$B$6:$C$205,2,0),\"\")","v":"TM 46"},0,":",3]
[null,null,null,null,null,null,1411,30,45,"FC Bologna","-","TM 45",5,":",1]
[null,null,null,null,null,null,1412,2,31,"Manchester City","-","FC Girona",0,":",4]
[null,null,null,null,null,null,1413,33,145,"Sturm Graz","-","TM 145",5,":",2]
[null,null,null,null,null,null,1414,199,35,"TM 199","-","Eintracht Frankfurt",3,":",1]
[null,null,null,null,null,null,1415,47,143,"TM 47","-","TM 143",0,":",3]
[null,null,null,null,null,null,1416,134,58,"TM 134","-","TM 58",9,":",2]
[null,null,null,null,null,null,1417,104,125,"TM 104","-","TM 125",2,":",1]
[null,null,null,null,null,null,1418,121,175,"TM 121","-","TM 175",1,":",3]
[null,null,null,null,null,null,1419,76,99,"TM 76","-","TM 99",2,":",0]
[null,null,null,null,null,null,1420,98,12,"TM 98","-","Atalanta Bergamo",0,":",0]
[null,null,null,null,null,null,1421,124,149,"TM 124","-","TM 149",3,":",0]
[null,null,null,null,null,null,1422,198,119,"TM 198","-","TM 119",0,":",0]
[null,null,null,null,null,null,1423,80,196,"TM 80","-","TM 196",1,":",0]
[null,null,null,null,null,null,1424,194,146,"TM 194","-","TM 146",0,":",3]
[null,null,null,null,null,null,1425,139,29,"TM 139","-","Aston Villa",5,":",1]
[null,null,null,null,null,null,1426,193,72,"TM 193","-","TM 72",0,":",4]
[null,null,null,null,null,null,1427,73,97,"TM 73","-","TM 97",5,":",2]
[null,null,null,null,null,null,1428,142,63,"TM 142","-","TM 63",3,":",1]
[null,null,null,null,null,null,1429,153,116,"TM 153","-","TM 116",0,":",3]
[null,null,null,null,null,null,1430,24,189,"Red Bull Salzburg","-","TM 189",9,":",2]
[null,null,null,null,null,null,1431,102,166,"TM 102","-","TM 166",3,":",1]
[null,null,null,null,null,null,1432,37,83,"AC Roma","-","TM 83",1,":",3]
[null,null,null,null,null,null,1433,16,70,"FC Brügge","-","TM 70",2,":",0]
[null,null,null,null,null,null,1434,192,75,"TM 192","-","TM 75",0,":",0]
[null,null,null,null,null,null,1435,67,123,"TM 67","-","TM 123",3,":",0]
[null,null,null,null,null,null,1436,114,172,"TM 114","-","TM 172",0,":",0]
[null,null,null,null,null,null,1437,48,187,"TM 48","-","TM 187",1,":",0]
[null,null,null,null,null,null,1438,186,136,"TM 186","-","TM 136",0,":",3]
[null,null,null,null,null,null,1439,60,162,"TM 60","-","TM 162",5,":",1]
[null,null,null,null,null,null,1440,113,115,"TM 113","-","TM 115",0,":",4]
[null,null,null,null,null,null,1441,100,107,"TM 100","-","TM 107",5,":",2]
[null,null,null,null,null,null,1442,190,185,"TM 190","-","TM 185",1,":",3]
[null,null,null,null,null,null,1443,155,43,"TM 155","-","TM 43",3,":",1]
[null,null,null,null,null,null,1444,111,154,"TM 111","-","TM 154",0,":",2]
[null,null,null,null,null,null,1445,68,91,"TM 68","-","TM 91",0,":",0]
[null,null,null,null,null,null,1446,151,93,"TM 151","-","TM 93",0,":",3]
[null,null,null,null,null,null,1447,51,19,"TM 51","-","Feyenoord Rotterdam",0,":",0]
[null,null,null,null,null,null,1448,57,52,"TM 57","-","TM 52",0,":",1]
[null,null,null,null,null,null,1449,59,79,"TM 59","-","TM 79",3,":",0]
[null,null,null,null,null,null,1450,49,94,"TM 49","-","TM 94",1,":",5]
[null,null,null,null,null,null,1451,160,69,"TM 160","-","TM 69",4,":",0]
[null,null,null,null,null,null,1452,34,38,"Stade Brest","-","FC Basel",2,":",5]
[null,null,null,null,null,null,1453,17,184,"Schachtjor Donezk","-","TM 184",1,":",3]
[null,null,null,null,null,null,1454,27,137,"Young Boys Bern","-","TM 137",3,":",0]
[null,null,null,null,null,null,1455,150,87,"TM 150","-","TM 87",2,":",9]
[null,null,null,null,null,null,1456,84,170,"TM 84","-","TM 170",1,":",3]
[null,null,null,null,null,null,1457,168,82,"TM 168","-","TM 82",3,":",1]
[null,null,null,null,null,null,1458,96,86,"TM 96","-","TM 86",0,":",2]
[null,null,null,null,null,null,1459,133,41,"TM 133","-","TM 41",0,":",0]
[null,null,null,null,null,null,1460,32,173,"VfB Stuttgart","-","TM 173",0,":",3]
[null,null,null,null,null,null,1461,157,78,"TM 157","-","TM 78",0,":",0]
[null,null,null,null,null,null,1462,81,182,"TM 81","-","TM 182",0,":",1]
[null,null,null,null,null,null,1463,108,89,"TM 108","-","TM 89",3,":",0]
[null,null,null,null,null,null,1464,181,110,"TM 181","-","TM 110",1,":",5]
[null,null,null,null,null,null,1465,200,103,"TM 200","-","TM 103",4,":",0]
[null,null,null,null,null,null,1466,40,135,"Hertha BSC","-","TM 135",2,":",5]
[null,null,null,null,null,null,1467,53,180,"TM 53","-","TM 180",3,":",1]
[null,null,null,null,null,null,1468,4,118,"Paris Saint-Germain","-","TM 118",0,":",3]
[null,null,null,null,null,null,1469,105,66,"TM 105","-","TM 66",9,":",2]
[null,null,null,null,null,null,1470,122,85,"TM 122","-","TM 85",3,":",1]
[null,null,null,null,null,null,1471,61,74,"TM 61","-","TM 74",1,":",3]
[null,null,null,null,null,null,1472,14,179,"Benfica Lissabon","-","TM 179",2,":",0]
[null,null,null,null,null,null,1473,138,65,"TM 138","-","TM 65",0,":",0]
[null,null,null,null,null,null,1474,71,3,{"$f":"IFERROR(VLOOKUP($H1479,$B$6:$C$205,2,0),\"\")","v":"TM 71"},"-",{"$f":"IFERROR(VLOOKUP($I1479,$B$6:$C$205,2,0),\"\")","v":"FC Bayern München"},3,":",0]
[null,null,null,null,null,null,1475,127,101,"TM 127","-","TM 101",0,":",0]
[null,null,null,null,null,null,1476,106,152,"TM 106","-","TM 152",1,":",0]
[null,null,null,null,null,null,1477,126,128,"TM 126","-","TM 128",0,":",3]
[null,null,null,null,null,null,1478,191,144,"TM 191","-","TM 144",5,":",1]
[null,null,null,null,null,null,1479,9,56,"FC Barcelona","-","TM 56",0,":",4]
[null,null,null,null,null,null,1480,95,50,"TM 95","-","TM 50",5,":",2]
[null,null,null,null,null,null,1481,54,178,"TM 54","-","TM 178",3,":",1]
[null,null,null,null,null,null,1482,156,147,"TM 156","-","TM 147",0,":",3]
[null,null,null,null,null,null,1483,92,1,"TM 92","-","Real Madrid",9,":",2]
[null,null,null,null,null,null,1484,39,169,"FC Lille","-","TM 169",2,":",1]
[null,null,null,null,null,null,1485,44,64,"TM 44","-","TM 64",1,":",3]
[null,null,null,null,null,null,1486,55,195,"TM 55","-","TM 195",2,":",0]
[null,null,null,null,null,null,1487,148,141,"TM 148","-","TM 141",0,":",0]
[null,null,null,null,null,null,1488,18,62,"AC Mailand","-","TM 62",3,":",0]
[null,null,null,null,null,null,1489,42,8,"TM 42","-","RB Leipzig",0,":",0]
[null,null,null,null,null,null,1490,131,11,"TM 131","-","Atletico Madrid",1,":",0]
[null,null,null,null,null,null,1491,112,90,"TM 112","-","TM 90",0,":",3]
[null,null,null,null,null,null,1492,171,177,"TM 171","-","TM 177",5,":",1]
[null,null,null,null,null,null,1493,130,174,"TM 130","-","TM 174",0,":",4]
[null,null,null,null,null,null,1494,109,117,"TM 109","-","TM 117",5,":",2]
[null,null,null,null,null,null,1495,140,36,"TM 140","-","Mainz 05",3,":",1]
[null,null,null,null,null,null,1496,183,120,"TM 183","-","TM 120",0,":",3]
[null,null,null,null,null,null,1497,88,188,"TM 88","-","TM 188",9,":",2]
[null,null,null,null,null,null,1498,25,132,"OSC Lille","-","TM 132",3,":",1]
[null,null,null,null,null,null,1499,77,129,"TM 77","-","TM 129",1,":",3]
[null,null,null,null,null,null,1500,13,197,"Juventus Turin","-","TM 197",2,":",0]
[null,null,null,null,null,null,1501,163,176,"TM 163","-","TM 176",0,":",0]
[null,null,null,null,null,null,1502,159,164,"TM 159","-","TM 164",3,":",0]
[null,null,null,null,null,null,1503,165,161,"TM 165","-","TM 161",0,":",0]
[null,null,null,null,null,null,1504,15,167,"FC Arsenal","-","TM 167",1,":",0]
[null,null,null,null,null,null,1505,20,7,"Sporting Lissabon","-","Borussia Dortmund",0,":",3]
[null,null,null,null,null,null,1506,10,21,"Bayer Leverkusen","-","PSV Eindhoven",5,":",1]
[null,null,null,null,null,null,1507,22,158,"Celtic Glasgow","-","TM 158",0,":",4]
[null,null,null,null,null,null,1508,6,23,"Inter Mailand","-","Dinamo Zagreb",5,":",2]
[null,null,null,null,null,null,1509,26,5,"Roter Stern Belgrad","-","FC Liverpool",1,":",3]
[null,null,null,null,null,null,1510,45,28,"TM 45","-","AS Monaco",3,":",1]
[null,null,null,null,null,null,1511,46,2,"TM 46","-","Manchester City",0,":",2]
[null,null,null,null,null,null,1512,145,30,"TM 145","-","FC Bologna",0,":",0]
[null,null,null,null,null,null,1513,31,199,"FC Girona","-","TM 199",0,":",3]
[null,null,null,null,null,null,1514,143,33,"TM 143","-","Sturm Graz",0,":",0]
[null,null,null,null,null,null,1515,35,134,"Eintracht Frankfurt","-","TM 134",0,":",1]
[null,null,null,null,null,null,1516,125,47,"TM 125","-","TM 47",3,":",0]
[null,null,null,null,null,null,1517,58,121,"TM 58","-","TM 121",1,":",5]
[null,null,null,null,null,null,1518,99,104,"TM 99","-","TM 104",4,":",0]
[null,null,null,null,null,null,1519,175,98,"TM 175","-","TM 98",2,":",5]
[null,null,null,null,null,null,1520,149,76,"TM 149","-","TM 76",1,":",3]
[null,null,null,null,null,null,1521,12,198,"Atalanta Bergamo","-","TM 198",3,":",0]
[null,null,null,null,null,null,1522,196,124,"TM 196","-","TM 124",2,":",9]
[null,null,null,null,null,null,1523,119,194,"TM 119","-","TM 194",1,":",3]
[null,null,null,null,null,null,1524,29,80,"Aston Villa","-","TM 80",3,":",1]
[null,null,null,null,null,null,1525,146,193,"TM 146","-","TM 193",0,":",2]
[null,null,null,null,null,null,1526,97,139,"TM 97","-","TM 139",0,":",0]
[null,null,null,null,null,null,1527,72,142,"TM 72","-","TM 142",0,":",3]
[null,null,null,null,null,null,1528,116,73,"TM 116","-","TM 73",0,":",0]
[null,null,null,null,null,null,1529,63,24,"TM 63","-","Red Bull Salzburg",0,":",1]
[null,null,null,null,null,null,1530,166,153,"TM 166","-","TM 153",3,":",0]
[null,null,null,null,null,null,1531,189,37,"TM 189","-","AC Roma",1,":",5]
[null,null,null,null,null,null,1532,70,102,"TM 70","-","TM 102",4,":",0]
[null,null,null,null,null,null,1533,83,192,"TM 83","-","TM 192",2,":",5]
[null,null,null,null,null,null,1534,123,16,"TM 123","-","FC Brügge",3,":",1]
[null,null,null,null,null,null,1535,75,114,"TM 75","-","TM 114",0,":",3]
[null,null,null,null,null,null,1536,187,67,"TM 187","-","TM 67",9,":",2]
[null,null,null,null,null,null,1537,172,186,"TM 172","-","TM 186",3,":",1]
[null,null,null,null,null,null,1538,162,48,{"$f":"IFERROR(VLOOKUP($H1543,$B$6:$C$205,2,0),\"\")","v":"TM 162"},"-",{"$f":"IFERROR(VLOOKUP($I1543,$B$6:$C$205,2,0),\"\")","v":"TM 48"},1,":",3]
[null,null,null,null,null,null,1539,136,113,"TM 136","-","TM 113",2,":",0]
[null,null,null,null,null,null,1540,107,60,"TM 107","-","TM 60",0,":",0]
[null,null,null,null,null,null,1541,115,190,"TM 115","-","TM 190",3,":",0]
[null,null,null,null,null,null,1542,43,100,"TM 43","-","TM 100",0,":",0]
[null,null,null,null,null,null,1543,185,111,"TM 185","-","TM 111",1,":",0]
[null,null,null,null,null,null,1544,91,155,"TM 91","-","TM 155",0,":",3]
[null,null,null,null,null,null,1545,154,151,"TM 154","-","TM 151",5,":",1]
[null,null,null,null,null,null,1546,19,68,"Feyenoord Rotterdam","-","TM 68",0,":",4]
[null,null,null,null,null,null,1547,93,57,"TM 93","-","TM 57",5,":",2]
[null,null,null,null,null,null,1548,79,51,"TM 79","-","TM 51",3,":",1]
[null,null,null,null,null,null,1549,52,49,"TM 52","-","TM 49",0,":",3]
[null,null,null,null,null,null,1550,69,59,"TM 69","-","TM 59",9,":",2]
[null,null,null,null,null,null,1551,94,34,"TM 94","-","Stade Brest",2,":",1]
[null,null,null,null,null,null,1552,184,160,"TM 184","-","TM 160",1,":",3]
[null,null,null,null,null,null,1553,38,27,"FC Basel","-","Young Boys Bern",2,":",0]
[null,null,null,null,null,null,1554,87,17,"TM 87","-","Schachtjor Donezk",0,":",0]
[null,null,null,null,null,null,1555,137,84,"TM 137","-","TM 84",3,":",0]
[null,null,null,null,null,null,1556,82,150,"TM 82","-","TM 150",0,":",0]
[null,null,null,null,null,null,1557,170,96,"TM 170","-","TM 96",1,":",0]
[null,null,null,null,null,null,1558,41,168,"TM 41","-","TM 168",0,":",3]
[null,null,null,null,null,null,1559,86,32,"TM 86","-","VfB Stuttgart",5,":",1]
[null,null,null,null,null,null,1560,78,133,"TM 78","-","TM 133",0,":",4]
[null,null,null,null,null,null,1561,173,81,"TM 173","-","TM 81",5,":",2]
[null,null,null,null,null,null,1562,89,157,"TM 89","-","TM 157",3,":",1]
[null,null,null,null,null,null,1563,182,181,"TM 182","-","TM 181",0,":",3]
[null,null,null,null,null,null,1564,103,108,"TM 103","-","TM 108",9,":",2]
[null,null,null,null,null,null,1565,110,40,"TM 110","-","Hertha BSC",3,":",1]
[null,null,null,null,null,null,1566,180,200,"TM 180","-","TM 200",1,":",3]
[null,null,null,null,null,null,1567,135,4,"TM 135","-","Paris Saint-Germain",2,":",0]
[null,null,null,null,null,null,1568,66,53,"TM 66","-","TM 53",0,":",0]
[null,null,null,null,null,null,1569,118,122,"TM 118","-","TM 122",3,":",0]
[null,null,null,null,null,null,1570,74,105,"TM 74","-","TM 105",0,":",0]
[null,null,null,null,null,null,1571,85,14,"TM 85","-","Benfica Lissabon",1,":",0]
[null,null,null,null,null,null,1572,65,61,"TM 65","-","TM 61",0,":",3]
[null,null,null,null,null,null,1573,179,71,"TM 179","-","TM 71",5,":",1]
[null,null,null,null,null,null,1574,101,138,"TM 101","-","TM 138",0,":",4]
[null,null,null,null,null,null,1575,3,106,"FC Bayern München","-","TM 106",5,":",2]
[null,null,null,null,null,null,1576,128,127,"TM 128","-","TM 127",1,":",3]
[null,null,null,null,null,null,1577,152,191,"TM 152","-","TM 191",3,":",1]
[null,null,null,null,null,null,1578,56,126,"TM 56","-","TM 126",0,":",2]
[null,null,null,null,null,null,1579,144,95,"TM 144","-","TM 95",0,":",0]
[null,null,null,null,null,null,1580,178,9,"TM 178","-","FC Barcelona",0,":",3]
[null,null,null,null,null,null,1581,50,156,"TM 50","-","TM 156",0,":",0]
[null,null,null,null,null,null,1582,1,54,"Real Madrid","-","TM 54",0,":",1]
[null,null,null,null,null,null,1583,147,39,"TM 147","-","FC Lille",3,":",0]
[null,null,null,null,null,null,1584,64,92,"TM 64","-","TM 92",1,":",5]
[null,null,null,null,null,null,1585,169,55,"TM 169","-","TM 55",4,":",0]
[null,null,null,null,null,null,1586,141,44,"TM 141","-","TM 44",2,":",5]
[null,null,null,null,null,null,1587,195,18,"TM 195","-","AC Mailand",1,":",3]
[null,null,null,null,null,null,1588,8,148,"RB Leipzig","-","TM 148",3,":",0]
[null,null,null,null,null,null,1589,62,131,"TM 62","-","TM 131",2,":",9]
[null,null,null,null,null,null,1590,90,42,"TM 90","-","TM 42",1,":",3]
[null,null,null,null,null,null,1591,11,171,"Atletico Madrid","-","TM 171",3,":",1]
[null,null,null,null,null,null,1592,174,112,"TM 174","-","TM 112",0,":",2]
[null,null,null,null,null,null,1593,177,109,"TM 177","-","TM 109",null,":"]
[null,null,null,null,null,null,1594,36,130,"Mainz 05","-","TM 130",null,":"]
[null,null,null,null,null,null,1595,117,183,"TM 117","-","TM 183",null,":"]
[null,null,null,null,null,null,1596,188,140,"TM 188","-","TM 140",null,":"]
[null,null,null,null,null,null,1597,120,25,"TM 120","-","OSC Lille",null,":"]
[null,null,null,null,null,null,1598,129,88,"TM 129","-","TM 88",null,":"]
[null,null,null,null,null,null,1599,132,13,"TM 132","-","Juventus Turin",null,":"]
[null,null,null,null,null,null,1600,197,77,"TM 197","-","TM 77",null,":"]
[null,null,null,null,null,null,1601,176,159,"TM 176","-","TM 159",null,":"]
[null,null,null,null,null,null,1602,161,163,{"$f":"IFERROR(VLOOKUP($H1607,$B$6:$C$205,2,0),\"\")","v":"TM 161"},"-",{"$f":"IFERROR(VLOOKUP($I1607,$B$6:$C$205,2,0),\"\")","v":"TM 163"},null,":"]
[null,null,null,null,null,null,1603,164,15,"TM 164","-","FC Arsenal",null,":"]
[null,null,null,null,null,null,1604,7,165,"Borussia Dortmund","-","TM 165",null,":"]
[null,null,null,null,null,null,1605,167,10,"TM 167","-","Bayer Leverkusen",null,":"]
[null,null,null,null,null,null,1606,158,20,"TM 158","-","Sporting Lissabon",null,":"]
[null,null,null,null,null,null,1607,21,6,"PSV Eindhoven","-","Inter Mailand",null,":"]
[null,null,null,null,null,null,1608,5,22,"FC Liverpool","-","Celtic Glasgow",null,":"]
[null,null,null,null,null,null,1609,23,45,"Dinamo Zagreb","-","TM 45",null,":"]
[null,null,null,null,null,null,1610,2,26,"Manchester City","-","Roter Stern Belgrad",null,":"]
[null,null,null,null,null,null,1611,28,145,"AS Monaco","-","TM 145",null,":"]
[null,null,null,null,null,null,1612,199,46,"TM 199","-","TM 46",null,":"]
[null,null,null,null,null,null,1613,30,143,"FC Bologna","-","TM 143",null,":"]
[null,null,null,null,null,null,1614,134,31,"TM 134","-","FC Girona",null,":"]
[null,null,null,null,null,null,1615,33,125,"Sturm Graz","-","TM 125",null,":"]
[null,null,null,null,null,null,1616,121,35,"TM 121","-","Eintracht Frankfurt",null,":"]
[null,null,null,null,null,null,1617,47,99,"TM 47","-","TM 99",null,":"]
[null,null,null,null,null,null,1618,98,58,"TM 98","-","TM 58",null,":"]
[null,null,null,null,null,null,1619,104,149,"TM 104","-","TM 149",null,":"]
[null,null,null,null,null,null,1620,198,175,"TM 198","-","TM 175",null,":"]
[null,null,null,null,null,null,1621,76,196,"TM 76","-","TM 196",null,":"]
[null,null,null,null,null,null,1622,194,12,"TM 194","-","Atalanta Bergamo",null,":"]
[null,null,null,null,null,null,1623,124,29,"TM 124","-","Aston Villa",null,":"]
[null,null,null,null,null,null,1624,193,119,"TM 193","-","TM 119",null,":"]
[null,null,null,null,null,null,1625,80,97,"TM 80","-","TM 97",null,":"]
[null,null,null,null,null,null,1626,142,146,"TM 142","-","TM 146",null,":"]
[null,null,null,null,null,null,1627,139,116,"TM 139","-","TM 116",null,":"]
[null,null,null,null,null,null,1628,24,72,"Red Bull Salzburg","-","TM 72",null,":"]
[null,null,null,null,null,null,1629,73,166,"TM 73","-","TM 166",null,":"]
[null,null,null,null,null,null,1630,37,63,"AC Roma","-","TM 63",null,":"]
[null,null,null,null,null,null,1631,153,70,"TM 153","-","TM 70",null,":"]
[null,null,null,null,null,null,1632,192,189,"TM 192","-","TM 189",null,":"]
[null,null,null,null,null,null,1633,102,123,"TM 102","-","TM 123",null,":"]
[null,null,null,null,null,null,1634,114,83,"TM 114","-","TM 83",null,":"]
[null,null,null,null,null,null,1635,16,187,"FC Brügge","-","TM 187",null,":"]
[null,null,null,null,null,null,1636,186,75,"TM 186","-","TM 75",null,":"]
[null,null,null,null,null,null,1637,67,162,"TM 67","-","TM 162",null,":"]
[null,null,null,null,null,null,1638,113,172,"TM 113","-","TM 172",null,":"]
[null,null,null,null,null,null,1639,48,107,"TM 48","-","TM 107",null,":"]
[null,null,null,null,null,null,1640,190,136,"TM 190","-","TM 136",null,":"]
[null,null,null,null,null,null,1641,60,43,"TM 60","-","TM 43",null,":"]
[null,null,null,null,null,null,1642,111,115,"TM 111","-","TM 115",null,":"]
[null,null,null,null,null,null,1643,100,91,"TM 100","-","TM 91",null,":"]
[null,null,null,null,null,null,1644,151,185,"TM 151","-","TM 185",null,":"]
[null,null,null,null,null,null,1645,155,19,"TM 155","-","Feyenoord Rotterdam",null,":"]
[null,null,null,null,null,null,1646,57,154,"TM 57","-","TM 154",null,":"]
[null,null,null,null,null,null,1647,68,79,"TM 68","-","TM 79",null,":"]
[null,null,null,null,null,null,1648,49,93,"TM 49","-","TM 93",null,":"]
[null,null,null,null,null,null,1649,51,69,"TM 51","-","TM 69",null,":"]
[null,null,null,null,null,null,1650,34,52,"Stade Brest","-","TM 52",null,":"]
[null,null,null,null,null,null,1651,59,184,"TM 59","-","TM 184",null,":"]
[null,null,null,null,null,null,1652,27,94,"Young Boys Bern","-","TM 94",null,":"]
[null,null,null,null,null,null,1653,160,87,"TM 160","-","TM 87",null,":"]
[null,null,null,null,null,null,1654,84,38,"TM 84","-","FC Basel",null,":"]
[null,null,null,null,null,null,1655,17,82,"Schachtjor Donezk","-","TM 82",null,":"]
[null,null,null,null,null,null,1656,96,137,"TM 96","-","TM 137",null,":"]
[null,null,null,null,null,null,1657,150,41,"TM 150","-","TM 41",null,":"]
[null,null,null,null,null,null,1658,32,170,"VfB Stuttgart","-","TM 170",null,":"]
[null,null,null,null,null,null,1659,168,78,"TM 168","-","TM 78",null,":"]
[null,null,null,null,null,null,1660,81,86,"TM 81","-","TM 86",null,":"]
[null,null,null,null,null,null,1661,133,89,"TM 133","-","TM 89",null,":"]
[null,null,null,null,null,null,1662,181,173,"TM 181","-","TM 173",null,":"]
[null,null,null,null,null,null,1663,157,103,"TM 157","-","TM 103",null,":"]
[null,null,null,null,null,null,1664,40,182,"Hertha BSC","-","TM 182",null,":"]
[null,null,null,null,null,null,1665,108,180,"TM 108","-","TM 180",null,":"]
[null,null,null,null,null,null,1666,4,110,{"$f":"IFERROR(VLOOKUP($H1671,$B$6:$C$205,2,0),\"\")","v":"Paris Saint-Germain"},"-",{"$f":"IFERROR(VLOOKUP($I1671,$B$6:$C$205,2,0),\"\")","v":"TM 110"},null,":"]
[null,null,null,null,null,null,1667,200,66,"TM 200","-","TM 66",null,":"]
[null,null,null,null,null,null,1668,122,135,"TM 122","-","TM 135",null,":"]
[null,null,null,null,null,null,1669,53,74,"TM 53","-","TM 74",null,":"]
[null,null,null,null,null,null,1670,14,118,"Benfica Lissabon","-","TM 118",null,":"]
[null,null,null,null,null,null,1671,105,65,"TM 105","-","TM 65",null,":"]
[null,null,null,null,null,null,1672,71,85,"TM 71","-","TM 85",null,":"]
[null,null,null,null,null,null,1673,61,101,"TM 61","-","TM 101",null,":"]
[null,null,null,null,null,null,1674,106,179,"TM 106","-","TM 179",null,":"]
[null,null,null,null,null,null,1675,138,128,"TM 138","-","TM 128",null,":"]
[null,null,null,null,null,null,1676,191,3,"TM 191","-","FC Bayern München",null,":"]
[null,null,null,null,null,null,1677,127,56,"TM 127","-","TM 56",null,":"]
[null,null,null,null,null,null,1678,95,152,"TM 95","-","TM 152",null,":"]
[null,null,null,null,null,null,1679,126,178,"TM 126","-","TM 178",null,":"]
[null,null,null,null,null,null,1680,156,144,"TM 156","-","TM 144",null,":"]
[null,null,null,null,null,null,1681,9,1,"FC Barcelona","-","Real Madrid",null,":"]
[null,null,null,null,null,null,1682,39,50,"FC Lille","-","TM 50",null,":"]
[null,null,null,null,null,null,1683,54,64,"TM 54","-","TM 64",null,":"]
[null,null,null,null,null,null,1684,55,147,"TM 55","-","TM 147",null,":"]
[null,null,null,null,null,null,1685,92,141,"TM 92","-","TM 141",null,":"]
[null,null,null,null,null,null,1686,18,169,"AC Mailand","-","TM 169",null,":"]
[null,null,null,null,null,null,1687,44,8,"TM 44","-","RB Leipzig",null,":"]
[null,null,null,null,null,null,1688,131,195,"TM 131","-","TM 195",null,":"]
[null,null,null,null,null,null,1689,148,90,"TM 148","-","TM 90",null,":"]
[null,null,null,null,null,null,1690,171,62,"TM 171","-","TM 62",null,":"]
[null,null,null,null,null,null,1691,42,174,"TM 42","-","TM 174",null,":"]
[null,null,null,null,null,null,1692,109,11,"TM 109","-","Atletico Madrid",null,":"]
[null,null,null,null,null,null,1693,112,36,"TM 112","-","Mainz 05",null,":"]
[null,null,null,null,null,null,1694,183,177,"TM 183","-","TM 177",null,":"]
[null,null,null,null,null,null,1695,130,188,"TM 130","-","TM 188",null,":"]
[null,null,null,null,null,null,1696,25,117,"OSC Lille","-","TM 117",null,":"]
[null,null,null,null,null,null,1697,140,129,"TM 140","-","TM 129",null,":"]
[null,null,null,null,null,null,1698,13,120,"Juventus Turin","-","TM 120",null,":"]
[null,null,null,null,null,null,1699,88,197,"TM 88","-","TM 197",null,":"]
[null,null,null,null,null,null,1700,77,132,"TM 77","-","TM 132",null,":"]
[null,null,null,null,null,null,1701,161,176,"TM 161","-","TM 176",null,":"]
[null,null,null,null,null,null,1702,15,159,"FC Arsenal","-","TM 159",null,":"]
[null,null,null,null,null,null,1703,163,7,"TM 163","-","Borussia Dortmund",null,":"]
[null,null,null,null,null,null,1704,10,164,"Bayer Leverkusen","-","TM 164",null,":"]
[null,null,null,null,null,null,1705,165,158,"TM 165","-","TM 158",null,":"]
[null,null,null,null,null,null,1706,6,167,"Inter Mailand","-","TM 167",null,":"]
[null,null,null,null,null,null,1707,20,5,"Sporting Lissabon","-","FC Liverpool",null,":"]
[null,null,null,null,null,null,1708,45,21,"TM 45","-","PSV Eindhoven",null,":"]
[null,null,null,null,null,null,1709,22,2,"Celtic Glasgow","-","Manchester City",null,":"]
[null,null,null,null,null,null,1710,145,23,"TM 145","-","Dinamo Zagreb",null,":"]
[null,null,null,null,null,null,1711,26,199,"Roter Stern Belgrad","-","TM 199",null,":"]
[null,null,null,null,null,null,1712,143,28,"TM 143","-","AS Monaco",null,":"]
[null,null,null,null,null,null,1713,46,134,"TM 46","-","TM 134",null,":"]
[null,null,null,null,null,null,1714,125,30,"TM 125","-","FC Bologna",null,":"]
[null,null,null,null,null,null,1715,31,121,"FC Girona","-","TM 121",null,":"]
[null,null,null,null,null,null,1716,99,33,"TM 99","-","Sturm Graz",null,":"]
[null,null,null,null,null,null,1717,35,98,"Eintracht Frankfurt","-","TM 98",null,":"]
[null,null,null,null,null,null,1718,149,47,"TM 149","-","TM 47",null,":"]
[null,null,null,null,null,null,1719,58,198,"TM 58","-","TM 198",null,":"]
[null,null,null,null,null,null,1720,196,104,"TM 196","-","TM 104",null,":"]
[null,null,null,null,null,null,1721,175,194,"TM 175","-","TM 194",null,":"]
[null,null,null,null,null,null,1722,29,76,"Aston Villa","-","TM 76",null,":"]
[null,null,null,null,null,null,1723,12,193,"Atalanta Bergamo","-","TM 193",null,":"]
[null,null,null,null,null,null,1724,97,124,"TM 97","-","TM 124",null,":"]
[null,null,null,null,null,null,1725,119,142,"TM 119","-","TM 142",null,":"]
[null,null,null,null,null,null,1726,116,80,"TM 116","-","TM 80",null,":"]
[null,null,null,null,null,null,1727,146,24,"TM 146","-","Red Bull Salzburg",null,":"]
[null,null,null,null,null,null,1728,166,139,"TM 166","-","TM 139",null,":"]
[null,null,null,null,null,null,1729,72,37,"TM 72","-","AC Roma",null,":"]
[null,null,null,null,null,null,1730,70,73,{"$f":"IFERROR(VLOOKUP($H1735,$B$6:$C$205,2,0),\"\")","v":"TM 70"},"-",{"$f":"IFERROR(VLOOKUP($I1735,$B$6:$C$205,2,0),\"\")","v":"TM 73"},null,":"]
[null,null,null,null,null,null,1731,63,192,"TM 63","-","TM 192",null,":"]
[null,null,null,null,null,null,1732,123,153,"TM 123","-","TM 153",null,":"]
[null,null,null,null,null,null,1733,189,114,"TM 189","-","TM 114",null,":"]
[null,null,null,null,null,null,1734,187,102,"TM 187","-","TM 102",null,":"]
[null,null,null,null,null,null,1735,83,186,"TM 83","-","TM 186",null,":"]
[null,null,null,null,null,null,1736,162,16,"TM 162","-","FC Brügge",null,":"]
[null,null,null,null,null,null,1737,75,113,"TM 75","-","TM 113",null,":"]
[null,null,null,null,null,null,1738,107,67,"TM 107","-","TM 67",null,":"]
[null,null,null,null,null,null,1739,172,190,"TM 172","-","TM 190",null,":"]
[null,null,null,null,null,null,1740,43,48,"TM 43","-","TM 48",null,":"]
[null,null,null,null,null,null,1741,136,111,"TM 136","-","TM 111",null,":"]
[null,null,null,null,null,null,1742,91,60,"TM 91","-","TM 60",null,":"]
[null,null,null,null,null,null,1743,115,151,"TM 115","-","TM 151",null,":"]
[null,null,null,null,null,null,1744,19,100,"Feyenoord Rotterdam","-","TM 100",null,":"]
[null,null,null,null,null,null,1745,185,57,"TM 185","-","TM 57",null,":"]
[null,null,null,null,null,null,1746,79,155,"TM 79","-","TM 155",null,":"]
[null,null,null,null,null,null,1747,154,49,"TM 154","-","TM 49",null,":"]
[null,null,null,null,null,null,1748,69,68,"TM 69","-","TM 68",null,":"]
[null,null,null,null,null,null,1749,93,34,"TM 93","-","Stade Brest",null,":"]
[null,null,null,null,null,null,1750,184,51,"TM 184","-","TM 51",null,":"]
[null,null,null,null,null,null,1751,52,27,"TM 52","-","Young Boys Bern",null,":"]
[null,null,null,null,null,null,1752,87,59,"TM 87","-","TM 59",null,":"]
[null,null,null,null,null,null,1753,94,84,"TM 94","-","TM 84",null,":"]
[null,null,null,null,null,null,1754,82,160,"TM 82","-","TM 160",null,":"]
[null,null,null,null,null,null,1755,38,96,"FC Basel","-","TM 96",null,":"]
[null,null,null,null,null,null,1756,41,17,"TM 41","-","Schachtjor Donezk",null,":"]
[null,null,null,null,null,null,1757,137,32,"TM 137","-","VfB Stuttgart",null,":"]
[null,null,null,null,null,null,1758,78,150,"TM 78","-","TM 150",null,":"]
[null,null,null,null,null,null,1759,170,81,"TM 170","-","TM 81",null,":"]
[null,null,null,null,null,null,1760,89,168,"TM 89","-","TM 168",null,":"]
[null,null,null,null,null,null,1761,86,181,"TM 86","-","TM 181",null,":"]
[null,null,null,null,null,null,1762,103,133,"TM 103","-","TM 133",null,":"]
[null,null,null,null,null,null,1763,173,40,"TM 173","-","Hertha BSC",null,":"]
[null,null,null,null,null,null,1764,180,157,"TM 180","-","TM 157",null,":"]
[null,null,null,null,null,null,1765,182,4,"TM 182","-","Paris Saint-Germain",null,":"]
[null,null,null,null,null,null,1766,66,108,"TM 66","-","TM 108",null,":"]
[null,null,null,null,null,null,1767,110,122,"TM 110","-","TM 122",null,":"]
[null,null,null,null,null,null,1768,74,200,"TM 74","-","TM 200",null,":"]
[null,null,null,null,null,null,1769,135,14,"TM 135","-","Benfica Lissabon",null,":"]
[null,null,null,null,null,null,1770,65,53,"TM 65","-","TM 53",null,":"]
[null,null,null,null,null,null,1771,118,71,"TM 118","-","TM 71",null,":"]
[null,null,null,null,null,null,1772,101,105,"TM 101","-","TM 105",null,":"]
[null,null,null,null,null,null,1773,85,106,"TM 85","-","TM 106",null,":"]
[null,null,null,null,null,null,1774,128,61,"TM 128","-","TM 61",null,":"]
[null,null,null,null,null,null,1775,179,191,"TM 179","-","TM 191",null,":"]
[null,null,null,null,null,null,1776,56,138,"TM 56","-","TM 138",null,":"]
[null,null,null,null,null,null,1777,3,95,"FC Bayern München","-","TM 95",null,":"]
[null,null,null,null,null,null,1778,178,127,"TM 178","-","TM 127",null,":"]
[null,null,null,null,null,null,1779,152,156,"TM 152","-","TM 156",null,":"]
[null,null,null,null,null,null,1780,1,126,"Real Madrid","-","TM 126",null,":"]
[null,null,null,null,null,null,1781,144,39,"TM 144","-","FC Lille",null,":"]
[null,null,null,null,null,null,1782,64,9,"TM 64","-","FC Barcelona",null,":"]
[null,null,null,null,null,null,1783,50,55,"TM 50","-","TM 55",null,":"]
[null,null,null,null,null,null,1784,141,54,"TM 141","-","TM 54",null,":"]
[null,null,null,null,null,null,1785,147,18,"TM 147","-","AC Mailand",null,":"]
[null,null,null,null,null,null,1786,8,92,"RB Leipzig","-","TM 92",null,":"]
[null,null,null,null,null,null,1787,169,131,"TM 169","-","TM 131",null,":"]
[null,null,null,null,null,null,1788,90,44,"TM 90","-","TM 44",null,":"]
[null,null,null,null,null,null,1789,195,171,"TM 195","-","TM 171",null,":"]
[null,null,null,null,null,null,1790,174,148,"TM 174","-","TM 148",null,":"]
[null,null,null,null,null,null,1791,62,109,"TM 62","-","TM 109",null,":"]
[null,null,null,null,null,null,1792,36,42,"Mainz 05","-","TM 42",null,":"]
[null,null,null,null,null,null,1793,11,183,"Atletico Madrid","-","TM 183",null,":"]
[null,null,null,null,null,null,1794,188,112,{"$f":"IFERROR(VLOOKUP($H1799,$B$6:$C$205,2,0),\"\")","v":"TM 188"},"-",{"$f":"IFERROR(VLOOKUP($I1799,$B$6:$C$205,2,0),\"\")","v":"TM 112"},null,":"]
[null,null,null,null,null,null,1795,177,25,"TM 177","-","OSC Lille",null,":"]
[null,null,null,null,null,null,1796,129,130,"TM 129","-","TM 130",null,":"]
[null,null,null,null,null,null,1797,117,13,"TM 117","-","Juventus Turin",null,":"]
[null,null,null,null,null,null,1798,197,140,"TM 197","-","TM 140",null,":"]
[null,null,null,null,null,null,1799,120,77,"TM 120","-","TM 77",null,":"]
[null,null,null,null,null,null,1800,132,88,"TM 132","-","TM 88",null,":"]
[null,null,null,null,null,null,1801,176,15,"TM 176","-","FC Arsenal",null,":"]
[null,null,null,null,null,null,1802,7,161,"Borussia Dortmund","-","TM 161",null,":"]
[null,null,null,null,null,null,1803,159,10,"TM 159","-","Bayer Leverkusen",null,":"]
[null,null,null,null,null,null,1804,158,163,"TM 158","-","TM 163",null,":"]
[null,null,null,null,null,null,1805,164,6,"TM 164","-","Inter Mailand",null,":"]
[null,null,null,null,null,null,1806,5,165,"FC Liverpool","-","TM 165",null,":"]
[null,null,null,null,null,null,1807,167,45,"TM 167","-","TM 45",null,":"]
[null,null,null,null,null,null,1808,2,20,"Manchester City","-","Sporting Lissabon",null,":"]
[null,null,null,null,null,null,1809,21,145,"PSV Eindhoven","-","TM 145",null,":"]
[null,null,null,null,null,null,1810,199,22,"TM 199","-","Celtic Glasgow",null,":"]
[null,null,null,null,null,null,1811,23,143,"Dinamo Zagreb","-","TM 143",null,":"]
[null,null,null,null,null,null,1812,134,26,"TM 134","-","Roter Stern Belgrad",null,":"]
[null,null,null,null,null,null,1813,28,125,"AS Monaco","-","TM 125",null,":"]
[null,null,null,null,null,null,1814,121,46,"TM 121","-","TM 46",null,":"]
[null,null,null,null,null,null,1815,30,99,"FC Bologna","-","TM 99",null,":"]
[null,null,null,null,null,null,1816,98,31,"TM 98","-","FC Girona",null,":"]
[null,null,null,null,null,null,1817,33,149,"Sturm Graz","-","TM 149",null,":"]
[null,null,null,null,null,null,1818,198,35,"TM 198","-","Eintracht Frankfurt",null,":"]
[null,null,null,null,null,null,1819,47,196,"TM 47","-","TM 196",null,":"]
[null,null,null,null,null,null,1820,194,58,"TM 194","-","TM 58",null,":"]
[null,null,null,null,null,null,1821,104,29,"TM 104","-","Aston Villa",null,":"]
[null,null,null,null,null,null,1822,193,175,"TM 193","-","TM 175",null,":"]
[null,null,null,null,null,null,1823,76,97,"TM 76","-","TM 97",null,":"]
[null,null,null,null,null,null,1824,142,12,"TM 142","-","Atalanta Bergamo",null,":"]
[null,null,null,null,null,null,1825,124,116,"TM 124","-","TM 116",null,":"]
[null,null,null,null,null,null,1826,24,119,"Red Bull Salzburg","-","TM 119",null,":"]
[null,null,null,null,null,null,1827,80,166,"TM 80","-","TM 166",null,":"]
[null,null,null,null,null,null,1828,37,146,"AC Roma","-","TM 146",null,":"]
[null,null,null,null,null,null,1829,139,70,"TM 139","-","TM 70",null,":"]
[null,null,null,null,null,null,1830,192,72,"TM 192","-","TM 72",null,":"]
[null,null,null,null,null,null,1831,73,123,"TM 73","-","TM 123",null,":"]
[null,null,null,null,null,null,1832,114,63,"TM 114","-","TM 63",null,":"]
[null,null,null,null,null,null,1833,153,187,"TM 153","-","TM 187",null,":"]
[null,null,null,null,null,null,1834,186,189,"TM 186","-","TM 189",null,":"]
[null,null,null,null,null,null,1835,102,162,"TM 102","-","TM 162",null,":"]
[null,null,null,null,null,null,1836,113,83,"TM 113","-","TM 83",null,":"]
[null,null,null,null,null,null,1837,16,107,"FC Brügge","-","TM 107",null,":"]
[null,null,null,null,null,null,1838,190,75,"TM 190","-","TM 75",null,":"]
[null,null,null,null,null,null,1839,67,43,"TM 67","-","TM 43",null,":"]
[null,null,null,null,null,null,1840,111,172,"TM 111","-","TM 172",null,":"]
[null,null,null,null,null,null,1841,48,91,"TM 48","-","TM 91",null,":"]
[null,null,null,null,null,null,1842,151,136,"TM 151","-","TM 136",null,":"]
[null,null,null,null,null,null,1843,60,19,"TM 60","-","Feyenoord Rotterdam",null,":"]
[null,null,null,null,null,null,1844,57,115,"TM 57","-","TM 115",null,":"]
[null,null,null,null,null,null,1845,100,79,"TM 100","-","TM 79",null,":"]
[null,null,null,null,null,null,1846,49,185,"TM 49","-","TM 185",null,":"]
[null,null,null,null,null,null,1847,155,69,"TM 155","-","TM 69",null,":"]
[null,null,null,null,null,null,1848,34,154,"Stade Brest","-","TM 154",null,":"]
[null,null,null,null,null,null,1849,68,184,"TM 68","-","TM 184",null,":"]
[null,null,null,null,null,null,1850,27,93,"Young Boys Bern","-","TM 93",null,":"]
[null,null,null,null,null,null,1851,51,87,"TM 51","-","TM 87",null,":"]
[null,null,null,null,null,null,1852,84,52,"TM 84","-","TM 52",null,":"]
[null,null,null,null,null,null,1853,59,82,"TM 59","-","TM 82",null,":"]
[null,null,null,null,null,null,1854,96,94,"TM 96","-","TM 94",null,":"]
[null,null,null,null,null,null,1855,160,41,"TM 160","-","TM 41",null,":"]
[null,null,null,null,null,null,1856,32,38,"VfB Stuttgart","-","FC Basel",null,":"]
[null,null,null,null,null,null,1857,17,78,"Schachtjor Donezk","-","TM 78",null,":"]
[null,null,null,null,null,null,1858,81,137,{"$f":"IFERROR(VLOOKUP($H1863,$B$6:$C$205,2,0),\"\")","v":"TM 81"},"-",{"$f":"IFERROR(VLOOKUP($I1863,$B$6:$C$205,2,0),\"\")","v":"TM 137"},null,":"]
[null,null,null,null,null,null,1859,150,89,"TM 150","-","TM 89",null,":"]
[null,null,null,null,null,null,1860,181,170,"TM 181","-","TM 170",null,":"]
[null,null,null,null,null,null,1861,168,103,"TM 168","-","TM 103",null,":"]
[null,null,null,null,null,null,1862,40,86,"Hertha BSC","-","TM 86",null,":"]
[null,null,null,null,null,null,1863,133,180,"TM 133","-","TM 180",null,":"]
[null,null,null,null,null,null,1864,4,173,"Paris Saint-Germain","-","TM 173",null,":"]
[null,null,null,null,null,null,1865,157,66,"TM 157","-","TM 66",null,":"]
[null,null,null,null,null,null,1866,122,182,"TM 122","-","TM 182",null,":"]
[null,null,null,null,null,null,1867,108,74,"TM 108","-","TM 74",null,":"]
[null,null,null,null,null,null,1868,14,110,"Benfica Lissabon","-","TM 110",null,":"]
[null,null,null,null,null,null,1869,200,65,"TM 200","-","TM 65",null,":"]
[null,null,null,null,null,null,1870,71,135,"TM 71","-","TM 135",null,":"]
[null,null,null,null,null,null,1871,53,101,"TM 53","-","TM 101",null,":"]
[null,null,null,null,null,null,1872,106,118,"TM 106","-","TM 118",null,":"]
[null,null,null,null,null,null,1873,105,128,"TM 105","-","TM 128",null,":"]
[null,null,null,null,null,null,1874,191,85,"TM 191","-","TM 85",null,":"]
[null,null,null,null,null,null,1875,61,56,"TM 61","-","TM 56",null,":"]
[null,null,null,null,null,null,1876,95,179,"TM 95","-","TM 179",null,":"]
[null,null,null,null,null,null,1877,138,178,"TM 138","-","TM 178",null,":"]
[null,null,null,null,null,null,1878,156,3,"TM 156","-","FC Bayern München",null,":"]
[null,null,null,null,null,null,1879,127,1,"TM 127","-","Real Madrid",null,":"]
[null,null,null,null,null,null,1880,39,152,"FC Lille","-","TM 152",null,":"]
[null,null,null,null,null,null,1881,126,64,"TM 126","-","TM 64",null,":"]
[null,null,null,null,null,null,1882,55,144,"TM 55","-","TM 144",null,":"]
[null,null,null,null,null,null,1883,9,141,"FC Barcelona","-","TM 141",null,":"]
[null,null,null,null,null,null,1884,18,50,"AC Mailand","-","TM 50",null,":"]
[null,null,null,null,null,null,1885,54,8,"TM 54","-","RB Leipzig",null,":"]
[null,null,null,null,null,null,1886,131,147,"TM 131","-","TM 147",null,":"]
[null,null,null,null,null,null,1887,92,90,"TM 92","-","TM 90",null,":"]
[null,null,null,null,null,null,1888,171,169,"TM 171","-","TM 169",null,":"]
[null,null,null,null,null,null,1889,44,174,"TM 44","-","TM 174",null,":"]
[null,null,null,null,null,null,1890,109,195,"TM 109","-","TM 195",null,":"]
[null,null,null,null,null,null,1891,148,36,"TM 148","-","Mainz 05",null,":"]
[null,null,null,null,null,null,1892,183,62,"TM 183","-","TM 62",null,":"]
[null,null,null,null,null,null,1893,42,188,"TM 42","-","TM 188",null,":"]
[null,null,null,null,null,null,1894,25,11,"OSC Lille","-","Atletico Madrid",null,":"]
[null,null,null,null,null,null,1895,112,129,"TM 112","-","TM 129",null,":"]
[null,null,null,null,null,null,1896,13,177,"Juventus Turin","-","TM 177",null,":"]
[null,null,null,null,null,null,1897,130,197,"TM 130","-","TM 197",null,":"]
[null,null,null,null,null,null,1898,77,117,"TM 77","-","TM 117",null,":"]
[null,null,null,null,null,null,1899,140,132,"TM 140","-","TM 132",null,":"]
[null,null,null,null,null,null,1900,88,120,"TM 88","-","TM 120",null,":"]
[null,null,null,null,null,null,1901,7,176,"Borussia Dortmund","-","TM 176",null,":"]
[null,null,null,null,null,null,1902,10,15,"Bayer Leverkusen","-","FC Arsenal",null,":"]
[null,null,null,null,null,null,1903,161,158,"TM 161","-","TM 158",null,":"]
[null,null,null,null,null,null,1904,6,159,"Inter Mailand","-","TM 159",null,":"]
[null,null,null,null,null,null,1905,163,5,"TM 163","-","FC Liverpool",null,":"]
[null,null,null,null,null,null,1906,45,164,"TM 45","-","TM 164",null,":"]
[null,null,null,null,null,null,1907,165,2,"TM 165","-","Manchester City",null,":"]
[null,null,null,null,null,null,1908,145,167,"TM 145","-","TM 167",null,":"]
[null,null,null,null,null,null,1909,20,199,"Sporting Lissabon","-","TM 199",null,":"]
[null,null,null,null,null,null,1910,143,21,"TM 143","-","PSV Eindhoven",null,":"]
[null,null,null,null,null,null,1911,22,134,"Celtic Glasgow","-","TM 134",null,":"]
[null,null,null,null,null,null,1912,125,23,"TM 125","-","Dinamo Zagreb",null,":"]
[null,null,null,null,null,null,1913,26,121,"Roter Stern Belgrad","-","TM 121",null,":"]
[null,null,null,null,null,null,1914,99,28,"TM 99","-","AS Monaco",null,":"]
[null,null,null,null,null,null,1915,46,98,"TM 46","-","TM 98",null,":"]
[null,null,null,null,null,null,1916,149,30,"TM 149","-","FC Bologna",null,":"]
[null,null,null,null,null,null,1917,31,198,"FC Girona","-","TM 198",null,":"]
[null,null,null,null,null,null,1918,196,33,"TM 196","-","Sturm Graz",null,":"]
[null,null,null,null,null,null,1919,35,194,"Eintracht Frankfurt","-","TM 194",null,":"]
[null,null,null,null,null,null,1920,29,47,"Aston Villa","-","TM 47",null,":"]
[null,null,null,null,null,null,1921,58,193,"TM 58","-","TM 193",null,":"]
[null,null,null,null,null,null,1922,97,104,{"$f":"IFERROR(VLOOKUP($H1927,$B$6:$C$205,2,0),\"\")","v":"TM 97"},"-",{"$f":"IFERROR(VLOOKUP($I1927,$B$6:$C$205,2,0),\"\")","v":"TM 104"},null,":"]
[null,null,null,null,null,null,1923,175,142,"TM 175","-","TM 142",null,":"]
[null,null,null,null,null,null,1924,116,76,"TM 116","-","TM 76",null,":"]
[null,null,null,null,null,null,1925,12,24,"Atalanta Bergamo","-","Red Bull Salzburg",null,":"]
[null,null,null,null,null,null,1926,166,124,"TM 166","-","TM 124",null,":"]
[null,null,null,null,null,null,1927,119,37,"TM 119","-","AC Roma",null,":"]
[null,null,null,null,null,null,1928,70,80,"TM 70","-","TM 80",null,":"]
[null,null,null,null,null,null,1929,146,192,"TM 146","-","TM 192",null,":"]
[null,null,null,null,null,null,1930,123,139,"TM 123","-","TM 139",null,":"]
[null,null,null,null,null,null,1931,72,114,"TM 72","-","TM 114",null,":"]
[null,null,null,null,null,null,1932,187,73,"TM 187","-","TM 73",null,":"]
[null,null,null,null,null,null,1933,63,186,"TM 63","-","TM 186",null,":"]
[null,null,null,null,null,null,1934,162,153,"TM 162","-","TM 153",null,":"]
[null,null,null,null,null,null,1935,189,113,"TM 189","-","TM 113",null,":"]
[null,null,null,null,null,null,1936,107,102,"TM 107","-","TM 102",null,":"]
[null,null,null,null,null,null,1937,83,190,"TM 83","-","TM 190",null,":"]
[null,null,null,null,null,null,1938,43,16,"TM 43","-","FC Brügge",null,":"]
[null,null,null,null,null,null,1939,75,111,"TM 75","-","TM 111",null,":"]
[null,null,null,null,null,null,1940,91,67,"TM 91","-","TM 67",null,":"]
[null,null,null,null,null,null,1941,172,151,"TM 172","-","TM 151",null,":"]
[null,null,null,null,null,null,1942,19,48,"Feyenoord Rotterdam","-","TM 48",null,":"]
[null,null,null,null,null,null,1943,136,57,"TM 136","-","TM 57",null,":"]
[null,null,null,null,null,null,1944,79,60,"TM 79","-","TM 60",null,":"]
[null,null,null,null,null,null,1945,115,49,"TM 115","-","TM 49",null,":"]
[null,null,null,null,null,null,1946,69,100,"TM 69","-","TM 100",null,":"]
[null,null,null,null,null,null,1947,185,34,"TM 185","-","Stade Brest",null,":"]
[null,null,null,null,null,null,1948,184,155,"TM 184","-","TM 155",null,":"]
[null,null,null,null,null,null,1949,154,27,"TM 154","-","Young Boys Bern",null,":"]
[null,null,null,null,null,null,1950,87,68,"TM 87","-","TM 68",null,":"]
[null,null,null,null,null,null,1951,93,84,"TM 93","-","TM 84",null,":"]
[null,null,null,null,null,null,1952,82,51,"TM 82","-","TM 51",null,":"]
[null,null,null,null,null,null,1953,52,96,"TM 52","-","TM 96",null,":"]
[null,null,null,null,null,null,1954,41,59,"TM 41","-","TM 59",null,":"]
[null,null,null,null,null,null,1955,94,32,"TM 94","-","VfB Stuttgart",null,":"]
[null,null,null,null,null,null,1956,78,160,"TM 78","-","TM 160",null,":"]
[null,null,null,null,null,null,1957,38,81,"FC Basel","-","TM 81",null,":"]
[null,null,null,null,null,null,1958,89,17,"TM 89","-","Schachtjor Donezk",null,":"]
[null,null,null,null,null,null,1959,137,181,"TM 137","-","TM 181",null,":"]
[null,null,null,null,null,null,1960,103,150,"TM 103","-","TM 150",null,":"]
[null,null,null,null,null,null,1961,170,40,"TM 170","-","Hertha BSC",null,":"]
[null,null,null,null,null,null,1962,180,168,"TM 180","-","TM 168",null,":"]
[null,null,null,null,null,null,1963,86,4,"TM 86","-","Paris Saint-Germain",null,":"]
[null,null,null,null,null,null,1964,66,133,"TM 66","-","TM 133",null,":"]
[null,null,null,null,null,null,1965,173,122,"TM 173","-","TM 122",null,":"]
[null,null,null,null,null,null,1966,74,157,"TM 74","-","TM 157",null,":"]
[null,null,null,null,null,null,1967,182,14,"TM 182","-","Benfica Lissabon",null,":"]
[null,null,null,null,null,null,1968,65,108,"TM 65","-","TM 108",null,":"]
[null,null,null,null,null,null,1969,110,71,"TM 110","-","TM 71",null,":"]
[null,null,null,null,null,null,1970,101,200,"TM 101","-","TM 200",null,":"]
[null,null,null,null,null,null,1971,135,106,"TM 135","-","TM 106",null,":"]
[null,null,null,null,null,null,1972,128,53,"TM 128","-","TM 53",null,":"]
[null,null,null,null,null,null,1973,118,191,"TM 118","-","TM 191",null,":"]
[null,null,null,null,null,null,1974,56,105,"TM 56","-","TM 105",null,":"]
[null,null,null,null,null,null,1975,85,95,"TM 85","-","TM 95",null,":"]
[null,null,null,null,null,null,1976,178,61,"TM 178","-","TM 61",null,":"]
[null,null,null,null,null,null,1977,179,156,"TM 179","-","TM 156",null,":"]
[null,null,null,null,null,null,1978,1,138,"Real Madrid","-","TM 138",null,":"]
[null,null,null,null,null,null,1979,3,39,"FC Bayern München","-","FC Lille",null,":"]
[null,null,null,null,null,null,1980,64,127,"TM 64","-","TM 127",null,":"]
[null,null,null,null,null,null,1981,152,55,"TM 152","-","TM 55",null,":"]
[null,null,null,null,null,null,1982,141,126,"TM 141","-","TM 126",null,":"]
[null,null,null,null,null,null,1983,144,18,"TM 144","-","AC Mailand",null,":"]
[null,null,null,null,null,null,1984,8,9,"RB Leipzig","-","FC Barcelona",null,":"]
[null,null,null,null,null,null,1985,50,131,"TM 50","-","TM 131",null,":"]
[null,null,null,null,null,null,1986,90,54,{"$f":"IFERROR(VLOOKUP($H1991,$B$6:$C$205,2,0),\"\")","v":"TM 90"},"-",{"$f":"IFERROR(VLOOKUP($I1991,$B$6:$C$205,2,0),\"\")","v":"TM 54"},null,":"]
[null,null,null,null,null,null,1987,147,171,"TM 147","-","TM 171",null,":"]
[null,null,null,null,null,null,1988,174,92,"TM 174","-","TM 92",null,":"]
[null,null,null,null,null,null,1989,169,109,"TM 169","-","TM 109",null,":"]
[null,null,null,null,null,null,1990,36,44,"Mainz 05","-","TM 44",null,":"]
[null,null,null,null,null,null,1991,195,183,"TM 195","-","TM 183",null,":"]
[null,null,null,null,null,null,1992,188,148,"TM 188","-","TM 148",null,":"]
[null,null,null,null,null,null,1993,62,25,"TM 62","-","OSC Lille",null,":"]
[null,null,null,null,null,null,1994,129,42,"TM 129","-","TM 42",null,":"]
[null,null,null,null,null,null,1995,11,13,"Atletico Madrid","-","Juventus Turin",null,":"]
[null,null,null,null,null,null,1996,197,112,"TM 197","-","TM 112",null,":"]
[null,null,null,null,null,null,1997,177,77,"TM 177","-","TM 77",null,":"]
[null,null,null,null,null,null,1998,132,130,"TM 132","-","TM 130",null,":"]
[null,null,null,null,null,null,1999,117,88,"TM 117","-","TM 88",null,":"]
[null,null,null,null,null,null,2000,120,140,"TM 120","-","TM 140",null,":"]